{"text_format":"3","workbook":"xlsx","n_sheets":9,"sheets":["Setup","Guidelines","Inputs_Rec.","Param","Translate","Dashboard_Structures","Dashboard_Domains","Dashboard_Rec","Pendings"],"not_rendered":{"images":2,"macros":1,"external_links":1,"defined_names":7,"comments":1},"read":"whole","date_system":"1900"}

{"sheet":"Setup","index":0,"n_rows":151,"n_cols":30,"rows_kept":151,"merged":[[0,2,0,13],[7,10,7,13],[10,4,10,7],[10,11,16,12],[13,4,13,7],[15,4,15,7],[21,10,22,13],[22,2,23,3],[22,4,23,7],[25,2,26,3],[25,4,26,7]]}
[null,null,{"$f":"IF(F9=1,Translate!B81,Translate!C81)","v":"OUTIL STANDARD DE SUIVI DES MESURES/RECOMMANDATIONS/CONDITIONS/ACTIVITES"}]
[]
[]
[]
[]
[]
[{"$nulls":19},"Select",{"$nulls":4},"Select","Select"]
[{"$nulls":10},"MENU",{"$nulls":4},{"$f":"IF(F9=1,\"Pour toute question\",\"For any request\")","v":"Pour toute question"},{"$nulls":3},"Afghanistan",null,null,"Jour","Day","Mois","Month","Annee","Year"]
[null,null,{"$f":"IF($F$9=1,Translate!B80,Translate!C80)","v":"LANGUE"},null,"Francais",{"$f":"IF(E9=\"Francais\",1,2)","v":1},{"$nulls":10},"Zida Boureima",null,"zidabou@yahoo.fr","Albania",null,null,1,1,"Janvier","January",2014,2014]
[{"$nulls":16},"Ki Abdoulaye",null,"ki.abdoulaye@gmail.com","Algeria",null,null,2,2,"Fevrier","February",2015,2015]
[null,null,{"$f":"IF($F$9=1,Translate!B82,Translate!C82)","v":"PAYS"},null,"Select",{"$nulls":6},{"$f":"IF($F$9=1,Translate!B126,Translate!C126)","v":"Pour choisir le menu, il faut cliquer sur la liste de choix ci-dessous. Cela ouvre automatiquement la feuille excel correspondate"},{"$nulls":7},"Angola",null,null,3,3,"Mars","March",2016,2016]
[{"$nulls":19},"Argentina",null,null,4,4,"Avril","April",2017,2017,null,"Select;Guidelines;Inputs_Rec.;Dashboard_Structures;Dashboard_Domains;Dashaboard_Rec;Pendings"]
[{"$nulls":19},"Armenia",null,null,5,5,"Mai","May",2018,2018]
[null,null,{"$f":"IF($F$9=1,Translate!B95,Translate!C95)","v":"SUBVENTION"},{"$nulls":16},"Azerbaijan",null,null,6,6,"Juin","June",2019,2019]
[{"$nulls":19},"Bangladesh",null,null,7,7,"Juillet","July",2020,2020]
[null,null,{"$f":"IF($F$9=1,Translate!B83,Translate!C83)","v":"NOM DU PR"},{"$nulls":16},"Belarus",null,null,8,8,"Août","August",2021,2021]
[{"$nulls":19},"Belize",null,null,9,9,"Septembre","September",2022,2022]
[{"$nulls":19},"Benin",null,null,10,10,"Octobre","October",2023,2023]
[null,null,{"$f":"IF($F$9=1,Translate!B84,Translate!C84)","v":"DATE  DEBUT SUBVENTION"},{"$nulls":16},"Bolivia (Plurinational State)",null,null,11,11,"Novembre","November",2024,2024]
[{"$nulls":19},"Bosnia and Herzegovina",null,null,12,12,"Décembre","December",2025,2025]
[{"$nulls":4},"Day","Month","Year",{"$nulls":12},"Brazil",null,null,13,13]
[{"$nulls":10},"Inputs_Rec.",{"$nulls":8},"Bulgaria",null,null,14,14]
[null,null,{"$f":"IF($F$9=1,Translate!B97,Translate!C97)","v":"GESTIONNAIRE PR"},{"$nulls":16},"Burkina Faso",null,null,15,15]
[{"$nulls":19},"Burundi",null,null,16,16]
[{"$nulls":19},"Buthan",null,null,17,17]
[null,null,{"$f":"IF($F$9=1,Translate!B96,Translate!C96)","v":"RESPONSABLE DE LA BONNE TENUE DU FICHIER"},{"$nulls":16},"Cambodia",null,null,18,18]
[{"$nulls":19},"Cameroon",null,null,19,19]
[null,null,{"$f":"IF(F9=1,\"Pour toute question\",\"For any request\")","v":"Pour toute question"},{"$nulls":16},"Cape Verde",null,null,20,20]
[null,null,"Zida Boureima",null,"zidabou@sapsapservices.com",{"$nulls":14},"Central African Republic",null,null,21,21]
[{"$nulls":19},"Chad",null,null,22,22]
[{"$nulls":19},"Chile",null,null,23,23]
[{"$nulls":19},"China",null,null,24,24]
[{"$nulls":19},"Colombia",null,null,25,25]
[{"$nulls":19},"Comoros",null,null,26,26]
[{"$nulls":19},"Congo",null,null,27,27]
[{"$nulls":19},"Congo (Democratic Republic)",null,null,28,28]
[{"$nulls":19},"Costa Rica",null,null,29,29]
[{"$nulls":19},"Cote d'Ivoire",null,null,30,30]
[{"$nulls":19},"Croatia",null,null,31,31]
[{"$nulls":19},"Cuba"]
[{"$nulls":19},"Djibouti"]
[{"$nulls":19},"Dominican Republic"]
[{"$nulls":19},"Ecuador"]
[{"$nulls":19},"Egypt"]
[{"$nulls":19},"El Salvador"]
[{"$nulls":19},"Equatorial Guinea"]
[{"$nulls":19},"Eritrea"]
[{"$nulls":19},"Estonia"]
[{"$nulls":19},"Ethipia"]
[{"$nulls":19},"Fiji"]
[{"$nulls":19},"Gabon"]
[{"$nulls":19},"Gambia"]
[{"$nulls":19},"Georgia"]
[{"$nulls":19},"Ghana"]
[{"$nulls":19},"Guatemala"]
[{"$nulls":19},"Guinea"]
[{"$nulls":19},"Guinea-Bissau"]
[{"$nulls":19},"Guyana"]
[{"$nulls":19},"Haiti"]
[{"$nulls":19},"Honduras"]
[{"$nulls":19},"India"]
[{"$nulls":19},"Indonesia"]
[{"$nulls":19},"Iran (Islamic Republic)"]
[{"$nulls":19},"Iraq"]
[{"$nulls":19},"Jamaica"]
[{"$nulls":19},"Jordan"]
[{"$nulls":19},"Kazakhstan"]
[{"$nulls":19},"Kenya"]
[{"$nulls":19},"Korea (Democratic Peoples Republic)"]
[{"$nulls":19},"Kosovo"]
[{"$nulls":19},"Kyrgyzstan"]
[{"$nulls":19},"Lao (Peoples Democratic Republic)"]
[{"$nulls":19},"Lesotho"]
[{"$nulls":19},"Liberia"]
[{"$nulls":19},"Lutheran World Federation"]
[{"$nulls":19},"Macedonia (Former Yugoslav Republic)"]
[{"$nulls":19},"Madagascar"]
[{"$nulls":19},"Malawi"]
[{"$nulls":19},"Malaysia"]
[{"$nulls":19},"Maldives"]
[{"$nulls":19},"Mali"]
[{"$nulls":19},"Mauritania"]
[{"$nulls":19},"Mauritius"]
[{"$nulls":19},"Mexico"]
[{"$nulls":19},"Moldavia"]
[{"$nulls":19},"Mongolia"]
[{"$nulls":19},"Montenegro"]
[{"$nulls":19},"Morocco"]
[{"$nulls":19},"Mozambique"]
[{"$nulls":19},"Multicountry Africa (RMCC)"]
[{"$nulls":19},"Multicountry Africa (SADC)"]
[{"$nulls":19},"Multicountry Americas (Andean)"]
[{"$nulls":19},"Multicountry Americas (CARICOM/PANCAP)"]
[{"$nulls":19},"Multicountry Americas (COPRECOS)"]
[{"$nulls":19},"Multicountry Americas (CRN+)"]
[{"$nulls":19},"Multicountry Americas (Meso)"]
[{"$nulls":19},"Multicountry Americas (OECS)"]
[{"$nulls":19},"Multicountry Americas (REDCA+)"]
[{"$nulls":19},"Multicountry Americas (REDTRASEX)"]
[{"$nulls":19},"Multicountry East Asia and Pacific (APN+)"]
[{"$nulls":19},"Multicountry East Asia and Pacific (RAI)"]
[{"$nulls":19},"Multicountry East Asia and Pacific (SEAN-HIVOS)"]
[{"$nulls":19},"Multicountry Eastern Europe- Central Aisa (EHRN)"]
[{"$nulls":19},"Multicountry Middle East-North Africa (MENAHRA)"]
[{"$nulls":19},"Multicountry South Asia"]
[{"$nulls":19},"Multicountry Western Pacific"]
[{"$nulls":19},"Myanmar"]
[{"$nulls":19},"Namibia"]
[{"$nulls":19},"Nepal"]
[{"$nulls":19},"Nicaragua"]
[{"$nulls":19},"Niger"]
[{"$nulls":19},"Nigeria"]
[{"$nulls":19},"Pakistan"]
[{"$nulls":19},"Palestine"]
[{"$nulls":19},"Panama"]
[{"$nulls":19},"Papua New Guinea"]
[{"$nulls":19},"Peru"]
[{"$nulls":19},"Philippines"]
[{"$nulls":19},"Romania"]
[{"$nulls":19},"Russian Federation"]
[{"$nulls":19},"Rwanda"]
[{"$nulls":19},"Sao Tome and Principe"]
[{"$nulls":19},"Senegal"]
[{"$nulls":19},"Serbia"]
[{"$nulls":19},"Sierra Leone"]
[{"$nulls":19},"Solomon Islands"]
[{"$nulls":19},"South Africa"]
[{"$nulls":19},"South Sudan"]
[{"$nulls":19},"Sri Lanka"]
[{"$nulls":19},"Sudan"]
[{"$nulls":19},"Suriname"]
[{"$nulls":19},"Swaziland"]
[{"$nulls":19},"Switzerland"]
[{"$nulls":19},"Syrian Arab Republic"]
[{"$nulls":19},"Tajikistan"]
[{"$nulls":19},"Tanzania (United Republic)"]
[{"$nulls":19},"Thailand"]
[{"$nulls":19},"Timor-Leste"]
[{"$nulls":19},"Togo"]
[{"$nulls":19},"Tunusia"]
[{"$nulls":19},"Turkey"]
[{"$nulls":19},"Turkmenistan"]
[{"$nulls":19},"Uganda"]
[{"$nulls":19},"Ukraine"]
[{"$nulls":19},"Uruguay"]
[{"$nulls":19},"Uzbekistan"]
[{"$nulls":19},"Viet Nam"]
[{"$nulls":19},"Yemen"]
[{"$nulls":19},"Zambia"]
[{"$nulls":19},"Zanzibar"]
[{"$nulls":19},"Zimbabwe"]

{"sheet":"Guidelines","index":1,"n_rows":83,"n_cols":25,"rows_kept":83,"merged":[[0,0,0,11],[2,9,2,11],[4,1,5,7],[32,1,32,2],[32,4,32,7],[34,1,34,2],[34,4,34,7],[36,1,36,2],[36,4,36,7],[38,1,38,2],[38,4,38,7],[40,1,40,2],[40,4,40,7],[42,1,42,2],[42,4,42,7],[44,1,44,2],[44,4,44,7],[46,1,46,2],[46,4,46,7],[48,1,48,2],[48,4,48,7],[50,1,50,2],[50,4,50,7],[52,1,52,2],[52,4,52,7],[54,1,54,2],[54,4,54,7],[56,1,56,2],[56,4,56,7],[58,1,58,2],[58,4,58,7],[60,1,60,2],[60,4,60,7],[62,1,62,2],[62,4,62,7],[64,1,64,2],[66,1,66,2],[68,1,68,2],[70,1,70,2]]}
[{"$f":"IF(Setup!E9=1,Translate!B125,Translate!C125)","v":"GUIDELINES"}]
[]
[null,{"$f":"IF(Setup!$F$9=1,Translate!B4,Translate!C4)","v":"Instructions globales"},{"$nulls":7},{"$f":"IF(Setup!$F$9=1,Translate!B22,Translate!C22)","v":"Liste des structures/personnes intervenant "}]
[]
[null,{"$f":"IF(Setup!$F$9=1,Translate!B5,Translate!C5)","v":"Ce fichier est destiné aux structures mettant en œuvre des activités du Fonds mondial. Il permet de suivre la mise en œuvre des recommandations/mesures et permet de remplir la feuille \"Gestion subvention_4\" du PU/PUDR"},{"$nulls":7},"1-","CNLS"]
[]
[null,{"$f":"IF(Setup!$F$9=1,Translate!B7,Translate!C7)","v":"Pour utiliser ce fichier, voici les instructions (les colonnes B, C, D, E, F, H, I, J, N et O sont a remplir obligatoirement)"},{"$nulls":7},"2-","PNLS"]
[null,{"$f":"IF(Setup!$F$9=1,Translate!B8,Translate!C8)","v":"a) Paramétrer ci-dessous au besoin la nature de l'état de réalisation et ou le type de mesures/recommandations"}]
[null,{"$f":"IF(Setup!$F$9=1,Translate!B9,Translate!C9)","v":"b) Se rendre au niveau de la Feuille \" Inputs_Rec.\". A ce niveau procéder comme suit (remplir toutes les 11 étapes):"},{"$nulls":7},"3-"]
[null,null,{"$f":"IF(Setup!$F$9=1,Translate!B10,Translate!C10)","v":"b.1) Ecrire/saisir ou y copier l'intitule de la mesures/recommandations a la colonne B"}]
[null,null,{"$f":"IF(Setup!$F$9=1,Translate!B11,Translate!C11)","v":"b.2) Préciser la nature ou le type de mesures/recommandations (liste de choix) dans la colonne C"},{"$nulls":6},"4-"]
[null,null,{"$f":"IF(Setup!$F$9=1,Translate!B12,Translate!C12)","v":"b.3) Préciser le domaine concerne par mesures/recommandations (liste de choix) dans la colonne D"}]
[null,null,{"$f":"IF(Setup!$F$9=1,Translate!B13,Translate!C13)","v":"b.4) Préciser l'origine de la mesure/recommandation (liste de choix) dans la colonne E"},{"$nulls":6},"5-",{"$nulls":4},"Conditions de l’accord"]
[null,null,{"$f":"IF(Setup!$F$9=1,Translate!B14,Translate!C14)","v":"b.5) Préciser la structure responsable de mise en œuvre de  la mesure/recommandation (liste de choix) dans la colonne F"},{"$nulls":11},"2.       Mesures de gestion"]
[null,null,{"$f":"IF(Setup!$F$9=1,Translate!B15,Translate!C15)","v":"b.6) Préciser l'appartenance de la structure (structure publique, association…) dans la colonne G"},{"$nulls":6},"6-",{"$nulls":4},"3.       Recommandations OIG"]
[null,null,{"$f":"IF(Setup!$F$9=1,Translate!B16,Translate!C16)","v":"b.7) Préciser les structures impliquées dans la mise en œuvre des mesures/recommandations (a saisir) dans la colonne H"},{"$nulls":11},"4.       Autres recommandations (CCM, Audit, études, OSDV, études, etc.). Par ailleurs, généralement le fonds mondial intègre les recommandations de l’audit et de l’OSDV dans les mesures de gestions, mais ce n’est pas grave."]
[null,null,{"$f":"IF(Setup!$F$9=1,Translate!B17,Translate!C17)","v":"b.8) Préciser la date butoir (deadline) pour la mise en œuvre de la mesure/recommandation (a saisir) dans la colonne I"},{"$nulls":6},"7-"]
[null,null,{"$f":"IF(Setup!$F$9=1,Translate!B18,Translate!C18)","v":"b.9) Actualiser régulièrement l'état des mesures/recommandations (liste de choix) dans la colonne J"}]
[null,null,{"$f":"IF(Setup!$F$9=1,Translate!B19,Translate!C19)","v":"b.10) Identifier les produits qui doivent servir a lever les recommandations/Mesures dans la colonne N"},{"$nulls":6},"8-"]
[null,null,{"$f":"IF(Setup!$F$9=1,Translate!B20,Translate!C20)","v":"b.11) Actualiser régulièrement les commentaires sur la mise en œuvre des mesures/recommandations dans la colonne O"}]
[null,{"$f":"IF(Setup!$F$9=1,Translate!B21,Translate!C21)","v":"c) Les résultats sont automatiques de la synthèse est automatique et consultables dans lieux ci-dessous"},{"$nulls":7},"9-"]
[]
[{"$nulls":9},"10-"]
{"$rows_empty":9}
[null,{"$f":"IF(Setup!$F$9=1,Translate!B26,Translate!C26)","v":"Paramétrage état de mise en œuvre"},null,null,{"$f":"IF(Setup!$F$9=1,Translate!B39,Translate!C39)","v":"Paramétrage des types de mesures/recommandations"},{"$nulls":4},"Struct.-10",{"$nulls":14},{"$f":"B57","v":"Fonds Mondial"}]
[{"$nulls":24},{"$f":"B59","v":"ICN/CCM"}]
[null,"Réalisée",null,null,{"$f":"IF(Setup!$F$9=1,Translate!B40,Translate!C40)","v":"Condition de l'accord "},{"$nulls":4},"Struct.-11",{"$nulls":14},{"$f":"B61","v":"PR"}]
[{"$nulls":24},{"$f":"B63","v":"SR"}]
[null,"En cours/toujours valide",null,null,{"$f":"IF(Setup!$F$9=1,Translate!B41,Translate!C41)","v":"Mesures de gestion"},{"$nulls":4},"Struct.-12",{"$nulls":14},{"$f":"B65","v":"Agent local du Fonds (LFA)"}]
[{"$nulls":24},{"$f":"B67","v":"Agent fiscal"}]
[null,"Non Réalisée",null,null,{"$f":"IF(Setup!$F$9=1,Translate!B42,Translate!C42)","v":"Recommandations OIG"},{"$nulls":4},"Struct.-13",{"$nulls":14},{"$f":"B69","v":"Ministere de la sante"}]
[{"$nulls":24},{"$f":"B71","v":"Autres"}]
[null,"Non applicable",null,null,{"$f":"IF(Setup!$F$9=1,Translate!B43,Translate!C43)","v":"Actions/recommandations Equipe pays"},{"$nulls":4},"Struct.-14"]
[]
[null,"Immediat (en cours)",null,null,{"$f":"IF(Setup!$F$9=1,Translate!B44,Translate!C44)","v":"Actions suite revue PU/PUDR"},{"$nulls":4},"Struct.-15"]
[]
[null,"Immediat (realise)",null,null,{"$f":"IF(Setup!$F$9=1,Translate!B45,Translate!C45)","v":"Actions/Recommandations LFA"},{"$nulls":4},"Struct.-16"]
[{"$nulls":12},"Select","Select",null,"Select","Selectionner"]
[null,"Immediat (non realise)",null,null,{"$f":"IF(Setup!$F$9=1,Translate!B46,Translate!C46)","v":"Actions/recommandations ICN"},{"$nulls":4},"Struct.-17",null,null,{"$f":"K5","v":"CNLS"},{"$f":"E35","v":"Condition de l'accord "},null,{"$f":"K5","v":"CNLS"},{"$f":"B35","v":"Réalisée"}]
[{"$nulls":12},{"$f":"K7","v":"PNLS"},{"$f":"E37","v":"Mesures de gestion"},null,{"$f":"K7","v":"PNLS"},{"$f":"B37","v":"En cours/toujours valide"}]
[null,"Sans delai (en cours)",null,null,{"$f":"IF(Setup!$F$9=1,Translate!B47,Translate!C47)","v":"Recommandations du PR vers les SR"},{"$nulls":4},"Struct.-18",null,null,{"$f":"K9","v":0},{"$f":"E39","v":"Recommandations OIG"},null,{"$f":"K9","v":0},{"$f":"B39","v":"Non Réalisée"}]
[{"$nulls":12},{"$f":"K11","v":0},{"$f":"E41","v":"Actions/recommandations Equipe pays"},null,{"$f":"K11","v":0},{"$f":"B41","v":"Non applicable"}]
[null,"Sans delai (realise)",null,null,{"$f":"IF(Setup!$F$9=1,Translate!B48,Translate!C48)","v":"Actions/recommandations d'audit interne"},{"$nulls":4},"Struct.-19",null,null,{"$f":"K13","v":0},{"$f":"E43","v":"Actions suite revue PU/PUDR"},null,{"$f":"K13","v":0},{"$f":"B43","v":"Immediat (en cours)"}]
[{"$nulls":12},{"$f":"K15","v":0},{"$f":"E45","v":"Actions/Recommandations LFA"},null,{"$f":"K15","v":0},{"$f":"B45","v":"Immediat (realise)"}]
[null,"Sans delai (non realise)",null,null,{"$f":"IF(Setup!$F$9=1,Translate!B49,Translate!C49)","v":"Actions/recommandations d'audit externe"},{"$nulls":4},"Struct.-20",null,null,{"$f":"K17","v":0},{"$f":"E47","v":"Actions/recommandations ICN"},null,{"$f":"K17","v":0},{"$f":"B47","v":"Immediat (non realise)"}]
[{"$nulls":12},{"$f":"K19","v":0},{"$f":"E49","v":"Recommandations du PR vers les SR"},null,{"$f":"K19","v":0},{"$f":"B49","v":"Sans delai (en cours)"}]
[null,"Parametrage origine Activites/rec.",null,null,{"$f":"IF(Setup!$F$9=1,Translate!B50,Translate!C50)","v":"Autres"},{"$nulls":4},"Struct.-21",null,null,{"$f":"K21","v":0},{"$f":"E51","v":"Actions/recommandations d'audit interne"},null,{"$f":"K21","v":0},{"$f":"B51","v":"Sans delai (realise)"}]
[{"$nulls":12},{"$f":"K23","v":0},{"$f":"E53","v":"Actions/recommandations d'audit externe"},null,{"$f":"K23","v":0},{"$f":"B53","v":"Sans delai (non realise)"}]
[null,{"$f":"IF(Setup!$F$9=1,Translate!B98,Translate!C98)","v":"Fonds Mondial"},{"$nulls":7},"Struct.-22",null,null,{"$f":"K75","v":0},{"$f":"E55","v":"Autres"},null,{"$f":"K33","v":0}]
[{"$nulls":12},{"$f":"K77","v":0},{"$f":"E57","v":0},null,{"$f":"K35","v":0}]
[null,{"$f":"IF(Setup!$F$9=1,Translate!B99,Translate!C99)","v":"ICN/CCM"},{"$nulls":7},"Struct.-23",null,null,{"$f":"K79","v":0},{"$f":"E59","v":0},null,{"$f":"K37","v":0}]
[{"$nulls":12},{"$f":"K81","v":0},{"$f":"E61","v":0},null,{"$f":"K39","v":0}]
[null,{"$f":"IF(Setup!$F$9=1,Translate!B100,Translate!C100)","v":"PR"},{"$nulls":7},"Struct.-24",null,null,{"$f":"K83","v":0},{"$f":"E63","v":0},null,{"$f":"K41","v":0}]
[{"$nulls":12},{"$f":"K43","v":0},null,null,{"$f":"K43","v":0}]
[null,{"$f":"IF(Setup!$F$9=1,Translate!B101,Translate!C101)","v":"SR"},{"$nulls":7},"Struct.-25",null,null,{"$f":"K45","v":0}]
[{"$nulls":12},{"$f":"K47","v":0}]
[null,{"$f":"IF(Setup!$F$9=1,Translate!B102,Translate!C102)","v":"Agent local du Fonds (LFA)"},{"$nulls":10},{"$f":"K49","v":0}]
[{"$nulls":12},{"$f":"K51","v":0}]
[null,{"$f":"IF(Setup!$F$9=1,Translate!B103,Translate!C103)","v":"Agent fiscal"},{"$nulls":10},{"$f":"K53","v":0}]
[{"$nulls":12},{"$f":"K55","v":0}]
[null,{"$f":"IF(Setup!$F$9=1,Translate!B104,Translate!C104)","v":"Ministere de la sante"},{"$nulls":10},{"$f":"K57","v":0}]
[{"$nulls":12},{"$f":"K59","v":0}]
[null,{"$f":"IF(Setup!$F$9=1,Translate!B106,Translate!C106)","v":"Autres"},{"$nulls":10},{"$f":"K61","v":0}]
[{"$nulls":12},{"$f":"K63","v":0}]
[]
[]
[{"$nulls":9},"11-"]
[]
[{"$nulls":9},"12-"]
[]
[{"$nulls":9},"13-"]
[]
[{"$nulls":9},"14-"]
[]
[{"$nulls":9},"15-"]

{"sheet":"Inputs_Rec.","index":2,"n_rows":400,"n_cols":113,"rows_kept":400,"merged":[[0,0,0,14],[1,1,3,1],[3,43,3,58],[3,60,3,66],[3,70,3,78],[3,80,3,84]]}
[{"$f":"IF(Setup!E9=1,Translate!B111,Translate!C111)","v":"ENTRY AND MONITORING OF MEASURES / RECOMMENDATIONS"}]
[null,"SUIVI DE MISE EN ŒUVRE DES ACTIVITES \nET RECOMMANDATIONS",{"$nulls":18},"Select",1]
[{"$nulls":20},"Réalisée",0]
[{"$nulls":20},"En cours/toujours valide",1,{"$nulls":21},"nombre activites/liste des structures",{"$nulls":16},"Liste realisation",{"$nulls":9},"Realiation par types de mesures/activites",{"$nulls":9},"realisation par domaine"]
[null,{"$f":"IF(Setup!$F$9=1,Translate!B54,Translate!C54)","v":"Décisions, Mesures, Recommandations"},{"$f":"IF(Setup!$F$9=1,Translate!B55,Translate!C55)","v":"Type/Nature "},{"$f":"IF(Setup!$F$9=1,Translate!B56,Translate!C56)","v":"Domaines"},{"$f":"IF(Setup!$F$9=1,Translate!B57,Translate!C57)","v":"Origine"},{"$f":"IF(Setup!$F$9=1,Translate!B58,Translate!C58)","v":"Responsable de mise en œuvre"},{"$f":"IF(Setup!$F$9=1,Translate!B59,Translate!C59)","v":"Nature de la structure responsable"},{"$f":"IF(Setup!$F$9=1,Translate!B60,Translate!C60)","v":"Personnes/ structures  Impliquées"},{"$f":"IF(Setup!$F$9=1,Translate!B61,Translate!C61)","v":"Date butoir (Dernier délai)"},{"$f":"IF(Setup!$F$9=1,Translate!B62,Translate!C62)","v":"Etat de mise en œuvre "},null,null,{"$f":"IF(Setup!$F$9=1,Translate!B63,Translate!C63)","v":"Jours restants/ dépassés"},{"$f":"IF(Setup!$F$9=1,Translate!B64,Translate!C64)","v":"Eléments de vérification de la réalisation"},{"$f":"IF(Setup!$F$9=1,Translate!B65,Translate!C65)","v":"Observations/ Commentaires/ Explications"},{"$nulls":5},"Non Réalisée",1,null,"FM","CCM","PNLIT","MSP","DPML","DNSIS","Autres",null,"delai dépassé","dans les délais","résult_délai","reste 2 semaines","Reste +2 semaines",{"$nulls":7},{"$f":"AN375","v":"CNLS"},{"$f":"AN376","v":"PNLS"},{"$f":"AN377","v":0},{"$f":"AN378","v":0},{"$f":"AN379","v":0},{"$f":"AN380","v":0},{"$f":"AN381","v":0},{"$f":"AN382","v":0},{"$f":"AN383","v":0},{"$f":"AN384","v":0},{"$f":"AN385","v":0},{"$f":"AN386","v":0},{"$f":"AN387","v":0},{"$f":"AN388","v":0},{"$f":"AN389","v":0},{"$f":"AN390","v":0},"Total activite",{"$f":"IF(Setup!$F$9=1,Translate!B28,Translate!C28)","v":"Satisfait"},{"$f":"IF(Setup!$F$9=1,Translate!B29,Translate!C29)","v":"Non satisfaite-en cours"},{"$f":"IF(Setup!$F$9=1,Translate!B30,Translate!C30)","v":"Non satisfaite - Non commencée"},{"$f":"IF(Setup!$F$9=1,Translate!B31,Translate!C31)","v":"Non commencé"},{"$f":"IF(Setup!$F$9=1,Translate!B32,Translate!C32)","v":"Non applicable/Non valable"},{"$f":"IF(Setup!$F$9=1,Translate!B33,Translate!C33)","v":"Immédiat (réalisé)"},{"$f":"IF(Setup!$F$9=1,Translate!B38,Translate!C38)","v":"Delai depasse"},null,"Critere prise en compte",null,{"$f":"Guidelines!N47","v":"Condition de l'accord "},{"$f":"Guidelines!N48","v":"Mesures de gestion"},{"$f":"Guidelines!N49","v":"Recommandations OIG"},{"$f":"Guidelines!N50","v":"Actions/recommandations Equipe pays"},{"$f":"Guidelines!N51","v":"Actions suite revue PU/PUDR"},{"$f":"Guidelines!N52","v":"Actions/Recommandations LFA"},{"$f":"Guidelines!N53","v":"Actions/recommandations ICN"},{"$f":"Guidelines!N54","v":"Recommandations du PR vers les SR"},{"$f":"Guidelines!N55","v":"Actions/recommandations d'audit interne"},{"$f":"Guidelines!N56","v":"Actions/recommandations d'audit externe"},{"$f":"Dashboard_Domains!M3","v":"Gestion du programme"},{"$f":"Dashboard_Domains!M4","v":"Gouvernance nationale"},{"$f":"Dashboard_Domains!M5","v":"Suivi evaluation"},{"$f":"Dashboard_Domains!M6","v":"Gestion des achats/stocks"},{"$f":"Dashboard_Domains!M7","v":"Finances"},{"$f":"Dashboard_Domains!M8","v":"Autres"},"< 2 semaines","> 2 semaines",null,{"$f":"AN391","v":0},{"$f":"AN392","v":0},{"$f":"AN393","v":0},{"$f":"AN394","v":0},{"$f":"AN395","v":0},{"$f":"AN396","v":0},{"$f":"AN397","v":0},{"$f":"AN398","v":0},{"$f":"AN399","v":0},{"$f":"AN400","v":0},{"$f":"AN400","v":0},null,{"$f":"IF(Setup!$F$9=1,Translate!B34,Translate!C34)","v":"Immédiat (non réalisé)"},{"$f":"IF(Setup!$F$9=1,Translate!B35,Translate!C35)","v":"Sans délai (en cours)"},{"$f":"IF(Setup!$F$9=1,Translate!B36,Translate!C36)","v":"Sans délai (réalisé)"},{"$f":"IF(Setup!$F$9=1,Translate!B37,Translate!C37)","v":"Sans délai (non réalisé)"}]
[{"$f":"IF(OR(J6=Translate!$B$27,OR(J6=Translate!$C$27,OR(J6=Translate!$C$28,OR(J6=Translate!$B$28)))),\"\",DB6)","v":1},"fgyuhijok","Condition de l'accord ","Gouvernance nationale","Fonds Mondial","CNLS","Public institution","ghjk","2018-11-20","Non satisfaite-en cours",{"$f":"TODAY()","v":"2022-03-09"},{"$f":"IF(OR(I6=\"\",OR(J6=$R$14,OR(J6=$R$9))),\"\",I6-K6)","v":{"v":-1205,"d":"-1,205"}},{"$f":"IF(BR6=1,L6,\"\")","v":{"v":-1205,"d":"-1,205"}},{"$nulls":7},"Non applicable",1,{"$f":"IF(B6=\"\",\"\",1)","v":1},{"$f":"IF(E6=\"Fonds Mondial\",W6,\"\")","v":1},{"$f":"IF(E6=\"CCM\",W6,\"\")","v":""},{"$f":"IF(E6=\"PNLIT\",W6,\"\")","v":""},{"$f":"IF(E6=\"MSP\",W6,\"\")","v":""},{"$f":"IF(E6=\"DPML\",W6,\"\")","v":""},{"$f":"IF(E6=\"DNSIS\",W6,\"\")","v":""},{"$f":"IF(E6=\"Autres\",W6,\"\")","v":""},null,{"$f":"IF(M6<0,1,\"\")","v":1},{"$f":"IF(AND(J6=\"Réalisée\",AND(M6=\"\")),1,0)","v":0},{"$f":"IF(J6=\"Réalisée\",AG6,\"\")","v":""},{"$f":"IF(AND(M6>0,M6<15),1,\"\")","v":""},{"$f":"IF(AND(J6=\"En cours\",AND(M6>14)),1,0)","v":0},{"$nulls":7},{"$f":"IF(AND(F6=$AR$5,AND(BQ6=1)),1,\"\")","v":1},{"$f":"IF(AND(F6=$AS$5,AND(BQ6=1)),1,\"\")","v":""},{"$f":"IF(AND(F6=$AT$5,AND(BQ6=1)),1,\"\")","v":""},{"$f":"IF(AND(F6=$AU$5,AND(BQ6=1)),1,\"\")","v":""},{"$f":"IF(AND(F6=$AV$5,AND(BQ6=1)),1,\"\")","v":""},{"$f":"IF(AND(F6=$AW$5,AND(BQ6=1)),1,\"\")","v":""},{"$f":"IF(AND(F6=$AX$5,AND(BQ6=1)),1,\"\")","v":""},{"$f":"IF(AND(F6=$AY$5,AND(BQ6=1)),1,\"\")","v":""},{"$f":"IF(AND(F6=$AZ$5,AND(BQ6=1)),1,\"\")","v":""},{"$f":"IF(AND(F6=$BA$5,AND(BQ6=1)),1,\"\")","v":""},{"$f":"IF(AND(F6=$BB$5,AND(BQ6=1)),1,\"\")","v":""},{"$f":"IF(AND(F6=$BC$5,AND(BQ6=1)),1,\"\")","v":""},{"$f":"IF(AND(F6=$BD$5,AND(BQ6=1)),1,\"\")","v":""},{"$f":"IF(AND(F6=$BE$5,AND(BQ6=1)),1,\"\")","v":""},{"$f":"IF(AND(F6=$BF$5,AND(BQ6=1)),1,\"\")","v":""},{"$f":"IF(AND(F6=$BG$5,AND(BQ6=1)),1,\"\")","v":""},{"$f":"BQ6","v":1},{"$f":"IF(AND(J6=$BI$5,AND(BQ6=1)),1,\"\")","v":""},{"$f":"IF(AND(J6=$BJ$5,AND(BQ6=1)),1,\"\")","v":1},{"$f":"IF(AND(J6=$BK$5,AND(BQ6=1)),1,\"\")","v":""},{"$f":"IF(AND(J6=$BL$5,AND(BQ6=1)),1,\"\")","v":""},{"$f":"IF(AND(J6=$BM$5,AND(BQ6=1)),1,\"\")","v":""},{"$f":"IF(AND(J6=$BN$5,AND(BQ6=1)),1,\"\")","v":""},{"$f":"IF(M6<0,1,\"\")","v":1},{"$f":"IF(OR(J6=$BI$5,OR(J6=$BN$5,OR(J6=$CZ$5))),1,0)","v":0},{"$f":"IF(OR(B6=\"\",OR(C6=\"Select\",OR(E6=\"Select\",OR(F6=\"Select\",OR(I6=\"\",OR(D6=\"Select\",OR(J6=\"Select\"))))))),0,1)","v":1},{"$f":"IF(OR(J6=$BI$5,OR(J6=$BM$5,OR(J6=$R$10,OR(J6=$R$15,OR(J6=$R$18))))),\"\",BQ6)","v":1},{"$f":"IF(D6=$CC$5,1,\"\")","v":""},{"$f":"IF(C6=$BT$5,1,\"\")","v":""},{"$f":"IF(C6=$BU$5,1,\"\")","v":""},{"$f":"IF(C6=$BV$5,1,\"\")","v":""},{"$f":"IF(C6=$BW$5,1,\"\")","v":""},{"$f":"IF(C6=$BX$5,1,\"\")","v":""},{"$f":"IF(C6=$BY$5,1,\"\")","v":""},{"$f":"IF(C6=$BZ$5,1,\"\")","v":""},{"$f":"IF(C6=$CA$5,1,\"\")","v":""},{"$f":"IF(C6=$CB$5,1,\"\")","v":""},{"$f":"IF(D6=$CC$5,1,\"\")","v":""},{"$f":"IF(D6=$CD$5,1,\"\")","v":1},{"$f":"IF(D6=$CE$5,1,\"\")","v":""},{"$f":"IF(D6=$CF$5,1,\"\")","v":""},{"$f":"IF(D6=$CG$5,1,\"\")","v":""},{"$f":"IF(D6=$CH$5,1,\"\")","v":""},{"$f":"IF(AND(M6>0,M6<15),1,\"\")","v":""},{"$f":"IF((M6>14),1,0)*CK6","v":0},{"$f":"IF(M6=\"\",0,1)","v":1},{"$f":"IF(AND(F6=$CL$5,AND(BQ6=1)),1,\"\")","v":""},{"$f":"IF(AND(F6=$CM$5,AND(BQ6=1)),1,\"\")","v":""},{"$f":"IF(AND(F6=$CN$5,AND(BQ6=1)),1,\"\")","v":""},{"$f":"IF(AND(F6=$CO$5,AND(BQ6=1)),1,\"\")","v":""},{"$f":"IF(AND(F6=$CP$5,AND(BQ6=1)),1,\"\")","v":""},{"$f":"IF(AND(F6=$CQ$5,AND(BQ6=1)),1,\"\")","v":""},{"$f":"IF(AND(F6=$CR$5,AND(BQ6=1)),1,\"\")","v":""},{"$f":"IF(AND(F6=$CS$5,AND(BQ6=1)),1,\"\")","v":""},{"$f":"IF(AND(F6=$CT$5,AND(BQ6=1)),1,\"\")","v":""},{"$f":"IF(AND(F6=$CU$5,AND(BQ6=1)),1,\"\")","v":""},{"$f":"IF(AND(F6=$CV$5,AND(BQ6=1)),1,\"\")","v":""},null,{"$f":"IF(AND(J6=$CX$5,AND(BQ6=1)),1,\"\")","v":""},{"$f":"IF(AND(J6=$CY$5,AND(BQ6=1)),1,\"\")","v":""},{"$f":"IF(AND(J6=$CZ$5,AND(BQ6=1)),1,\"\")","v":""},{"$f":"IF(AND(J6=$DA$5,AND(BQ6=1)),1,\"\")","v":""},1,{"$f":"IF(B6=\"\",\"\",B6)","v":"fgyuhijok"},{"$f":"DF6","v":1},{"$f":"IF(OR(I6=\"\",OR(J6=\"Select\")),\"\",I6)","v":"2018-11-20"},{"$f":"DB6","v":1},{"$f":"IF(F6=\"Select\",\"\",F6)","v":"CNLS"},{"$f":"DF6","v":1},{"$f":"IF(C6=\"Select\",\"\",C6)","v":"Condition de l'accord "}]
[{"$f":"IF(OR(J7=Translate!$B$27,OR(J7=Translate!$C$27,OR(J7=Translate!$C$28,OR(J7=Translate!$B$28)))),\"\",DB7)","v":""},null,"Select","Select","Select","Select","Select",null,null,"Selectionner",{"$f":"TODAY()","v":"2022-03-09"},{"$f":"IF(OR(I7=\"\",OR(J7=$R$14,OR(J7=$R$9))),\"\",I7-K7)","v":""},{"$f":"IF(BR7=1,L7,\"\")","v":""},{"$nulls":7},"Immediat",1,"","","","","","","","",null,{"$f":"IF(M7<0,1,\"\")","v":""},{"$f":"IF(AND(J7=\"Réalisée\",AND(M7=\"\")),1,0)","v":0},{"$f":"IF(J7=\"Réalisée\",AG7,\"\")","v":""},{"$f":"IF(AND(M7>0,M7<15),1,\"\")","v":""},{"$f":"IF(AND(J7=\"En cours\",AND(M7>14)),1,0)","v":0},{"$nulls":7},"","","","","","","","","","","","","","","","",{"$f":"BQ7","v":0},{"$f":"IF(AND(J7=$BI$5,AND(BQ7=1)),1,\"\")","v":""},{"$f":"IF(AND(J7=$BJ$5,AND(BQ7=1)),1,\"\")","v":""},{"$f":"IF(AND(J7=$BK$5,AND(BQ7=1)),1,\"\")","v":""},{"$f":"IF(AND(J7=$BL$5,AND(BQ7=1)),1,\"\")","v":""},{"$f":"IF(AND(J7=$BM$5,AND(BQ7=1)),1,\"\")","v":""},{"$f":"IF(AND(J7=$BN$5,AND(BQ7=1)),1,\"\")","v":""},{"$f":"IF(M7<0,1,\"\")","v":""},{"$f":"IF(OR(J7=$BI$5,OR(J7=$BN$5,OR(J7=$CZ$5))),1,0)","v":0},0,{"$f":"IF(OR(J7=$BI$5,OR(J7=$BM$5,OR(J7=$R$10,OR(J7=$R$15,OR(J7=$R$18))))),\"\",BQ7)","v":0},{"$f":"IF(C7=$BS$5,1,\"\")","v":""},"","","","","","","","","","","","","","","",{"$f":"IF(AND(M7>0,M7<15),1,\"\")","v":""},{"$f":"IF((M7>14),1,0)*CK7","v":0},{"$f":"IF(M7=\"\",0,1)","v":0},"","","","","","","","","","","",null,{"$f":"IF(AND(J7=$CX$5,AND(BQ7=1)),1,\"\")","v":""},{"$f":"IF(AND(J7=$CY$5,AND(BQ7=1)),1,\"\")","v":""},{"$f":"IF(AND(J7=$CZ$5,AND(BQ7=1)),1,\"\")","v":""},{"$f":"IF(AND(J7=$DA$5,AND(BQ7=1)),1,\"\")","v":""},2,{"$f":"IF(B7=\"\",\"\",B7)","v":""},{"$f":"DF7","v":2},{"$f":"IF(OR(I7=\"\",OR(J7=\"Select\")),\"\",I7)","v":""},{"$f":"DB7","v":2},{"$f":"IF(F7=\"Select\",\"\",F7)","v":""},{"$f":"DF7","v":2},{"$f":"IF(C7=\"Select\",\"\",C7)","v":""}]
[{"$f":"IF(OR(J8=Translate!$B$27,OR(J8=Translate!$C$27,OR(J8=Translate!$C$28,OR(J8=Translate!$B$28)))),\"\",DB8)","v":""},null,"Select","Select","Select","Select","Select",null,null,"Selectionner","2022-03-09","","",{"$nulls":7},"Sans delai",1,"","","","","","","","",null,"",0,{"$f":"IF(J8=\"Réalisée\",AG8,\"\")","v":""},"",0,{"$nulls":7},"","","","","","","","","","","","","","","","",0,"","","","","","","",0,0,0,"","","","","","","","","","","","","","","","","",0,0,"","","","","","","","","","","",null,"","","","",3,"",3,"",3,"",3,""]
[{"$f":"IF(OR(J9=Translate!$B$27,OR(J9=Translate!$C$27,OR(J9=Translate!$C$28,OR(J9=Translate!$B$28)))),\"\",DB9)","v":""},null,"Select","Select","Select","Select","Select",null,null,"Selectionner","2022-03-09","","",{"$nulls":4},{"$f":"IF(Setup!$F$9=1,Translate!B27,Translate!C27)","v":"Selectionner"},{"$nulls":4},"","","","","","","","",null,"",0,{"$f":"IF(J9=\"Réalisée\",AG9,\"\")","v":""},"",0,{"$nulls":7},"","","","","","","","","","","","","","","","",0,"","","","","","","",0,0,0,"","","","","","","","","","","","","","","","","",0,0,"","","","","","","","","","","",null,"","","","",4,"",4,"",4,"",4,""]
[{"$f":"IF(OR(J10=Translate!$B$27,OR(J10=Translate!$C$27,OR(J10=Translate!$C$28,OR(J10=Translate!$B$28)))),\"\",DB10)","v":""},null,"Select","Select","Select","Select","Select",null,null,"Selectionner","2022-03-09","","",{"$nulls":4},{"$f":"IF(Setup!$F$9=1,Translate!B28,Translate!C28)","v":"Satisfait"},{"$nulls":4},"","","","","","","","",null,"",0,"","",0,{"$nulls":7},"","","","","","","","","","","","","","","","",0,"","","","","","","",0,0,0,"","","","","","","","","","","","","","","","","",0,0,"","","","","","","","","","","",null,"","","","",5,"",5,"",5,"",5,""]
[{"$f":"IF(OR(J11=Translate!$B$27,OR(J11=Translate!$C$27,OR(J11=Translate!$C$28,OR(J11=Translate!$B$28)))),\"\",DB11)","v":""},null,"Select","Select","Select","Select","Select",null,null,"Selectionner","2022-03-09","","",{"$nulls":4},{"$f":"IF(Setup!$F$9=1,Translate!B29,Translate!C29)","v":"Non satisfaite-en cours"},{"$nulls":4},"","","","","","","","",null,"",0,"","",0,{"$nulls":7},"","","","","","","","","","","","","","","","",0,"","","","","","","",0,0,0,"","","","","","","","","","","","","","","","","",0,0,"","","","","","","","","","","",null,"","","","",6,"",6,"",6,"",6,""]
[{"$f":"IF(OR(J12=Translate!$B$27,OR(J12=Translate!$C$27,OR(J12=Translate!$C$28,OR(J12=Translate!$B$28)))),\"\",DB12)","v":""},null,"Select","Select","Select","Select","Select",null,null,"Selectionner","2022-03-09","","",{"$nulls":4},{"$f":"IF(Setup!$F$9=1,Translate!B30,Translate!C30)","v":"Non satisfaite - Non commencée"},{"$nulls":4},"","","","","","","","",null,"",0,"","",0,{"$nulls":7},"","","","","","","","","","","","","","","","",0,"","","","","","","",0,0,0,"","","","","","","","","","","","","","","","","",0,0,"","","","","","","","","","","",null,"","","","",7,"",7,"",7,"",7,""]
[{"$f":"IF(OR(J13=Translate!$B$27,OR(J13=Translate!$C$27,OR(J13=Translate!$C$28,OR(J13=Translate!$B$28)))),\"\",DB13)","v":""},null,"Select","Select","Select","Select","Select",null,null,"Selectionner","2022-03-09","","",{"$nulls":4},{"$f":"IF(Setup!$F$9=1,Translate!B31,Translate!C31)","v":"Non commencé"},{"$nulls":4},"","","","","","","","",null,"",0,"","",0,{"$nulls":7},"","","","","","","","","","","","","","","","",0,"","","","","","","",0,0,0,"","","","","","","","","","","","","","","","","",0,0,"","","","","","","","","","","",null,"","","","",8,"",8,"",8,"",8,""]
[{"$f":"IF(OR(J14=Translate!$B$27,OR(J14=Translate!$C$27,OR(J14=Translate!$C$28,OR(J14=Translate!$B$28)))),\"\",DB14)","v":""},null,"Select","Select","Select","Select","Select",null,null,"Selectionner","2022-03-09","","",{"$nulls":4},{"$f":"IF(Setup!$F$9=1,Translate!B32,Translate!C32)","v":"Non applicable/Non valable"},{"$nulls":4},"","","","","","","","",null,"",0,"","",0,{"$nulls":7},"","","","","","","","","","","","","","","","",0,"","","","","","","",0,0,0,"","","","","","","","","","","","","","","","","",0,0,"","","","","","","","","","","",null,"","","","",9,"",9,"",9,"",9,""]
[{"$f":"IF(OR(J15=Translate!$B$27,OR(J15=Translate!$C$27,OR(J15=Translate!$C$28,OR(J15=Translate!$B$28)))),\"\",DB15)","v":""},null,"Select","Select","Select","Select","Select",null,null,"Selectionner","2022-03-09","","",{"$nulls":9},"","","","","","","","",null,"",0,"","",0,{"$nulls":7},"","","","","","","","","","","","","","","","",0,"","","","","","","",0,0,0,"","","","","","","","","","","","","","","","","",0,0,"","","","","","","","","","","",null,"","","","",10,"",10,"",10,"",10,""]
[{"$f":"IF(OR(J16=Translate!$B$27,OR(J16=Translate!$C$27,OR(J16=Translate!$C$28,OR(J16=Translate!$B$28)))),\"\",DB16)","v":""},null,"Select","Select","Select","Select","Select",null,null,"Selectionner","2022-03-09","","",{"$nulls":9},"","","","","","","","",null,"",0,"","",0,{"$nulls":7},"","","","","","","","","","","","","","","","",0,"","","","","","","",0,0,0,"","","","","","","","","","","","","","","","","",0,0,"","","","","","","","","","","",null,"","","","",11,"",11,"",11,"",11,""]
[{"$f":"IF(OR(J17=Translate!$B$27,OR(J17=Translate!$C$27,OR(J17=Translate!$C$28,OR(J17=Translate!$B$28)))),\"\",DB17)","v":""},null,"Select","Select","Select","Select","Select",null,null,"Selectionner","2022-03-09","","",{"$nulls":9},"","","","","","","","",null,"",0,"","",0,{"$nulls":7},"","","","","","","","","","","","","","","","",0,"","","","","","","",0,0,0,"","","","","","","","","","","","","","","","","",0,0,"","","","","","","","","","","",null,"","","","",12,"",12,"",12,"",12,""]
[{"$f":"IF(OR(J18=Translate!$B$27,OR(J18=Translate!$C$27,OR(J18=Translate!$C$28,OR(J18=Translate!$B$28)))),\"\",DB18)","v":""},null,"Select","Select","Select","Select","Select",null,null,"Selectionner","2022-03-09","","",{"$nulls":9},"","","","","","","","",null,"",0,"","",0,{"$nulls":7},"","","","","","","","","","","","","","","","",0,"","","","","","","",0,0,0,"","","","","","","","","","","","","","","","","",0,0,"","","","","","","","","","","",null,"","","","",13,"",13,"",13,"",13,""]
[{"$f":"IF(OR(J19=Translate!$B$27,OR(J19=Translate!$C$27,OR(J19=Translate!$C$28,OR(J19=Translate!$B$28)))),\"\",DB19)","v":""},null,"Select","Select","Select","Select","Select",null,null,"Selectionner","2022-03-09","","",{"$nulls":9},"","","","","","","","",null,"",0,"","",0,{"$nulls":7},"","","","","","","","","","","","","","","","",0,"","","","","","","",0,0,0,"","","","","","","","","","","","","","","","","",0,0,"","","","","","","","","","","",null,"","","","",14,"",14,"",14,"",14,""]
[{"$f":"IF(OR(J20=Translate!$B$27,OR(J20=Translate!$C$27,OR(J20=Translate!$C$28,OR(J20=Translate!$B$28)))),\"\",DB20)","v":""},null,"Select","Select","Select","Select","Select",null,null,"Selectionner","2022-03-09","","",{"$nulls":9},"","","","","","","","",null,"",0,"","",0,{"$nulls":7},"","","","","","","","","","","","","","","","",0,"","","","","","","",0,0,0,"","","","","","","","","","","","","","","","","",0,0,"","","","","","","","","","","",null,"","","","",15,"",15,"",15,"",15,""]
[{"$f":"IF(OR(J21=Translate!$B$27,OR(J21=Translate!$C$27,OR(J21=Translate!$C$28,OR(J21=Translate!$B$28)))),\"\",DB21)","v":""},null,"Select","Select","Select","Select","Select",null,null,"Selectionner","2022-03-09","","",{"$nulls":9},"","","","","","","","",null,"",0,"","",0,{"$nulls":7},"","","","","","","","","","","","","","","","",0,"","","","","","","",0,0,0,"","","","","","","","","","","","","","","","","",0,0,"","","","","","","","","","","",null,"","","","",16,"",16,"",16,"",16,""]
[{"$f":"IF(OR(J22=Translate!$B$27,OR(J22=Translate!$C$27,OR(J22=Translate!$C$28,OR(J22=Translate!$B$28)))),\"\",DB22)","v":""},null,"Select","Select","Select","Select","Select",null,null,"Selectionner","2022-03-09","","",{"$nulls":9},"","","","","","","","",null,"",0,"","",0,{"$nulls":7},"","","","","","","","","","","","","","","","",0,"","","","","","","",0,0,0,"","","","","","","","","","","","","","","","","",0,0,"","","","","","","","","","","",null,"","","","",17,"",17,"",17,"",17,""]
[{"$f":"IF(OR(J23=Translate!$B$27,OR(J23=Translate!$C$27,OR(J23=Translate!$C$28,OR(J23=Translate!$B$28)))),\"\",DB23)","v":""},null,"Select","Select","Select","Select","Select",null,null,"Selectionner","2022-03-09","","",{"$nulls":9},"","","","","","","","",null,"",0,"","",0,{"$nulls":7},"","","","","","","","","","","","","","","","",0,"","","","","","","",0,0,0,"","","","","","","","","","","","","","","","","",0,0,"","","","","","","","","","","",null,"","","","",18,"",18,"",18,"",18,""]
[{"$f":"IF(OR(J24=Translate!$B$27,OR(J24=Translate!$C$27,OR(J24=Translate!$C$28,OR(J24=Translate!$B$28)))),\"\",DB24)","v":""},null,"Select","Select","Select","Select","Select",null,null,"Selectionner","2022-03-09","","",{"$nulls":9},"","","","","","","","",null,"",0,"","",0,{"$nulls":7},"","","","","","","","","","","","","","","","",0,"","","","","","","",0,0,0,"","","","","","","","","","","","","","","","","",0,0,"","","","","","","","","","","",null,"","","","",19,"",19,"",19,"",19,""]
[{"$f":"IF(OR(J25=Translate!$B$27,OR(J25=Translate!$C$27,OR(J25=Translate!$C$28,OR(J25=Translate!$B$28)))),\"\",DB25)","v":""},null,"Select","Select","Select","Select","Select",null,null,"Selectionner","2022-03-09","","",{"$nulls":9},"","","","","","","","",null,"",0,"","",0,{"$nulls":7},"","","","","","","","","","","","","","","","",0,"","","","","","","",0,0,0,"","","","","","","","","","","","","","","","","",0,0,"","","","","","","","","","","",null,"","","","",20,"",20,"",20,"",20,""]
[{"$f":"IF(OR(J26=Translate!$B$27,OR(J26=Translate!$C$27,OR(J26=Translate!$C$28,OR(J26=Translate!$B$28)))),\"\",DB26)","v":""},null,"Select","Select","Select","Select","Select",null,null,"Selectionner","2022-03-09","","",{"$nulls":9},"","","","","","","","",null,"",0,"","",0,{"$nulls":7},"","","","","","","","","","","","","","","","",0,"","","","","","","",0,0,0,"","","","","","","","","","","","","","","","","",0,0,"","","","","","","","","","","",null,"","","","",21,"",21,"",21,"",21,""]
[{"$f":"IF(OR(J27=Translate!$B$27,OR(J27=Translate!$C$27,OR(J27=Translate!$C$28,OR(J27=Translate!$B$28)))),\"\",DB27)","v":""},null,"Select","Select","Select","Select","Select",null,null,"Selectionner","2022-03-09","","",{"$nulls":9},"","","","","","","","",null,"",0,"","",0,{"$nulls":7},"","","","","","","","","","","","","","","","",0,"","","","","","","",0,0,0,"","","","","","","","","","","","","","","","","",0,0,"","","","","","","","","","","",null,"","","","",22,"",22,"",22,"",22,""]
[{"$f":"IF(OR(J28=Translate!$B$27,OR(J28=Translate!$C$27,OR(J28=Translate!$C$28,OR(J28=Translate!$B$28)))),\"\",DB28)","v":""},null,"Select","Select","Select","Select","Select",null,null,"Selectionner","2022-03-09","","",{"$nulls":9},"","","","","","","","",null,"",0,"","",0,{"$nulls":7},"","","","","","","","","","","","","","","","",0,"","","","","","","",0,0,0,"","","","","","","","","","","","","","","","","",0,0,"","","","","","","","","","","",null,"","","","",23,"",23,"",23,"",23,""]
[{"$f":"IF(OR(J29=Translate!$B$27,OR(J29=Translate!$C$27,OR(J29=Translate!$C$28,OR(J29=Translate!$B$28)))),\"\",DB29)","v":""},null,"Select","Select","Select","Select","Select",null,null,"Selectionner","2022-03-09","","",{"$nulls":9},"","","","","","","","",null,"",0,"","",0,{"$nulls":7},"","","","","","","","","","","","","","","","",0,"","","","","","","",0,0,0,"","","","","","","","","","","","","","","","","",0,0,"","","","","","","","","","","",null,"","","","",24,"",24,"",24,"",24,""]
[{"$f":"IF(OR(J30=Translate!$B$27,OR(J30=Translate!$C$27,OR(J30=Translate!$C$28,OR(J30=Translate!$B$28)))),\"\",DB30)","v":""},null,"Select","Select","Select","Select","Select",null,null,"Selectionner","2022-03-09","","",{"$nulls":9},"","","","","","","","",null,"",0,"","",0,{"$nulls":7},"","","","","","","","","","","","","","","","",0,"","","","","","","",0,0,0,"","","","","","","","","","","","","","","","","",0,0,"","","","","","","","","","","",null,"","","","",25,"",25,"",25,"",25,""]
[{"$f":"IF(OR(J31=Translate!$B$27,OR(J31=Translate!$C$27,OR(J31=Translate!$C$28,OR(J31=Translate!$B$28)))),\"\",DB31)","v":""},null,"Select","Select","Select","Select","Select",null,null,"Selectionner","2022-03-09","","",{"$nulls":9},"","","","","","","","",null,"",0,"","",0,{"$nulls":7},"","","","","","","","","","","","","","","","",0,"","","","","","","",0,0,0,"","","","","","","","","","","","","","","","","",0,0,"","","","","","","","","","","",null,"","","","",26,"",26,"",26,"",26,""]
[{"$f":"IF(OR(J32=Translate!$B$27,OR(J32=Translate!$C$27,OR(J32=Translate!$C$28,OR(J32=Translate!$B$28)))),\"\",DB32)","v":""},null,"Select","Select","Select","Select","Select",null,null,"Selectionner","2022-03-09","","",{"$nulls":9},"","","","","","","","",null,"",0,"","",0,{"$nulls":7},"","","","","","","","","","","","","","","","",0,"","","","","","","",0,0,0,"","","","","","","","","","","","","","","","","",0,0,"","","","","","","","","","","",null,"","","","",27,"",27,"",27,"",27,""]
[{"$f":"IF(OR(J33=Translate!$B$27,OR(J33=Translate!$C$27,OR(J33=Translate!$C$28,OR(J33=Translate!$B$28)))),\"\",DB33)","v":""},null,"Select","Select","Select","Select","Select",null,null,"Selectionner","2022-03-09","","",{"$nulls":9},"","","","","","","","",null,"",0,"","",0,{"$nulls":7},"","","","","","","","","","","","","","","","",0,"","","","","","","",0,0,0,"","","","","","","","","","","","","","","","","",0,0,"","","","","","","","","","","",null,"","","","",28,"",28,"",28,"",28,""]
[{"$f":"IF(OR(J34=Translate!$B$27,OR(J34=Translate!$C$27,OR(J34=Translate!$C$28,OR(J34=Translate!$B$28)))),\"\",DB34)","v":""},null,"Select","Select","Select","Select","Select",null,null,"Selectionner","2022-03-09","","",{"$nulls":9},"","","","","","","","",null,"",0,"","",0,{"$nulls":7},"","","","","","","","","","","","","","","","",0,"","","","","","","",0,0,0,"","","","","","","","","","","","","","","","","",0,0,"","","","","","","","","","","",null,"","","","",29,"",29,"",29,"",29,""]
[{"$f":"IF(OR(J35=Translate!$B$27,OR(J35=Translate!$C$27,OR(J35=Translate!$C$28,OR(J35=Translate!$B$28)))),\"\",DB35)","v":""},null,"Select","Select","Select","Select","Select",null,null,"Selectionner","2022-03-09","","",{"$nulls":9},"","","","","","","","",null,"",0,"","",0,{"$nulls":7},"","","","","","","","","","","","","","","","",0,"","","","","","","",0,0,0,"","","","","","","","","","","","","","","","","",0,0,"","","","","","","","","","","",null,"","","","",30,"",30,"",30,"",30,""]
[{"$f":"IF(OR(J36=Translate!$B$27,OR(J36=Translate!$C$27,OR(J36=Translate!$C$28,OR(J36=Translate!$B$28)))),\"\",DB36)","v":""},null,"Select","Select","Select","Select","Select",null,null,"Selectionner","2022-03-09","","",{"$nulls":9},"","","","","","","","",null,"",0,"","",0,{"$nulls":7},"","","","","","","","","","","","","","","","",0,"","","","","","","",0,0,0,"","","","","","","","","","","","","","","","","",0,0,"","","","","","","","","","","",null,"","","","",31,"",31,"",31,"",31,""]
[{"$f":"IF(OR(J37=Translate!$B$27,OR(J37=Translate!$C$27,OR(J37=Translate!$C$28,OR(J37=Translate!$B$28)))),\"\",DB37)","v":""},null,"Select","Select","Select","Select","Select",null,null,"Selectionner","2022-03-09","","",{"$nulls":9},"","","","","","","","",null,"",0,"","",0,{"$nulls":7},"","","","","","","","","","","","","","","","",0,"","","","","","","",0,0,0,"","","","","","","","","","","","","","","","","",0,0,"","","","","","","","","","","",null,"","","","",32,"",32,"",32,"",32,""]
[{"$f":"IF(OR(J38=Translate!$B$27,OR(J38=Translate!$C$27,OR(J38=Translate!$C$28,OR(J38=Translate!$B$28)))),\"\",DB38)","v":""},null,"Select","Select","Select","Select","Select",null,null,"Selectionner","2022-03-09","","",{"$nulls":9},"","","","","","","","",null,"",0,"","",0,{"$nulls":7},"","","","","","","","","","","","","","","","",0,"","","","","","","",0,0,0,"","","","","","","","","","","","","","","","","",0,0,"","","","","","","","","","","",null,"","","","",33,"",33,"",33,"",33,""]
[{"$f":"IF(OR(J39=Translate!$B$27,OR(J39=Translate!$C$27,OR(J39=Translate!$C$28,OR(J39=Translate!$B$28)))),\"\",DB39)","v":""},null,"Select","Select","Select","Select","Select",null,null,"Selectionner","2022-03-09","","",{"$nulls":9},"","","","","","","","",null,"",0,"","",0,{"$nulls":7},"","","","","","","","","","","","","","","","",0,"","","","","","","",0,0,0,"","","","","","","","","","","","","","","","","",0,0,"","","","","","","","","","","",null,"","","","",34,"",34,"",34,"",34,""]
[{"$f":"IF(OR(J40=Translate!$B$27,OR(J40=Translate!$C$27,OR(J40=Translate!$C$28,OR(J40=Translate!$B$28)))),\"\",DB40)","v":""},null,"Select","Select","Select","Select","Select",null,null,"Selectionner","2022-03-09","","",{"$nulls":9},"","","","","","","","",null,"",0,"","",0,{"$nulls":7},"","","","","","","","","","","","","","","","",0,"","","","","","","",0,0,0,"","","","","","","","","","","","","","","","","",0,0,"","","","","","","","","","","",null,"","","","",35,"",35,"",35,"",35,""]
[{"$f":"IF(OR(J41=Translate!$B$27,OR(J41=Translate!$C$27,OR(J41=Translate!$C$28,OR(J41=Translate!$B$28)))),\"\",DB41)","v":""},null,"Select","Select","Select","Select","Select",null,null,"Selectionner","2022-03-09","","",{"$nulls":9},"","","","","","","","",null,"",0,"","",0,{"$nulls":7},"","","","","","","","","","","","","","","","",0,"","","","","","","",0,0,0,"","","","","","","","","","","","","","","","","",0,0,"","","","","","","","","","","",null,"","","","",36,"",36,"",36,"",36,""]
[{"$f":"IF(OR(J42=Translate!$B$27,OR(J42=Translate!$C$27,OR(J42=Translate!$C$28,OR(J42=Translate!$B$28)))),\"\",DB42)","v":""},null,"Select","Select","Select","Select","Select",null,null,"Selectionner","2022-03-09","","",{"$nulls":9},"","","","","","","","",null,"",0,"","",0,{"$nulls":7},"","","","","","","","","","","","","","","","",0,"","","","","","","",0,0,0,"","","","","","","","","","","","","","","","","",0,0,"","","","","","","","","","","",null,"","","","",37,"",37,"",37,"",37,""]
[{"$f":"IF(OR(J43=Translate!$B$27,OR(J43=Translate!$C$27,OR(J43=Translate!$C$28,OR(J43=Translate!$B$28)))),\"\",DB43)","v":""},null,"Select","Select","Select","Select","Select",null,null,"Selectionner","2022-03-09","","",{"$nulls":9},"","","","","","","","",null,"",0,"","",0,{"$nulls":7},"","","","","","","","","","","","","","","","",0,"","","","","","","",0,0,0,"","","","","","","","","","","","","","","","","",0,0,"","","","","","","","","","","",null,"","","","",38,"",38,"",38,"",38,""]
[{"$f":"IF(OR(J44=Translate!$B$27,OR(J44=Translate!$C$27,OR(J44=Translate!$C$28,OR(J44=Translate!$B$28)))),\"\",DB44)","v":""},null,"Select","Select","Select","Select","Select",null,null,"Selectionner","2022-03-09","","",{"$nulls":9},"","","","","","","","",null,"",0,"","",0,{"$nulls":7},"","","","","","","","","","","","","","","","",0,"","","","","","","",0,0,0,"","","","","","","","","","","","","","","","","",0,0,"","","","","","","","","","","",null,"","","","",39,"",39,"",39,"",39,""]
[{"$f":"IF(OR(J45=Translate!$B$27,OR(J45=Translate!$C$27,OR(J45=Translate!$C$28,OR(J45=Translate!$B$28)))),\"\",DB45)","v":""},null,"Select","Select","Select","Select","Select",null,null,"Selectionner","2022-03-09","","",{"$nulls":9},"","","","","","","","",null,"",0,"","",0,{"$nulls":7},"","","","","","","","","","","","","","","","",0,"","","","","","","",0,0,0,"","","","","","","","","","","","","","","","","",0,0,"","","","","","","","","","","",null,"","","","",40,"",40,"",40,"",40,""]
[{"$f":"IF(OR(J46=Translate!$B$27,OR(J46=Translate!$C$27,OR(J46=Translate!$C$28,OR(J46=Translate!$B$28)))),\"\",DB46)","v":""},null,"Select","Select","Select","Select","Select",null,null,"Selectionner","2022-03-09","","",{"$nulls":9},"","","","","","","","",null,"",0,"","",0,{"$nulls":7},"","","","","","","","","","","","","","","","",0,"","","","","","","",0,0,0,"","","","","","","","","","","","","","","","","",0,0,"","","","","","","","","","","",null,"","","","",41,"",41,"",41,"",41,""]
[{"$f":"IF(OR(J47=Translate!$B$27,OR(J47=Translate!$C$27,OR(J47=Translate!$C$28,OR(J47=Translate!$B$28)))),\"\",DB47)","v":""},null,"Select","Select","Select","Select","Select",null,null,"Selectionner","2022-03-09","","",{"$nulls":9},"","","","","","","","",null,"",0,"","",0,{"$nulls":7},"","","","","","","","","","","","","","","","",0,"","","","","","","",0,0,0,"","","","","","","","","","","","","","","","","",0,0,"","","","","","","","","","","",null,"","","","",42,"",42,"",42,"",42,""]
[{"$f":"IF(OR(J48=Translate!$B$27,OR(J48=Translate!$C$27,OR(J48=Translate!$C$28,OR(J48=Translate!$B$28)))),\"\",DB48)","v":""},null,"Select","Select","Select","Select","Select",null,null,"Selectionner","2022-03-09","","",{"$nulls":9},"","","","","","","","",null,"",0,"","",0,{"$nulls":7},"","","","","","","","","","","","","","","","",0,"","","","","","","",0,0,0,"","","","","","","","","","","","","","","","","",0,0,"","","","","","","","","","","",null,"","","","",43,"",43,"",43,"",43,""]
[{"$f":"IF(OR(J49=Translate!$B$27,OR(J49=Translate!$C$27,OR(J49=Translate!$C$28,OR(J49=Translate!$B$28)))),\"\",DB49)","v":""},null,"Select","Select","Select","Select","Select",null,null,"Selectionner","2022-03-09","","",{"$nulls":9},"","","","","","","","",null,"",0,"","",0,{"$nulls":7},"","","","","","","","","","","","","","","","",0,"","","","","","","",0,0,0,"","","","","","","","","","","","","","","","","",0,0,"","","","","","","","","","","",null,"","","","",44,"",44,"",44,"",44,""]
[{"$f":"IF(OR(J50=Translate!$B$27,OR(J50=Translate!$C$27,OR(J50=Translate!$C$28,OR(J50=Translate!$B$28)))),\"\",DB50)","v":""},null,"Select","Select","Select","Select","Select",null,null,"Selectionner","2022-03-09","","",{"$nulls":9},"","","","","","","","",null,"",0,"","",0,{"$nulls":7},"","","","","","","","","","","","","","","","",0,"","","","","","","",0,0,0,"","","","","","","","","","","","","","","","","",0,0,"","","","","","","","","","","",null,"","","","",45,"",45,"",45,"",45,""]
[{"$f":"IF(OR(J51=Translate!$B$27,OR(J51=Translate!$C$27,OR(J51=Translate!$C$28,OR(J51=Translate!$B$28)))),\"\",DB51)","v":""},null,"Select","Select","Select","Select","Select",null,null,"Selectionner","2022-03-09","","",{"$nulls":9},"","","","","","","","",null,"",0,"","",0,{"$nulls":7},"","","","","","","","","","","","","","","","",0,"","","","","","","",0,0,0,"","","","","","","","","","","","","","","","","",0,0,"","","","","","","","","","","",null,"","","","",46,"",46,"",46,"",46,""]
[{"$f":"IF(OR(J52=Translate!$B$27,OR(J52=Translate!$C$27,OR(J52=Translate!$C$28,OR(J52=Translate!$B$28)))),\"\",DB52)","v":""},null,"Select","Select","Select","Select","Select",null,null,"Selectionner","2022-03-09","","",{"$nulls":9},"","","","","","","","",null,"",0,"","",0,{"$nulls":7},"","","","","","","","","","","","","","","","",0,"","","","","","","",0,0,0,"","","","","","","","","","","","","","","","","",0,0,"","","","","","","","","","","",null,"","","","",47,"",47,"",47,"",47,""]
[{"$f":"IF(OR(J53=Translate!$B$27,OR(J53=Translate!$C$27,OR(J53=Translate!$C$28,OR(J53=Translate!$B$28)))),\"\",DB53)","v":""},null,"Select","Select","Select","Select","Select",null,null,"Selectionner","2022-03-09","","",{"$nulls":9},"","","","","","","","",null,"",0,"","",0,{"$nulls":7},"","","","","","","","","","","","","","","","",0,"","","","","","","",0,0,0,"","","","","","","","","","","","","","","","","",0,0,"","","","","","","","","","","",null,"","","","",48,"",48,"",48,"",48,""]
[{"$f":"IF(OR(J54=Translate!$B$27,OR(J54=Translate!$C$27,OR(J54=Translate!$C$28,OR(J54=Translate!$B$28)))),\"\",DB54)","v":""},null,"Select","Select","Select","Select","Select",null,null,"Selectionner","2022-03-09","","",{"$nulls":9},"","","","","","","","",null,"",0,"","",0,{"$nulls":7},"","","","","","","","","","","","","","","","",0,"","","","","","","",0,0,0,"","","","","","","","","","","","","","","","","",0,0,"","","","","","","","","","","",null,"","","","",49,"",49,"",49,"",49,""]
[{"$f":"IF(OR(J55=Translate!$B$27,OR(J55=Translate!$C$27,OR(J55=Translate!$C$28,OR(J55=Translate!$B$28)))),\"\",DB55)","v":""},null,"Select","Select","Select","Select","Select",null,null,"Selectionner","2022-03-09","","",{"$nulls":9},"","","","","","","","",null,"",0,"","",0,{"$nulls":7},"","","","","","","","","","","","","","","","",0,"","","","","","","",0,0,0,"","","","","","","","","","","","","","","","","",0,0,"","","","","","","","","","","",null,"","","","",50,"",50,"",50,"",50,""]
[{"$f":"IF(OR(J56=Translate!$B$27,OR(J56=Translate!$C$27,OR(J56=Translate!$C$28,OR(J56=Translate!$B$28)))),\"\",DB56)","v":""},null,"Select","Select","Select","Select","Select",null,null,"Selectionner","2022-03-09","","",{"$nulls":9},"","","","","","","","",null,"",0,"","",0,{"$nulls":7},"","","","","","","","","","","","","","","","",0,"","","","","","","",0,0,0,"","","","","","","","","","","","","","","","","",0,0,"","","","","","","","","","","",null,"","","","",51,"",51,"",51,"",51,""]
[{"$f":"IF(OR(J57=Translate!$B$27,OR(J57=Translate!$C$27,OR(J57=Translate!$C$28,OR(J57=Translate!$B$28)))),\"\",DB57)","v":""},null,"Select","Select","Select","Select","Select",null,null,"Selectionner","2022-03-09","","",{"$nulls":9},"","","","","","","","",null,"",0,"","",0,{"$nulls":7},"","","","","","","","","","","","","","","","",0,"","","","","","","",0,0,0,"","","","","","","","","","","","","","","","","",0,0,"","","","","","","","","","","",null,"","","","",52,"",52,"",52,"",52,""]
[{"$f":"IF(OR(J58=Translate!$B$27,OR(J58=Translate!$C$27,OR(J58=Translate!$C$28,OR(J58=Translate!$B$28)))),\"\",DB58)","v":""},null,"Select","Select","Select","Select","Select",null,null,"Selectionner","2022-03-09","","",{"$nulls":9},"","","","","","","","",null,"",0,"","",0,{"$nulls":7},"","","","","","","","","","","","","","","","",0,"","","","","","","",0,0,0,"","","","","","","","","","","","","","","","","",0,0,"","","","","","","","","","","",null,"","","","",53,"",53,"",53,"",53,""]
[{"$f":"IF(OR(J59=Translate!$B$27,OR(J59=Translate!$C$27,OR(J59=Translate!$C$28,OR(J59=Translate!$B$28)))),\"\",DB59)","v":""},null,"Select","Select","Select","Select","Select",null,null,"Selectionner","2022-03-09","","",{"$nulls":9},"","","","","","","","",null,"",0,"","",0,{"$nulls":7},"","","","","","","","","","","","","","","","",0,"","","","","","","",0,0,0,"","","","","","","","","","","","","","","","","",0,0,"","","","","","","","","","","",null,"","","","",54,"",54,"",54,"",54,""]
[{"$f":"IF(OR(J60=Translate!$B$27,OR(J60=Translate!$C$27,OR(J60=Translate!$C$28,OR(J60=Translate!$B$28)))),\"\",DB60)","v":""},null,"Select","Select","Select","Select","Select",null,null,"Selectionner","2022-03-09","","",{"$nulls":9},"","","","","","","","",null,"",0,"","",0,{"$nulls":7},"","","","","","","","","","","","","","","","",0,"","","","","","","",0,0,0,"","","","","","","","","","","","","","","","","",0,0,"","","","","","","","","","","",null,"","","","",55,"",55,"",55,"",55,""]
[{"$f":"IF(OR(J61=Translate!$B$27,OR(J61=Translate!$C$27,OR(J61=Translate!$C$28,OR(J61=Translate!$B$28)))),\"\",DB61)","v":""},null,"Select","Select","Select","Select","Select",null,null,"Selectionner","2022-03-09","","",{"$nulls":9},"","","","","","","","",null,"",0,"","",0,{"$nulls":7},"","","","","","","","","","","","","","","","",0,"","","","","","","",0,0,0,"","","","","","","","","","","","","","","","","",0,0,"","","","","","","","","","","",null,"","","","",56,"",56,"",56,"",56,""]
[{"$f":"IF(OR(J62=Translate!$B$27,OR(J62=Translate!$C$27,OR(J62=Translate!$C$28,OR(J62=Translate!$B$28)))),\"\",DB62)","v":""},null,"Select","Select","Select","Select","Select",null,null,"Selectionner","2022-03-09","","",{"$nulls":9},"","","","","","","","",null,"",0,"","",0,{"$nulls":7},"","","","","","","","","","","","","","","","",0,"","","","","","","",0,0,0,"","","","","","","","","","","","","","","","","",0,0,"","","","","","","","","","","",null,"","","","",57,"",57,"",57,"",57,""]
[{"$f":"IF(OR(J63=Translate!$B$27,OR(J63=Translate!$C$27,OR(J63=Translate!$C$28,OR(J63=Translate!$B$28)))),\"\",DB63)","v":""},null,"Select","Select","Select","Select","Select",null,null,"Selectionner","2022-03-09","","",{"$nulls":9},"","","","","","","","",null,"",0,"","",0,{"$nulls":7},"","","","","","","","","","","","","","","","",0,"","","","","","","",0,0,0,"","","","","","","","","","","","","","","","","",0,0,"","","","","","","","","","","",null,"","","","",58,"",58,"",58,"",58,""]
[{"$f":"IF(OR(J64=Translate!$B$27,OR(J64=Translate!$C$27,OR(J64=Translate!$C$28,OR(J64=Translate!$B$28)))),\"\",DB64)","v":""},null,"Select","Select","Select","Select","Select",null,null,"Selectionner","2022-03-09","","",{"$nulls":9},"","","","","","","","",null,"",0,"","",0,{"$nulls":7},"","","","","","","","","","","","","","","","",0,"","","","","","","",0,0,0,"","","","","","","","","","","","","","","","","",0,0,"","","","","","","","","","","",null,"","","","",59,"",59,"",59,"",59,""]
[{"$f":"IF(OR(J65=Translate!$B$27,OR(J65=Translate!$C$27,OR(J65=Translate!$C$28,OR(J65=Translate!$B$28)))),\"\",DB65)","v":""},null,"Select","Select","Select","Select","Select",null,null,"Selectionner","2022-03-09","","",{"$nulls":9},"","","","","","","","",null,"",0,"","",0,{"$nulls":7},"","","","","","","","","","","","","","","","",0,"","","","","","","",0,0,0,"","","","","","","","","","","","","","","","","",0,0,"","","","","","","","","","","",null,"","","","",60,"",60,"",60,"",60,""]
[{"$f":"IF(OR(J66=Translate!$B$27,OR(J66=Translate!$C$27,OR(J66=Translate!$C$28,OR(J66=Translate!$B$28)))),\"\",DB66)","v":""},null,"Select","Select","Select","Select","Select",null,null,"Selectionner","2022-03-09","","",{"$nulls":9},"","","","","","","","",null,"",0,"","",0,{"$nulls":7},"","","","","","","","","","","","","","","","",0,"","","","","","","",0,0,0,"","","","","","","","","","","","","","","","","",0,0,"","","","","","","","","","","",null,"","","","",61,"",61,"",61,"",61,""]
[{"$f":"IF(OR(J67=Translate!$B$27,OR(J67=Translate!$C$27,OR(J67=Translate!$C$28,OR(J67=Translate!$B$28)))),\"\",DB67)","v":""},null,"Select","Select","Select","Select","Select",null,null,"Selectionner","2022-03-09","","",{"$nulls":9},"","","","","","","","",null,"",0,"","",0,{"$nulls":7},"","","","","","","","","","","","","","","","",0,"","","","","","","",0,0,0,"","","","","","","","","","","","","","","","","",0,0,"","","","","","","","","","","",null,"","","","",62,"",62,"",62,"",62,""]
[{"$f":"IF(OR(J68=Translate!$B$27,OR(J68=Translate!$C$27,OR(J68=Translate!$C$28,OR(J68=Translate!$B$28)))),\"\",DB68)","v":""},null,"Select","Select","Select","Select","Select",null,null,"Selectionner","2022-03-09","","",{"$nulls":9},"","","","","","","","",null,"",0,"","",0,{"$nulls":7},"","","","","","","","","","","","","","","","",0,"","","","","","","",0,0,0,"","","","","","","","","","","","","","","","","",0,0,"","","","","","","","","","","",null,"","","","",63,"",63,"",63,"",63,""]
[{"$f":"IF(OR(J69=Translate!$B$27,OR(J69=Translate!$C$27,OR(J69=Translate!$C$28,OR(J69=Translate!$B$28)))),\"\",DB69)","v":""},null,"Select","Select","Select","Select","Select",null,null,"Selectionner","2022-03-09","","",{"$nulls":9},"","","","","","","","",null,"",0,"","",0,{"$nulls":7},"","","","","","","","","","","","","","","","",0,"","","","","","","",0,0,0,"","","","","","","","","","","","","","","","","",0,0,"","","","","","","","","","","",null,"","","","",64,"",64,"",64,"",64,""]
[{"$f":"IF(OR(J70=Translate!$B$27,OR(J70=Translate!$C$27,OR(J70=Translate!$C$28,OR(J70=Translate!$B$28)))),\"\",DB70)","v":""},null,"Select","Select","Select","Select","Select",null,null,"Selectionner","2022-03-09","","",{"$nulls":9},{"$f":"IF(B70=\"\",\"\",1)","v":""},{"$f":"IF(E70=\"Fonds Mondial\",W70,\"\")","v":""},{"$f":"IF(E70=\"CCM\",W70,\"\")","v":""},{"$f":"IF(E70=\"PNLIT\",W70,\"\")","v":""},{"$f":"IF(E70=\"MSP\",W70,\"\")","v":""},{"$f":"IF(E70=\"DPML\",W70,\"\")","v":""},{"$f":"IF(E70=\"DNSIS\",W70,\"\")","v":""},{"$f":"IF(E70=\"Autres\",W70,\"\")","v":""},null,"",0,"","",0,{"$nulls":7},{"$f":"IF(AND(F70=$AR$5,AND(BQ70=1)),1,\"\")","v":""},{"$f":"IF(AND(F70=$AS$5,AND(BQ70=1)),1,\"\")","v":""},{"$f":"IF(AND(F70=$AT$5,AND(BQ70=1)),1,\"\")","v":""},{"$f":"IF(AND(F70=$AU$5,AND(BQ70=1)),1,\"\")","v":""},{"$f":"IF(AND(F70=$AV$5,AND(BQ70=1)),1,\"\")","v":""},{"$f":"IF(AND(F70=$AW$5,AND(BQ70=1)),1,\"\")","v":""},{"$f":"IF(AND(F70=$AX$5,AND(BQ70=1)),1,\"\")","v":""},{"$f":"IF(AND(F70=$AY$5,AND(BQ70=1)),1,\"\")","v":""},{"$f":"IF(AND(F70=$AZ$5,AND(BQ70=1)),1,\"\")","v":""},{"$f":"IF(AND(F70=$BA$5,AND(BQ70=1)),1,\"\")","v":""},{"$f":"IF(AND(F70=$BB$5,AND(BQ70=1)),1,\"\")","v":""},{"$f":"IF(AND(F70=$BC$5,AND(BQ70=1)),1,\"\")","v":""},{"$f":"IF(AND(F70=$BD$5,AND(BQ70=1)),1,\"\")","v":""},{"$f":"IF(AND(F70=$BE$5,AND(BQ70=1)),1,\"\")","v":""},{"$f":"IF(AND(F70=$BF$5,AND(BQ70=1)),1,\"\")","v":""},{"$f":"IF(AND(F70=$BG$5,AND(BQ70=1)),1,\"\")","v":""},0,"","","","","","","",0,{"$f":"IF(OR(B70=\"\",OR(C70=\"Select\",OR(E70=\"Select\",OR(F70=\"Select\",OR(I70=\"\",OR(D70=\"Select\",OR(J70=\"Select\"))))))),0,1)","v":0},0,"",{"$f":"IF(C70=$BT$5,1,\"\")","v":""},{"$f":"IF(C70=$BU$5,1,\"\")","v":""},{"$f":"IF(C70=$BV$5,1,\"\")","v":""},{"$f":"IF(C70=$BW$5,1,\"\")","v":""},{"$f":"IF(C70=$BX$5,1,\"\")","v":""},{"$f":"IF(C70=$BY$5,1,\"\")","v":""},{"$f":"IF(C70=$BZ$5,1,\"\")","v":""},{"$f":"IF(C70=$CA$5,1,\"\")","v":""},{"$f":"IF(C70=$CB$5,1,\"\")","v":""},{"$f":"IF(D70=$CC$5,1,\"\")","v":""},{"$f":"IF(D70=$CD$5,1,\"\")","v":""},{"$f":"IF(D70=$CE$5,1,\"\")","v":""},{"$f":"IF(D70=$CF$5,1,\"\")","v":""},{"$f":"IF(D70=$CG$5,1,\"\")","v":""},{"$f":"IF(D70=$CH$5,1,\"\")","v":""},"",0,0,{"$f":"IF(AND(F70=$CL$5,AND(BQ70=1)),1,\"\")","v":""},{"$f":"IF(AND(F70=$CM$5,AND(BQ70=1)),1,\"\")","v":""},{"$f":"IF(AND(F70=$CN$5,AND(BQ70=1)),1,\"\")","v":""},{"$f":"IF(AND(F70=$CO$5,AND(BQ70=1)),1,\"\")","v":""},{"$f":"IF(AND(F70=$CP$5,AND(BQ70=1)),1,\"\")","v":""},{"$f":"IF(AND(F70=$CQ$5,AND(BQ70=1)),1,\"\")","v":""},{"$f":"IF(AND(F70=$CR$5,AND(BQ70=1)),1,\"\")","v":""},{"$f":"IF(AND(F70=$CS$5,AND(BQ70=1)),1,\"\")","v":""},{"$f":"IF(AND(F70=$CT$5,AND(BQ70=1)),1,\"\")","v":""},{"$f":"IF(AND(F70=$CU$5,AND(BQ70=1)),1,\"\")","v":""},{"$f":"IF(AND(F70=$CV$5,AND(BQ70=1)),1,\"\")","v":""},null,"","","","",65,"",65,"",65,"",65,""]
[{"$f":"IF(OR(J71=Translate!$B$27,OR(J71=Translate!$C$27,OR(J71=Translate!$C$28,OR(J71=Translate!$B$28)))),\"\",DB71)","v":""},null,"Select","Select","Select","Select","Select",null,null,"Selectionner",{"$f":"TODAY()","v":"2022-03-09"},{"$f":"IF(OR(I71=\"\",OR(J71=$R$14,OR(J71=$R$9))),\"\",I71-K71)","v":""},{"$f":"IF(BR71=1,L71,\"\")","v":""},{"$nulls":9},"","","","","","","","",null,{"$f":"IF(M71<0,1,\"\")","v":""},{"$f":"IF(AND(J71=\"Réalisée\",AND(M71=\"\")),1,0)","v":0},"",{"$f":"IF(AND(M71>0,M71<15),1,\"\")","v":""},{"$f":"IF(AND(J71=\"En cours\",AND(M71>14)),1,0)","v":0},{"$nulls":7},"","","","","","","","","","","","","","","","",{"$f":"BQ71","v":0},{"$f":"IF(AND(J71=$BI$5,AND(BQ71=1)),1,\"\")","v":""},{"$f":"IF(AND(J71=$BJ$5,AND(BQ71=1)),1,\"\")","v":""},{"$f":"IF(AND(J71=$BK$5,AND(BQ71=1)),1,\"\")","v":""},{"$f":"IF(AND(J71=$BL$5,AND(BQ71=1)),1,\"\")","v":""},{"$f":"IF(AND(J71=$BM$5,AND(BQ71=1)),1,\"\")","v":""},{"$f":"IF(AND(J71=$BN$5,AND(BQ71=1)),1,\"\")","v":""},{"$f":"IF(M71<0,1,\"\")","v":""},{"$f":"IF(OR(J71=$BI$5,OR(J71=$BN$5,OR(J71=$CZ$5))),1,0)","v":0},0,{"$f":"IF(OR(J71=$BI$5,OR(J71=$BM$5,OR(J71=$R$10,OR(J71=$R$15,OR(J71=$R$18))))),\"\",BQ71)","v":0},{"$f":"IF(C71=$BS$5,1,\"\")","v":""},"","","","","","","","","","","","","","","",{"$f":"IF(AND(M71>0,M71<15),1,\"\")","v":""},{"$f":"IF((M71>14),1,0)*CK71","v":0},{"$f":"IF(M71=\"\",0,1)","v":0},"","","","","","","","","","","",null,{"$f":"IF(AND(J71=$CX$5,AND(BQ71=1)),1,\"\")","v":""},{"$f":"IF(AND(J71=$CY$5,AND(BQ71=1)),1,\"\")","v":""},{"$f":"IF(AND(J71=$CZ$5,AND(BQ71=1)),1,\"\")","v":""},{"$f":"IF(AND(J71=$DA$5,AND(BQ71=1)),1,\"\")","v":""},66,{"$f":"IF(B71=\"\",\"\",B71)","v":""},{"$f":"DF71","v":66},{"$f":"IF(OR(I71=\"\",OR(J71=\"Select\")),\"\",I71)","v":""},{"$f":"DB71","v":66},{"$f":"IF(F71=\"Select\",\"\",F71)","v":""},{"$f":"DF71","v":66},{"$f":"IF(C71=\"Select\",\"\",C71)","v":""}]
[{"$f":"IF(OR(J72=Translate!$B$27,OR(J72=Translate!$C$27,OR(J72=Translate!$C$28,OR(J72=Translate!$B$28)))),\"\",DB72)","v":""},null,"Select","Select","Select","Select","Select",null,null,"Selectionner","2022-03-09","","",{"$nulls":9},"","","","","","","","",null,"",0,"","",0,{"$nulls":7},"","","","","","","","","","","","","","","","",0,"","","","","","","",0,0,0,"","","","","","","","","","","","","","","","","",0,0,"","","","","","","","","","","",null,"","","","",67,"",67,"",67,"",67,""]
[{"$f":"IF(OR(J73=Translate!$B$27,OR(J73=Translate!$C$27,OR(J73=Translate!$C$28,OR(J73=Translate!$B$28)))),\"\",DB73)","v":""},null,"Select","Select","Select","Select","Select",null,null,"Selectionner","2022-03-09","","",{"$nulls":9},"","","","","","","","",null,"",0,{"$f":"IF(J73=\"Réalisée\",AG73,\"\")","v":""},"",0,{"$nulls":7},"","","","","","","","","","","","","","","","",0,"","","","","","","",0,0,0,"","","","","","","","","","","","","","","","","",0,0,"","","","","","","","","","","",null,"","","","",68,"",68,"",68,"",68,""]
[{"$f":"IF(OR(J74=Translate!$B$27,OR(J74=Translate!$C$27,OR(J74=Translate!$C$28,OR(J74=Translate!$B$28)))),\"\",DB74)","v":""},null,"Select","Select","Select","Select","Select",null,null,"Selectionner","2022-03-09","","",{"$nulls":9},"","","","","","","","",null,"",0,"","",0,{"$nulls":7},"","","","","","","","","","","","","","","","",0,"","","","","","","",0,0,0,"","","","","","","","","","","","","","","","","",0,0,"","","","","","","","","","","",null,"","","","",69,"",69,"",69,"",69,""]
[{"$f":"IF(OR(J75=Translate!$B$27,OR(J75=Translate!$C$27,OR(J75=Translate!$C$28,OR(J75=Translate!$B$28)))),\"\",DB75)","v":""},null,"Select","Select","Select","Select","Select",null,null,"Selectionner","2022-03-09","","",{"$nulls":9},"","","","","","","","",null,"",0,"","",0,{"$nulls":7},"","","","","","","","","","","","","","","","",0,"","","","","","","",0,0,0,"","","","","","","","","","","","","","","","","",0,0,"","","","","","","","","","","",null,"","","","",70,"",70,"",70,"",70,""]
[{"$f":"IF(OR(J76=Translate!$B$27,OR(J76=Translate!$C$27,OR(J76=Translate!$C$28,OR(J76=Translate!$B$28)))),\"\",DB76)","v":""},null,"Select","Select","Select","Select","Select",null,null,"Selectionner","2022-03-09","","",{"$nulls":9},"","","","","","","","",null,"",0,"","",0,{"$nulls":7},"","","","","","","","","","","","","","","","",0,"","","","","","","",0,0,0,"","","","","","","","","","","","","","","","","",0,0,"","","","","","","","","","","",null,"","","","",71,"",71,"",71,"",71,""]
[{"$f":"IF(OR(J77=Translate!$B$27,OR(J77=Translate!$C$27,OR(J77=Translate!$C$28,OR(J77=Translate!$B$28)))),\"\",DB77)","v":""},null,"Select","Select","Select","Select","Select",null,null,"Selectionner","2022-03-09","","",{"$nulls":9},"","","","","","","","",null,"",0,"","",0,{"$nulls":7},"","","","","","","","","","","","","","","","",0,"","","","","","","",0,0,0,"","","","","","","","","","","","","","","","","",0,0,"","","","","","","","","","","",null,"","","","",72,"",72,"",72,"",72,""]
[{"$f":"IF(OR(J78=Translate!$B$27,OR(J78=Translate!$C$27,OR(J78=Translate!$C$28,OR(J78=Translate!$B$28)))),\"\",DB78)","v":""},null,"Select","Select","Select","Select","Select",null,null,"Selectionner","2022-03-09","","",{"$nulls":9},"","","","","","","","",null,"",0,"","",0,{"$nulls":7},"","","","","","","","","","","","","","","","",0,"","","","","","","",0,0,0,"","","","","","","","","","","","","","","","","",0,0,"","","","","","","","","","","",null,"","","","",73,"",73,"",73,"",73,""]
[{"$f":"IF(OR(J79=Translate!$B$27,OR(J79=Translate!$C$27,OR(J79=Translate!$C$28,OR(J79=Translate!$B$28)))),\"\",DB79)","v":""},null,"Select","Select","Select","Select","Select",null,null,"Selectionner","2022-03-09","","",{"$nulls":9},"","","","","","","","",null,"",0,"","",0,{"$nulls":7},"","","","","","","","","","","","","","","","",0,"","","","","","","",0,0,0,"","","","","","","","","","","","","","","","","",0,0,"","","","","","","","","","","",null,"","","","",74,"",74,"",74,"",74,""]
[{"$f":"IF(OR(J80=Translate!$B$27,OR(J80=Translate!$C$27,OR(J80=Translate!$C$28,OR(J80=Translate!$B$28)))),\"\",DB80)","v":""},null,"Select","Select","Select","Select","Select",null,null,"Selectionner","2022-03-09","","",{"$nulls":9},"","","","","","","","",null,"",0,"","",0,{"$nulls":7},"","","","","","","","","","","","","","","","",0,"","","","","","","",0,0,0,"","","","","","","","","","","","","","","","","",0,0,"","","","","","","","","","","",null,"","","","",75,"",75,"",75,"",75,""]
[{"$f":"IF(OR(J81=Translate!$B$27,OR(J81=Translate!$C$27,OR(J81=Translate!$C$28,OR(J81=Translate!$B$28)))),\"\",DB81)","v":""},null,"Select","Select","Select","Select","Select",null,null,"Selectionner","2022-03-09","","",{"$nulls":9},"","","","","","","","",null,"",0,"","",0,{"$nulls":7},"","","","","","","","","","","","","","","","",0,"","","","","","","",0,0,0,"","","","","","","","","","","","","","","","","",0,0,"","","","","","","","","","","",null,"","","","",76,"",76,"",76,"",76,""]
[{"$f":"IF(OR(J82=Translate!$B$27,OR(J82=Translate!$C$27,OR(J82=Translate!$C$28,OR(J82=Translate!$B$28)))),\"\",DB82)","v":""},null,"Select","Select","Select","Select","Select",null,null,"Selectionner","2022-03-09","","",{"$nulls":9},"","","","","","","","",null,"",0,"","",0,{"$nulls":7},"","","","","","","","","","","","","","","","",0,"","","","","","","",0,0,0,"","","","","","","","","","","","","","","","","",0,0,"","","","","","","","","","","",null,"","","","",77,"",77,"",77,"",77,""]
[{"$f":"IF(OR(J83=Translate!$B$27,OR(J83=Translate!$C$27,OR(J83=Translate!$C$28,OR(J83=Translate!$B$28)))),\"\",DB83)","v":""},null,"Select","Select","Select","Select","Select",null,null,"Selectionner","2022-03-09","","",{"$nulls":9},"","","","","","","","",null,"",0,"","",0,{"$nulls":7},"","","","","","","","","","","","","","","","",0,"","","","","","","",0,0,0,"","","","","","","","","","","","","","","","","",0,0,"","","","","","","","","","","",null,"","","","",78,"",78,"",78,"",78,""]
[{"$f":"IF(OR(J84=Translate!$B$27,OR(J84=Translate!$C$27,OR(J84=Translate!$C$28,OR(J84=Translate!$B$28)))),\"\",DB84)","v":""},null,"Select","Select","Select","Select","Select",null,null,"Selectionner","2022-03-09","","",{"$nulls":9},"","","","","","","","",null,"",0,"","",0,{"$nulls":7},"","","","","","","","","","","","","","","","",0,"","","","","","","",0,0,0,"","","","","","","","","","","","","","","","","",0,0,"","","","","","","","","","","",null,"","","","",79,"",79,"",79,"",79,""]
[{"$f":"IF(OR(J85=Translate!$B$27,OR(J85=Translate!$C$27,OR(J85=Translate!$C$28,OR(J85=Translate!$B$28)))),\"\",DB85)","v":""},null,"Select","Select","Select","Select","Select",null,null,"Selectionner","2022-03-09","","",{"$nulls":9},"","","","","","","","",null,"",0,"","",0,{"$nulls":7},"","","","","","","","","","","","","","","","",0,"","","","","","","",0,0,0,"","","","","","","","","","","","","","","","","",0,0,"","","","","","","","","","","",null,"","","","",80,"",80,"",80,"",80,""]
[{"$f":"IF(OR(J86=Translate!$B$27,OR(J86=Translate!$C$27,OR(J86=Translate!$C$28,OR(J86=Translate!$B$28)))),\"\",DB86)","v":""},null,"Select","Select","Select","Select","Select",null,null,"Selectionner","2022-03-09","","",{"$nulls":9},"","","","","","","","",null,"",0,"","",0,{"$nulls":7},"","","","","","","","","","","","","","","","",0,"","","","","","","",0,0,0,"","","","","","","","","","","","","","","","","",0,0,"","","","","","","","","","","",null,"","","","",81,"",81,"",81,"",81,""]
[{"$f":"IF(OR(J87=Translate!$B$27,OR(J87=Translate!$C$27,OR(J87=Translate!$C$28,OR(J87=Translate!$B$28)))),\"\",DB87)","v":""},null,"Select","Select","Select","Select","Select",null,null,"Selectionner","2022-03-09","","",{"$nulls":9},"","","","","","","","",null,"",0,"","",0,{"$nulls":7},"","","","","","","","","","","","","","","","",0,"","","","","","","",0,0,0,"","","","","","","","","","","","","","","","","",0,0,"","","","","","","","","","","",null,"","","","",82,"",82,"",82,"",82,""]
[{"$f":"IF(OR(J88=Translate!$B$27,OR(J88=Translate!$C$27,OR(J88=Translate!$C$28,OR(J88=Translate!$B$28)))),\"\",DB88)","v":""},null,"Select","Select","Select","Select","Select",null,null,"Selectionner","2022-03-09","","",{"$nulls":9},"","","","","","","","",null,"",0,"","",0,{"$nulls":7},"","","","","","","","","","","","","","","","",0,"","","","","","","",0,0,0,"","","","","","","","","","","","","","","","","",0,0,"","","","","","","","","","","",null,"","","","",83,"",83,"",83,"",83,""]
[{"$f":"IF(OR(J89=Translate!$B$27,OR(J89=Translate!$C$27,OR(J89=Translate!$C$28,OR(J89=Translate!$B$28)))),\"\",DB89)","v":""},null,"Select","Select","Select","Select","Select",null,null,"Selectionner","2022-03-09","","",{"$nulls":9},"","","","","","","","",null,"",0,"","",0,{"$nulls":7},"","","","","","","","","","","","","","","","",0,"","","","","","","",0,0,0,"","","","","","","","","","","","","","","","","",0,0,"","","","","","","","","","","",null,"","","","",84,"",84,"",84,"",84,""]
[{"$f":"IF(OR(J90=Translate!$B$27,OR(J90=Translate!$C$27,OR(J90=Translate!$C$28,OR(J90=Translate!$B$28)))),\"\",DB90)","v":""},null,"Select","Select","Select","Select","Select",null,null,"Selectionner","2022-03-09","","",{"$nulls":9},"","","","","","","","",null,"",0,"","",0,{"$nulls":7},"","","","","","","","","","","","","","","","",0,"","","","","","","",0,0,0,"","","","","","","","","","","","","","","","","",0,0,"","","","","","","","","","","",null,"","","","",85,"",85,"",85,"",85,""]
[{"$f":"IF(OR(J91=Translate!$B$27,OR(J91=Translate!$C$27,OR(J91=Translate!$C$28,OR(J91=Translate!$B$28)))),\"\",DB91)","v":""},null,"Select","Select","Select","Select","Select",null,null,"Selectionner","2022-03-09","","",{"$nulls":9},"","","","","","","","",null,"",0,"","",0,{"$nulls":7},"","","","","","","","","","","","","","","","",0,"","","","","","","",0,0,0,"","","","","","","","","","","","","","","","","",0,0,"","","","","","","","","","","",null,"","","","",86,"",86,"",86,"",86,""]
[{"$f":"IF(OR(J92=Translate!$B$27,OR(J92=Translate!$C$27,OR(J92=Translate!$C$28,OR(J92=Translate!$B$28)))),\"\",DB92)","v":""},null,"Select","Select","Select","Select","Select",null,null,"Selectionner","2022-03-09","","",{"$nulls":9},"","","","","","","","",null,"",0,"","",0,{"$nulls":7},"","","","","","","","","","","","","","","","",0,"","","","","","","",0,0,0,"","","","","","","","","","","","","","","","","",0,0,"","","","","","","","","","","",null,"","","","",87,"",87,"",87,"",87,""]
[{"$f":"IF(OR(J93=Translate!$B$27,OR(J93=Translate!$C$27,OR(J93=Translate!$C$28,OR(J93=Translate!$B$28)))),\"\",DB93)","v":""},null,"Select","Select","Select","Select","Select",null,null,"Selectionner","2022-03-09","","",{"$nulls":9},"","","","","","","","",null,"",0,"","",0,{"$nulls":7},"","","","","","","","","","","","","","","","",0,"","","","","","","",0,0,0,"","","","","","","","","","","","","","","","","",0,0,"","","","","","","","","","","",null,"","","","",88,"",88,"",88,"",88,""]
[{"$f":"IF(OR(J94=Translate!$B$27,OR(J94=Translate!$C$27,OR(J94=Translate!$C$28,OR(J94=Translate!$B$28)))),\"\",DB94)","v":""},null,"Select","Select","Select","Select","Select",null,null,"Selectionner","2022-03-09","","",{"$nulls":9},"","","","","","","","",null,"",0,"","",0,{"$nulls":7},"","","","","","","","","","","","","","","","",0,"","","","","","","",0,0,0,"","","","","","","","","","","","","","","","","",0,0,"","","","","","","","","","","",null,"","","","",89,"",89,"",89,"",89,""]
[{"$f":"IF(OR(J95=Translate!$B$27,OR(J95=Translate!$C$27,OR(J95=Translate!$C$28,OR(J95=Translate!$B$28)))),\"\",DB95)","v":""},null,"Select","Select","Select","Select","Select",null,null,"Selectionner","2022-03-09","","",{"$nulls":9},"","","","","","","","",null,"",0,"","",0,{"$nulls":7},"","","","","","","","","","","","","","","","",0,"","","","","","","",0,0,0,"","","","","","","","","","","","","","","","","",0,0,"","","","","","","","","","","",null,"","","","",90,"",90,"",90,"",90,""]
[{"$f":"IF(OR(J96=Translate!$B$27,OR(J96=Translate!$C$27,OR(J96=Translate!$C$28,OR(J96=Translate!$B$28)))),\"\",DB96)","v":""},null,"Select","Select","Select","Select","Select",null,null,"Selectionner","2022-03-09","","",{"$nulls":9},"","","","","","","","",null,"",0,"","",0,{"$nulls":7},"","","","","","","","","","","","","","","","",0,"","","","","","","",0,0,0,"","","","","","","","","","","","","","","","","",0,0,"","","","","","","","","","","",null,"","","","",91,"",91,"",91,"",91,""]
[{"$f":"IF(OR(J97=Translate!$B$27,OR(J97=Translate!$C$27,OR(J97=Translate!$C$28,OR(J97=Translate!$B$28)))),\"\",DB97)","v":""},null,"Select","Select","Select","Select","Select",null,null,"Selectionner","2022-03-09","","",{"$nulls":9},"","","","","","","","",null,"",0,"","",0,{"$nulls":7},"","","","","","","","","","","","","","","","",0,"","","","","","","",0,0,0,"","","","","","","","","","","","","","","","","",0,0,"","","","","","","","","","","",null,"","","","",92,"",92,"",92,"",92,""]
[{"$f":"IF(OR(J98=Translate!$B$27,OR(J98=Translate!$C$27,OR(J98=Translate!$C$28,OR(J98=Translate!$B$28)))),\"\",DB98)","v":""},null,"Select","Select","Select","Select","Select",null,null,"Selectionner","2022-03-09","","",{"$nulls":9},"","","","","","","","",null,"",0,"","",0,{"$nulls":7},"","","","","","","","","","","","","","","","",0,"","","","","","","",0,0,0,"","","","","","","","","","","","","","","","","",0,0,"","","","","","","","","","","",null,"","","","",93,"",93,"",93,"",93,""]
[{"$f":"IF(OR(J99=Translate!$B$27,OR(J99=Translate!$C$27,OR(J99=Translate!$C$28,OR(J99=Translate!$B$28)))),\"\",DB99)","v":""},null,"Select","Select","Select","Select","Select",null,null,"Selectionner","2022-03-09","","",{"$nulls":9},"","","","","","","","",null,"",0,"","",0,{"$nulls":7},"","","","","","","","","","","","","","","","",0,"","","","","","","",0,0,0,"","","","","","","","","","","","","","","","","",0,0,"","","","","","","","","","","",null,"","","","",94,"",94,"",94,"",94,""]
[{"$f":"IF(OR(J100=Translate!$B$27,OR(J100=Translate!$C$27,OR(J100=Translate!$C$28,OR(J100=Translate!$B$28)))),\"\",DB100)","v":""},null,"Select","Select","Select","Select","Select",null,null,"Selectionner","2022-03-09","","",{"$nulls":9},"","","","","","","","",null,"",0,"","",0,{"$nulls":7},"","","","","","","","","","","","","","","","",0,"","","","","","","",0,0,0,"","","","","","","","","","","","","","","","","",0,0,"","","","","","","","","","","",null,"","","","",95,"",95,"",95,"",95,""]
[{"$f":"IF(OR(J101=Translate!$B$27,OR(J101=Translate!$C$27,OR(J101=Translate!$C$28,OR(J101=Translate!$B$28)))),\"\",DB101)","v":""},null,"Select","Select","Select","Select","Select",null,null,"Selectionner","2022-03-09","","",{"$nulls":9},"","","","","","","","",null,"",0,"","",0,{"$nulls":7},"","","","","","","","","","","","","","","","",0,"","","","","","","",0,0,0,"","","","","","","","","","","","","","","","","",0,0,"","","","","","","","","","","",null,"","","","",96,"",96,"",96,"",96,""]
[{"$f":"IF(OR(J102=Translate!$B$27,OR(J102=Translate!$C$27,OR(J102=Translate!$C$28,OR(J102=Translate!$B$28)))),\"\",DB102)","v":""},null,"Select","Select","Select","Select","Select",null,null,"Selectionner","2022-03-09","","",{"$nulls":9},"","","","","","","","",null,"",0,"","",0,{"$nulls":7},"","","","","","","","","","","","","","","","",0,"","","","","","","",0,0,0,"","","","","","","","","","","","","","","","","",0,0,"","","","","","","","","","","",null,"","","","",97,"",97,"",97,"",97,""]
[{"$f":"IF(OR(J103=Translate!$B$27,OR(J103=Translate!$C$27,OR(J103=Translate!$C$28,OR(J103=Translate!$B$28)))),\"\",DB103)","v":""},null,"Select","Select","Select","Select","Select",null,null,"Selectionner","2022-03-09","","",{"$nulls":9},"","","","","","","","",null,"",0,"","",0,{"$nulls":7},"","","","","","","","","","","","","","","","",0,"","","","","","","",0,0,0,"","","","","","","","","","","","","","","","","",0,0,"","","","","","","","","","","",null,"","","","",98,"",98,"",98,"",98,""]
[{"$f":"IF(OR(J104=Translate!$B$27,OR(J104=Translate!$C$27,OR(J104=Translate!$C$28,OR(J104=Translate!$B$28)))),\"\",DB104)","v":""},null,"Select","Select","Select","Select","Select",null,null,"Selectionner","2022-03-09","","",{"$nulls":9},"","","","","","","","",null,"",0,"","",0,{"$nulls":7},"","","","","","","","","","","","","","","","",0,"","","","","","","",0,0,0,"","","","","","","","","","","","","","","","","",0,0,"","","","","","","","","","","",null,"","","","",99,"",99,"",99,"",99,""]
[{"$f":"IF(OR(J105=Translate!$B$27,OR(J105=Translate!$C$27,OR(J105=Translate!$C$28,OR(J105=Translate!$B$28)))),\"\",DB105)","v":""},null,"Select","Select","Select","Select","Select",null,null,"Selectionner","2022-03-09","","",{"$nulls":9},"","","","","","","","",null,"",0,"","",0,{"$nulls":7},"","","","","","","","","","","","","","","","",0,"","","","","","","",0,0,0,"","","","","","","","","","","","","","","","","",0,0,"","","","","","","","","","","",null,"","","","",100,"",100,"",100,"",100,""]
[{"$f":"IF(OR(J106=Translate!$B$27,OR(J106=Translate!$C$27,OR(J106=Translate!$C$28,OR(J106=Translate!$B$28)))),\"\",DB106)","v":""},null,"Select","Select","Select","Select","Select",null,null,"Selectionner","2022-03-09","","",{"$nulls":9},"","","","","","","","",null,"",0,"","",0,{"$nulls":7},"","","","","","","","","","","","","","","","",0,"","","","","","","",0,0,0,"","","","","","","","","","","","","","","","","",0,0,"","","","","","","","","","","",null,"","","","",101,"",101,"",101,"",101,""]
[{"$f":"IF(OR(J107=Translate!$B$27,OR(J107=Translate!$C$27,OR(J107=Translate!$C$28,OR(J107=Translate!$B$28)))),\"\",DB107)","v":""},null,"Select","Select","Select","Select","Select",null,null,"Selectionner","2022-03-09","","",{"$nulls":9},"","","","","","","","",null,"",0,"","",0,{"$nulls":7},"","","","","","","","","","","","","","","","",0,"","","","","","","",0,0,0,"","","","","","","","","","","","","","","","","",0,0,"","","","","","","","","","","",null,"","","","",102,"",102,"",102,"",102,""]
[{"$f":"IF(OR(J108=Translate!$B$27,OR(J108=Translate!$C$27,OR(J108=Translate!$C$28,OR(J108=Translate!$B$28)))),\"\",DB108)","v":""},null,"Select","Select","Select","Select","Select",null,null,"Selectionner","2022-03-09","","",{"$nulls":9},"","","","","","","","",null,"",0,"","",0,{"$nulls":7},"","","","","","","","","","","","","","","","",0,"","","","","","","",0,0,0,"","","","","","","","","","","","","","","","","",0,0,"","","","","","","","","","","",null,"","","","",103,"",103,"",103,"",103,""]
[{"$f":"IF(OR(J109=Translate!$B$27,OR(J109=Translate!$C$27,OR(J109=Translate!$C$28,OR(J109=Translate!$B$28)))),\"\",DB109)","v":""},null,"Select","Select","Select","Select","Select",null,null,"Selectionner","2022-03-09","","",{"$nulls":9},"","","","","","","","",null,"",0,"","",0,{"$nulls":7},"","","","","","","","","","","","","","","","",0,"","","","","","","",0,0,0,"","","","","","","","","","","","","","","","","",0,0,"","","","","","","","","","","",null,"","","","",104,"",104,"",104,"",104,""]
[{"$f":"IF(OR(J110=Translate!$B$27,OR(J110=Translate!$C$27,OR(J110=Translate!$C$28,OR(J110=Translate!$B$28)))),\"\",DB110)","v":""},null,"Select","Select","Select","Select","Select",null,null,"Selectionner","2022-03-09","","",{"$nulls":9},"","","","","","","","",null,"",0,"","",0,{"$nulls":7},"","","","","","","","","","","","","","","","",0,"","","","","","","",0,0,0,"","","","","","","","","","","","","","","","","",0,0,"","","","","","","","","","","",null,"","","","",105,"",105,"",105,"",105,""]
[{"$f":"IF(OR(J111=Translate!$B$27,OR(J111=Translate!$C$27,OR(J111=Translate!$C$28,OR(J111=Translate!$B$28)))),\"\",DB111)","v":""},null,"Select","Select","Select","Select","Select",null,null,"Selectionner","2022-03-09","","",{"$nulls":9},"","","","","","","","",null,"",0,"","",0,{"$nulls":7},"","","","","","","","","","","","","","","","",0,"","","","","","","",0,0,0,"","","","","","","","","","","","","","","","","",0,0,"","","","","","","","","","","",null,"","","","",106,"",106,"",106,"",106,""]
[{"$f":"IF(OR(J112=Translate!$B$27,OR(J112=Translate!$C$27,OR(J112=Translate!$C$28,OR(J112=Translate!$B$28)))),\"\",DB112)","v":""},null,"Select","Select","Select","Select","Select",null,null,"Selectionner","2022-03-09","","",{"$nulls":9},"","","","","","","","",null,"",0,"","",0,{"$nulls":7},"","","","","","","","","","","","","","","","",0,"","","","","","","",0,0,0,"","","","","","","","","","","","","","","","","",0,0,"","","","","","","","","","","",null,"","","","",107,"",107,"",107,"",107,""]
[{"$f":"IF(OR(J113=Translate!$B$27,OR(J113=Translate!$C$27,OR(J113=Translate!$C$28,OR(J113=Translate!$B$28)))),\"\",DB113)","v":""},null,"Select","Select","Select","Select","Select",null,null,"Selectionner","2022-03-09","","",{"$nulls":9},"","","","","","","","",null,"",0,"","",0,{"$nulls":7},"","","","","","","","","","","","","","","","",0,"","","","","","","",0,0,0,"","","","","","","","","","","","","","","","","",0,0,"","","","","","","","","","","",null,"","","","",108,"",108,"",108,"",108,""]
[{"$f":"IF(OR(J114=Translate!$B$27,OR(J114=Translate!$C$27,OR(J114=Translate!$C$28,OR(J114=Translate!$B$28)))),\"\",DB114)","v":""},null,"Select","Select","Select","Select","Select",null,null,"Selectionner","2022-03-09","","",{"$nulls":9},"","","","","","","","",null,"",0,"","",0,{"$nulls":7},"","","","","","","","","","","","","","","","",0,"","","","","","","",0,0,0,"","","","","","","","","","","","","","","","","",0,0,"","","","","","","","","","","",null,"","","","",109,"",109,"",109,"",109,""]
[{"$f":"IF(OR(J115=Translate!$B$27,OR(J115=Translate!$C$27,OR(J115=Translate!$C$28,OR(J115=Translate!$B$28)))),\"\",DB115)","v":""},null,"Select","Select","Select","Select","Select",null,null,"Selectionner","2022-03-09","","",{"$nulls":9},"","","","","","","","",null,"",0,"","",0,{"$nulls":7},"","","","","","","","","","","","","","","","",0,"","","","","","","",0,0,0,"","","","","","","","","","","","","","","","","",0,0,"","","","","","","","","","","",null,"","","","",110,"",110,"",110,"",110,""]
[{"$f":"IF(OR(J116=Translate!$B$27,OR(J116=Translate!$C$27,OR(J116=Translate!$C$28,OR(J116=Translate!$B$28)))),\"\",DB116)","v":""},null,"Select","Select","Select","Select","Select",null,null,"Selectionner","2022-03-09","","",{"$nulls":9},"","","","","","","","",null,"",0,"","",0,{"$nulls":7},"","","","","","","","","","","","","","","","",0,"","","","","","","",0,0,0,"","","","","","","","","","","","","","","","","",0,0,"","","","","","","","","","","",null,"","","","",111,"",111,"",111,"",111,""]
[{"$f":"IF(OR(J117=Translate!$B$27,OR(J117=Translate!$C$27,OR(J117=Translate!$C$28,OR(J117=Translate!$B$28)))),\"\",DB117)","v":""},null,"Select","Select","Select","Select","Select",null,null,"Selectionner","2022-03-09","","",{"$nulls":9},"","","","","","","","",null,"",0,"","",0,{"$nulls":7},"","","","","","","","","","","","","","","","",0,"","","","","","","",0,0,0,"","","","","","","","","","","","","","","","","",0,0,"","","","","","","","","","","",null,"","","","",112,"",112,"",112,"",112,""]
[{"$f":"IF(OR(J118=Translate!$B$27,OR(J118=Translate!$C$27,OR(J118=Translate!$C$28,OR(J118=Translate!$B$28)))),\"\",DB118)","v":""},null,"Select","Select","Select","Select","Select",null,null,"Selectionner","2022-03-09","","",{"$nulls":9},"","","","","","","","",null,"",0,"","",0,{"$nulls":7},"","","","","","","","","","","","","","","","",0,"","","","","","","",0,0,0,"","","","","","","","","","","","","","","","","",0,0,"","","","","","","","","","","",null,"","","","",113,"",113,"",113,"",113,""]
[{"$f":"IF(OR(J119=Translate!$B$27,OR(J119=Translate!$C$27,OR(J119=Translate!$C$28,OR(J119=Translate!$B$28)))),\"\",DB119)","v":""},null,"Select","Select","Select","Select","Select",null,null,"Selectionner","2022-03-09","","",{"$nulls":9},"","","","","","","","",null,"",0,"","",0,{"$nulls":7},"","","","","","","","","","","","","","","","",0,"","","","","","","",0,0,0,"","","","","","","","","","","","","","","","","",0,0,"","","","","","","","","","","",null,"","","","",114,"",114,"",114,"",114,""]
[{"$f":"IF(OR(J120=Translate!$B$27,OR(J120=Translate!$C$27,OR(J120=Translate!$C$28,OR(J120=Translate!$B$28)))),\"\",DB120)","v":""},null,"Select","Select","Select","Select","Select",null,null,"Selectionner","2022-03-09","","",{"$nulls":9},"","","","","","","","",null,"",0,"","",0,{"$nulls":7},"","","","","","","","","","","","","","","","",0,"","","","","","","",0,0,0,"","","","","","","","","","","","","","","","","",0,0,"","","","","","","","","","","",null,"","","","",115,"",115,"",115,"",115,""]
[{"$f":"IF(OR(J121=Translate!$B$27,OR(J121=Translate!$C$27,OR(J121=Translate!$C$28,OR(J121=Translate!$B$28)))),\"\",DB121)","v":""},null,"Select","Select","Select","Select","Select",null,null,"Selectionner","2022-03-09","","",{"$nulls":9},"","","","","","","","",null,"",0,"","",0,{"$nulls":7},"","","","","","","","","","","","","","","","",0,"","","","","","","",0,0,0,"","","","","","","","","","","","","","","","","",0,0,"","","","","","","","","","","",null,"","","","",116,"",116,"",116,"",116,""]
[{"$f":"IF(OR(J122=Translate!$B$27,OR(J122=Translate!$C$27,OR(J122=Translate!$C$28,OR(J122=Translate!$B$28)))),\"\",DB122)","v":""},null,"Select","Select","Select","Select","Select",null,null,"Selectionner","2022-03-09","","",{"$nulls":9},"","","","","","","","",null,"",0,"","",0,{"$nulls":7},"","","","","","","","","","","","","","","","",0,"","","","","","","",0,0,0,"","","","","","","","","","","","","","","","","",0,0,"","","","","","","","","","","",null,"","","","",117,"",117,"",117,"",117,""]
[{"$f":"IF(OR(J123=Translate!$B$27,OR(J123=Translate!$C$27,OR(J123=Translate!$C$28,OR(J123=Translate!$B$28)))),\"\",DB123)","v":""},null,"Select","Select","Select","Select","Select",null,null,"Selectionner","2022-03-09","","",{"$nulls":9},"","","","","","","","",null,"",0,"","",0,{"$nulls":7},"","","","","","","","","","","","","","","","",0,"","","","","","","",0,0,0,"","","","","","","","","","","","","","","","","",0,0,"","","","","","","","","","","",null,"","","","",118,"",118,"",118,"",118,""]
[{"$f":"IF(OR(J124=Translate!$B$27,OR(J124=Translate!$C$27,OR(J124=Translate!$C$28,OR(J124=Translate!$B$28)))),\"\",DB124)","v":""},null,"Select","Select","Select","Select","Select",null,null,"Selectionner","2022-03-09","","",{"$nulls":9},"","","","","","","","",null,"",0,"","",0,{"$nulls":7},"","","","","","","","","","","","","","","","",0,"","","","","","","",0,0,0,"","","","","","","","","","","","","","","","","",0,0,"","","","","","","","","","","",null,"","","","",119,"",119,"",119,"",119,""]
[{"$f":"IF(OR(J125=Translate!$B$27,OR(J125=Translate!$C$27,OR(J125=Translate!$C$28,OR(J125=Translate!$B$28)))),\"\",DB125)","v":""},null,"Select","Select","Select","Select","Select",null,null,"Selectionner","2022-03-09","","",{"$nulls":9},"","","","","","","","",null,"",0,"","",0,{"$nulls":7},"","","","","","","","","","","","","","","","",0,"","","","","","","",0,0,0,"","","","","","","","","","","","","","","","","",0,0,"","","","","","","","","","","",null,"","","","",120,"",120,"",120,"",120,""]
[{"$f":"IF(OR(J126=Translate!$B$27,OR(J126=Translate!$C$27,OR(J126=Translate!$C$28,OR(J126=Translate!$B$28)))),\"\",DB126)","v":""},null,"Select","Select","Select","Select","Select",null,null,"Selectionner","2022-03-09","","",{"$nulls":9},"","","","","","","","",null,"",0,"","",0,{"$nulls":7},"","","","","","","","","","","","","","","","",0,"","","","","","","",0,0,0,"","","","","","","","","","","","","","","","","",0,0,"","","","","","","","","","","",null,"","","","",121,"",121,"",121,"",121,""]
[{"$f":"IF(OR(J127=Translate!$B$27,OR(J127=Translate!$C$27,OR(J127=Translate!$C$28,OR(J127=Translate!$B$28)))),\"\",DB127)","v":""},null,"Select","Select","Select","Select","Select",null,null,"Selectionner","2022-03-09","","",{"$nulls":9},"","","","","","","","",null,"",0,"","",0,{"$nulls":7},"","","","","","","","","","","","","","","","",0,"","","","","","","",0,0,0,"","","","","","","","","","","","","","","","","",0,0,"","","","","","","","","","","",null,"","","","",122,"",122,"",122,"",122,""]
[{"$f":"IF(OR(J128=Translate!$B$27,OR(J128=Translate!$C$27,OR(J128=Translate!$C$28,OR(J128=Translate!$B$28)))),\"\",DB128)","v":""},null,"Select","Select","Select","Select","Select",null,null,"Selectionner","2022-03-09","","",{"$nulls":9},"","","","","","","","",null,"",0,"","",0,{"$nulls":7},"","","","","","","","","","","","","","","","",0,"","","","","","","",0,0,0,"","","","","","","","","","","","","","","","","",0,0,"","","","","","","","","","","",null,"","","","",123,"",123,"",123,"",123,""]
[{"$f":"IF(OR(J129=Translate!$B$27,OR(J129=Translate!$C$27,OR(J129=Translate!$C$28,OR(J129=Translate!$B$28)))),\"\",DB129)","v":""},null,"Select","Select","Select","Select","Select",null,null,"Selectionner","2022-03-09","","",{"$nulls":9},"","","","","","","","",null,"",0,"","",0,{"$nulls":7},"","","","","","","","","","","","","","","","",0,"","","","","","","",0,0,0,"","","","","","","","","","","","","","","","","",0,0,"","","","","","","","","","","",null,"","","","",124,"",124,"",124,"",124,""]
[{"$f":"IF(OR(J130=Translate!$B$27,OR(J130=Translate!$C$27,OR(J130=Translate!$C$28,OR(J130=Translate!$B$28)))),\"\",DB130)","v":""},null,"Select","Select","Select","Select","Select",null,null,"Selectionner","2022-03-09","","",{"$nulls":9},"","","","","","","","",null,"",0,"","",0,{"$nulls":7},"","","","","","","","","","","","","","","","",0,"","","","","","","",0,0,0,"","","","","","","","","","","","","","","","","",0,0,"","","","","","","","","","","",null,"","","","",125,"",125,"",125,"",125,""]
[{"$f":"IF(OR(J131=Translate!$B$27,OR(J131=Translate!$C$27,OR(J131=Translate!$C$28,OR(J131=Translate!$B$28)))),\"\",DB131)","v":""},null,"Select","Select","Select","Select","Select",null,null,"Selectionner","2022-03-09","","",{"$nulls":9},"","","","","","","","",null,"",0,"","",0,{"$nulls":7},"","","","","","","","","","","","","","","","",0,"","","","","","","",0,0,0,"","","","","","","","","","","","","","","","","",0,0,"","","","","","","","","","","",null,"","","","",126,"",126,"",126,"",126,""]
[{"$f":"IF(OR(J132=Translate!$B$27,OR(J132=Translate!$C$27,OR(J132=Translate!$C$28,OR(J132=Translate!$B$28)))),\"\",DB132)","v":""},null,"Select","Select","Select","Select","Select",null,null,"Selectionner","2022-03-09","","",{"$nulls":9},"","","","","","","","",null,"",0,"","",0,{"$nulls":7},"","","","","","","","","","","","","","","","",0,"","","","","","","",0,0,0,"","","","","","","","","","","","","","","","","",0,0,"","","","","","","","","","","",null,"","","","",127,"",127,"",127,"",127,""]
[{"$f":"IF(OR(J133=Translate!$B$27,OR(J133=Translate!$C$27,OR(J133=Translate!$C$28,OR(J133=Translate!$B$28)))),\"\",DB133)","v":""},null,"Select","Select","Select","Select","Select",null,null,"Selectionner","2022-03-09","","",{"$nulls":9},"","","","","","","","",null,"",0,"","",0,{"$nulls":7},"","","","","","","","","","","","","","","","",0,"","","","","","","",0,0,0,"","","","","","","","","","","","","","","","","",0,0,"","","","","","","","","","","",null,"","","","",128,"",128,"",128,"",128,""]
[{"$f":"IF(OR(J134=Translate!$B$27,OR(J134=Translate!$C$27,OR(J134=Translate!$C$28,OR(J134=Translate!$B$28)))),\"\",DB134)","v":""},null,"Select","Select","Select","Select","Select",null,null,"Selectionner","2022-03-09","","",{"$nulls":9},{"$f":"IF(B134=\"\",\"\",1)","v":""},{"$f":"IF(E134=\"Fonds Mondial\",W134,\"\")","v":""},{"$f":"IF(E134=\"CCM\",W134,\"\")","v":""},{"$f":"IF(E134=\"PNLIT\",W134,\"\")","v":""},{"$f":"IF(E134=\"MSP\",W134,\"\")","v":""},{"$f":"IF(E134=\"DPML\",W134,\"\")","v":""},{"$f":"IF(E134=\"DNSIS\",W134,\"\")","v":""},{"$f":"IF(E134=\"Autres\",W134,\"\")","v":""},null,"",0,"","",0,{"$nulls":7},{"$f":"IF(AND(F134=$AR$5,AND(BQ134=1)),1,\"\")","v":""},{"$f":"IF(AND(F134=$AS$5,AND(BQ134=1)),1,\"\")","v":""},{"$f":"IF(AND(F134=$AT$5,AND(BQ134=1)),1,\"\")","v":""},{"$f":"IF(AND(F134=$AU$5,AND(BQ134=1)),1,\"\")","v":""},{"$f":"IF(AND(F134=$AV$5,AND(BQ134=1)),1,\"\")","v":""},{"$f":"IF(AND(F134=$AW$5,AND(BQ134=1)),1,\"\")","v":""},{"$f":"IF(AND(F134=$AX$5,AND(BQ134=1)),1,\"\")","v":""},{"$f":"IF(AND(F134=$AY$5,AND(BQ134=1)),1,\"\")","v":""},{"$f":"IF(AND(F134=$AZ$5,AND(BQ134=1)),1,\"\")","v":""},{"$f":"IF(AND(F134=$BA$5,AND(BQ134=1)),1,\"\")","v":""},{"$f":"IF(AND(F134=$BB$5,AND(BQ134=1)),1,\"\")","v":""},{"$f":"IF(AND(F134=$BC$5,AND(BQ134=1)),1,\"\")","v":""},{"$f":"IF(AND(F134=$BD$5,AND(BQ134=1)),1,\"\")","v":""},{"$f":"IF(AND(F134=$BE$5,AND(BQ134=1)),1,\"\")","v":""},{"$f":"IF(AND(F134=$BF$5,AND(BQ134=1)),1,\"\")","v":""},{"$f":"IF(AND(F134=$BG$5,AND(BQ134=1)),1,\"\")","v":""},0,"","","","","","","",0,{"$f":"IF(OR(B134=\"\",OR(C134=\"Select\",OR(E134=\"Select\",OR(F134=\"Select\",OR(I134=\"\",OR(D134=\"Select\",OR(J134=\"Select\"))))))),0,1)","v":0},0,"",{"$f":"IF(C134=$BT$5,1,\"\")","v":""},{"$f":"IF(C134=$BU$5,1,\"\")","v":""},{"$f":"IF(C134=$BV$5,1,\"\")","v":""},{"$f":"IF(C134=$BW$5,1,\"\")","v":""},{"$f":"IF(C134=$BX$5,1,\"\")","v":""},{"$f":"IF(C134=$BY$5,1,\"\")","v":""},{"$f":"IF(C134=$BZ$5,1,\"\")","v":""},{"$f":"IF(C134=$CA$5,1,\"\")","v":""},{"$f":"IF(C134=$CB$5,1,\"\")","v":""},{"$f":"IF(D134=$CC$5,1,\"\")","v":""},{"$f":"IF(D134=$CD$5,1,\"\")","v":""},{"$f":"IF(D134=$CE$5,1,\"\")","v":""},{"$f":"IF(D134=$CF$5,1,\"\")","v":""},{"$f":"IF(D134=$CG$5,1,\"\")","v":""},{"$f":"IF(D134=$CH$5,1,\"\")","v":""},"",0,0,{"$f":"IF(AND(F134=$CL$5,AND(BQ134=1)),1,\"\")","v":""},{"$f":"IF(AND(F134=$CM$5,AND(BQ134=1)),1,\"\")","v":""},{"$f":"IF(AND(F134=$CN$5,AND(BQ134=1)),1,\"\")","v":""},{"$f":"IF(AND(F134=$CO$5,AND(BQ134=1)),1,\"\")","v":""},{"$f":"IF(AND(F134=$CP$5,AND(BQ134=1)),1,\"\")","v":""},{"$f":"IF(AND(F134=$CQ$5,AND(BQ134=1)),1,\"\")","v":""},{"$f":"IF(AND(F134=$CR$5,AND(BQ134=1)),1,\"\")","v":""},{"$f":"IF(AND(F134=$CS$5,AND(BQ134=1)),1,\"\")","v":""},{"$f":"IF(AND(F134=$CT$5,AND(BQ134=1)),1,\"\")","v":""},{"$f":"IF(AND(F134=$CU$5,AND(BQ134=1)),1,\"\")","v":""},{"$f":"IF(AND(F134=$CV$5,AND(BQ134=1)),1,\"\")","v":""},null,"","","","",129,"",129,"",129,"",129,""]
[{"$f":"IF(OR(J135=Translate!$B$27,OR(J135=Translate!$C$27,OR(J135=Translate!$C$28,OR(J135=Translate!$B$28)))),\"\",DB135)","v":""},null,"Select","Select","Select","Select","Select",null,null,"Selectionner",{"$f":"TODAY()","v":"2022-03-09"},{"$f":"IF(OR(I135=\"\",OR(J135=$R$14,OR(J135=$R$9))),\"\",I135-K135)","v":""},{"$f":"IF(BR135=1,L135,\"\")","v":""},{"$nulls":9},"","","","","","","","",null,{"$f":"IF(M135<0,1,\"\")","v":""},{"$f":"IF(AND(J135=\"Réalisée\",AND(M135=\"\")),1,0)","v":0},"",{"$f":"IF(AND(M135>0,M135<15),1,\"\")","v":""},{"$f":"IF(AND(J135=\"En cours\",AND(M135>14)),1,0)","v":0},{"$nulls":7},"","","","","","","","","","","","","","","","",{"$f":"BQ135","v":0},{"$f":"IF(AND(J135=$BI$5,AND(BQ135=1)),1,\"\")","v":""},{"$f":"IF(AND(J135=$BJ$5,AND(BQ135=1)),1,\"\")","v":""},{"$f":"IF(AND(J135=$BK$5,AND(BQ135=1)),1,\"\")","v":""},{"$f":"IF(AND(J135=$BL$5,AND(BQ135=1)),1,\"\")","v":""},{"$f":"IF(AND(J135=$BM$5,AND(BQ135=1)),1,\"\")","v":""},{"$f":"IF(AND(J135=$BN$5,AND(BQ135=1)),1,\"\")","v":""},{"$f":"IF(M135<0,1,\"\")","v":""},{"$f":"IF(OR(J135=$BI$5,OR(J135=$BN$5,OR(J135=$CZ$5))),1,0)","v":0},0,{"$f":"IF(OR(J135=$BI$5,OR(J135=$BM$5,OR(J135=$R$10,OR(J135=$R$15,OR(J135=$R$18))))),\"\",BQ135)","v":0},{"$f":"IF(C135=$BS$5,1,\"\")","v":""},"","","","","","","","","","","","","","","",{"$f":"IF(AND(M135>0,M135<15),1,\"\")","v":""},{"$f":"IF((M135>14),1,0)*CK135","v":0},{"$f":"IF(M135=\"\",0,1)","v":0},"","","","","","","","","","","",null,{"$f":"IF(AND(J135=$CX$5,AND(BQ135=1)),1,\"\")","v":""},{"$f":"IF(AND(J135=$CY$5,AND(BQ135=1)),1,\"\")","v":""},{"$f":"IF(AND(J135=$CZ$5,AND(BQ135=1)),1,\"\")","v":""},{"$f":"IF(AND(J135=$DA$5,AND(BQ135=1)),1,\"\")","v":""},130,{"$f":"IF(B135=\"\",\"\",B135)","v":""},{"$f":"DF135","v":130},{"$f":"IF(OR(I135=\"\",OR(J135=\"Select\")),\"\",I135)","v":""},{"$f":"DB135","v":130},{"$f":"IF(F135=\"Select\",\"\",F135)","v":""},{"$f":"DF135","v":130},{"$f":"IF(C135=\"Select\",\"\",C135)","v":""}]
[{"$f":"IF(OR(J136=Translate!$B$27,OR(J136=Translate!$C$27,OR(J136=Translate!$C$28,OR(J136=Translate!$B$28)))),\"\",DB136)","v":""},null,"Select","Select","Select","Select","Select",null,null,"Selectionner","2022-03-09","","",{"$nulls":9},"","","","","","","","",null,"",0,"","",0,{"$nulls":7},"","","","","","","","","","","","","","","","",0,"","","","","","","",0,0,0,"","","","","","","","","","","","","","","","","",0,0,"","","","","","","","","","","",null,"","","","",131,"",131,"",131,"",131,""]
[{"$f":"IF(OR(J137=Translate!$B$27,OR(J137=Translate!$C$27,OR(J137=Translate!$C$28,OR(J137=Translate!$B$28)))),\"\",DB137)","v":""},null,"Select","Select","Select","Select","Select",null,null,"Selectionner","2022-03-09","","",{"$nulls":9},"","","","","","","","",null,"",0,{"$f":"IF(J137=\"Réalisée\",AG137,\"\")","v":""},"",0,{"$nulls":7},"","","","","","","","","","","","","","","","",0,"","","","","","","",0,0,0,"","","","","","","","","","","","","","","","","",0,0,"","","","","","","","","","","",null,"","","","",132,"",132,"",132,"",132,""]
[{"$f":"IF(OR(J138=Translate!$B$27,OR(J138=Translate!$C$27,OR(J138=Translate!$C$28,OR(J138=Translate!$B$28)))),\"\",DB138)","v":""},null,"Select","Select","Select","Select","Select",null,null,"Selectionner","2022-03-09","","",{"$nulls":9},"","","","","","","","",null,"",0,"","",0,{"$nulls":7},"","","","","","","","","","","","","","","","",0,"","","","","","","",0,0,0,"","","","","","","","","","","","","","","","","",0,0,"","","","","","","","","","","",null,"","","","",133,"",133,"",133,"",133,""]
[{"$f":"IF(OR(J139=Translate!$B$27,OR(J139=Translate!$C$27,OR(J139=Translate!$C$28,OR(J139=Translate!$B$28)))),\"\",DB139)","v":""},null,"Select","Select","Select","Select","Select",null,null,"Selectionner","2022-03-09","","",{"$nulls":9},"","","","","","","","",null,"",0,"","",0,{"$nulls":7},"","","","","","","","","","","","","","","","",0,"","","","","","","",0,0,0,"","","","","","","","","","","","","","","","","",0,0,"","","","","","","","","","","",null,"","","","",134,"",134,"",134,"",134,""]
[{"$f":"IF(OR(J140=Translate!$B$27,OR(J140=Translate!$C$27,OR(J140=Translate!$C$28,OR(J140=Translate!$B$28)))),\"\",DB140)","v":""},null,"Select","Select","Select","Select","Select",null,null,"Selectionner","2022-03-09","","",{"$nulls":9},"","","","","","","","",null,"",0,"","",0,{"$nulls":7},"","","","","","","","","","","","","","","","",0,"","","","","","","",0,0,0,"","","","","","","","","","","","","","","","","",0,0,"","","","","","","","","","","",null,"","","","",135,"",135,"",135,"",135,""]
[{"$f":"IF(OR(J141=Translate!$B$27,OR(J141=Translate!$C$27,OR(J141=Translate!$C$28,OR(J141=Translate!$B$28)))),\"\",DB141)","v":""},null,"Select","Select","Select","Select","Select",null,null,"Selectionner","2022-03-09","","",{"$nulls":9},"","","","","","","","",null,"",0,"","",0,{"$nulls":7},"","","","","","","","","","","","","","","","",0,"","","","","","","",0,0,0,"","","","","","","","","","","","","","","","","",0,0,"","","","","","","","","","","",null,"","","","",136,"",136,"",136,"",136,""]
[{"$f":"IF(OR(J142=Translate!$B$27,OR(J142=Translate!$C$27,OR(J142=Translate!$C$28,OR(J142=Translate!$B$28)))),\"\",DB142)","v":""},null,"Select","Select","Select","Select","Select",null,null,"Selectionner","2022-03-09","","",{"$nulls":9},"","","","","","","","",null,"",0,"","",0,{"$nulls":7},"","","","","","","","","","","","","","","","",0,"","","","","","","",0,0,0,"","","","","","","","","","","","","","","","","",0,0,"","","","","","","","","","","",null,"","","","",137,"",137,"",137,"",137,""]
[{"$f":"IF(OR(J143=Translate!$B$27,OR(J143=Translate!$C$27,OR(J143=Translate!$C$28,OR(J143=Translate!$B$28)))),\"\",DB143)","v":""},null,"Select","Select","Select","Select","Select",null,null,"Selectionner","2022-03-09","","",{"$nulls":9},"","","","","","","","",null,"",0,"","",0,{"$nulls":7},"","","","","","","","","","","","","","","","",0,"","","","","","","",0,0,0,"","","","","","","","","","","","","","","","","",0,0,"","","","","","","","","","","",null,"","","","",138,"",138,"",138,"",138,""]
[{"$f":"IF(OR(J144=Translate!$B$27,OR(J144=Translate!$C$27,OR(J144=Translate!$C$28,OR(J144=Translate!$B$28)))),\"\",DB144)","v":""},null,"Select","Select","Select","Select","Select",null,null,"Selectionner","2022-03-09","","",{"$nulls":9},"","","","","","","","",null,"",0,"","",0,{"$nulls":7},"","","","","","","","","","","","","","","","",0,"","","","","","","",0,0,0,"","","","","","","","","","","","","","","","","",0,0,"","","","","","","","","","","",null,"","","","",139,"",139,"",139,"",139,""]
[{"$f":"IF(OR(J145=Translate!$B$27,OR(J145=Translate!$C$27,OR(J145=Translate!$C$28,OR(J145=Translate!$B$28)))),\"\",DB145)","v":""},null,"Select","Select","Select","Select","Select",null,null,"Selectionner","2022-03-09","","",{"$nulls":9},"","","","","","","","",null,"",0,"","",0,{"$nulls":7},"","","","","","","","","","","","","","","","",0,"","","","","","","",0,0,0,"","","","","","","","","","","","","","","","","",0,0,"","","","","","","","","","","",null,"","","","",140,"",140,"",140,"",140,""]
[{"$f":"IF(OR(J146=Translate!$B$27,OR(J146=Translate!$C$27,OR(J146=Translate!$C$28,OR(J146=Translate!$B$28)))),\"\",DB146)","v":""},null,"Select","Select","Select","Select","Select",null,null,"Selectionner","2022-03-09","","",{"$nulls":9},"","","","","","","","",null,"",0,"","",0,{"$nulls":7},"","","","","","","","","","","","","","","","",0,"","","","","","","",0,0,0,"","","","","","","","","","","","","","","","","",0,0,"","","","","","","","","","","",null,"","","","",141,"",141,"",141,"",141,""]
[{"$f":"IF(OR(J147=Translate!$B$27,OR(J147=Translate!$C$27,OR(J147=Translate!$C$28,OR(J147=Translate!$B$28)))),\"\",DB147)","v":""},null,"Select","Select","Select","Select","Select",null,null,"Selectionner","2022-03-09","","",{"$nulls":9},"","","","","","","","",null,"",0,"","",0,{"$nulls":7},"","","","","","","","","","","","","","","","",0,"","","","","","","",0,0,0,"","","","","","","","","","","","","","","","","",0,0,"","","","","","","","","","","",null,"","","","",142,"",142,"",142,"",142,""]
[{"$f":"IF(OR(J148=Translate!$B$27,OR(J148=Translate!$C$27,OR(J148=Translate!$C$28,OR(J148=Translate!$B$28)))),\"\",DB148)","v":""},null,"Select","Select","Select","Select","Select",null,null,"Selectionner","2022-03-09","","",{"$nulls":9},"","","","","","","","",null,"",0,"","",0,{"$nulls":7},"","","","","","","","","","","","","","","","",0,"","","","","","","",0,0,0,"","","","","","","","","","","","","","","","","",0,0,"","","","","","","","","","","",null,"","","","",143,"",143,"",143,"",143,""]
[{"$f":"IF(OR(J149=Translate!$B$27,OR(J149=Translate!$C$27,OR(J149=Translate!$C$28,OR(J149=Translate!$B$28)))),\"\",DB149)","v":""},null,"Select","Select","Select","Select","Select",null,null,"Selectionner","2022-03-09","","",{"$nulls":9},"","","","","","","","",null,"",0,"","",0,{"$nulls":7},"","","","","","","","","","","","","","","","",0,"","","","","","","",0,0,0,"","","","","","","","","","","","","","","","","",0,0,"","","","","","","","","","","",null,"","","","",144,"",144,"",144,"",144,""]
[{"$f":"IF(OR(J150=Translate!$B$27,OR(J150=Translate!$C$27,OR(J150=Translate!$C$28,OR(J150=Translate!$B$28)))),\"\",DB150)","v":""},null,"Select","Select","Select","Select","Select",null,null,"Selectionner","2022-03-09","","",{"$nulls":9},"","","","","","","","",null,"",0,"","",0,{"$nulls":7},"","","","","","","","","","","","","","","","",0,"","","","","","","",0,0,0,"","","","","","","","","","","","","","","","","",0,0,"","","","","","","","","","","",null,"","","","",145,"",145,"",145,"",145,""]
[{"$f":"IF(OR(J151=Translate!$B$27,OR(J151=Translate!$C$27,OR(J151=Translate!$C$28,OR(J151=Translate!$B$28)))),\"\",DB151)","v":""},null,"Select","Select","Select","Select","Select",null,null,"Selectionner","2022-03-09","","",{"$nulls":9},"","","","","","","","",null,"",0,"","",0,{"$nulls":7},"","","","","","","","","","","","","","","","",0,"","","","","","","",0,0,0,"","","","","","","","","","","","","","","","","",0,0,"","","","","","","","","","","",null,"","","","",146,"",146,"",146,"",146,""]
[{"$f":"IF(OR(J152=Translate!$B$27,OR(J152=Translate!$C$27,OR(J152=Translate!$C$28,OR(J152=Translate!$B$28)))),\"\",DB152)","v":""},null,"Select","Select","Select","Select","Select",null,null,"Selectionner","2022-03-09","","",{"$nulls":9},"","","","","","","","",null,"",0,"","",0,{"$nulls":7},"","","","","","","","","","","","","","","","",0,"","","","","","","",0,0,0,"","","","","","","","","","","","","","","","","",0,0,"","","","","","","","","","","",null,"","","","",147,"",147,"",147,"",147,""]
[{"$f":"IF(OR(J153=Translate!$B$27,OR(J153=Translate!$C$27,OR(J153=Translate!$C$28,OR(J153=Translate!$B$28)))),\"\",DB153)","v":""},null,"Select","Select","Select","Select","Select",null,null,"Selectionner","2022-03-09","","",{"$nulls":9},"","","","","","","","",null,"",0,"","",0,{"$nulls":7},"","","","","","","","","","","","","","","","",0,"","","","","","","",0,0,0,"","","","","","","","","","","","","","","","","",0,0,"","","","","","","","","","","",null,"","","","",148,"",148,"",148,"",148,""]
[{"$f":"IF(OR(J154=Translate!$B$27,OR(J154=Translate!$C$27,OR(J154=Translate!$C$28,OR(J154=Translate!$B$28)))),\"\",DB154)","v":""},null,"Select","Select","Select","Select","Select",null,null,"Selectionner","2022-03-09","","",{"$nulls":9},"","","","","","","","",null,"",0,"","",0,{"$nulls":7},"","","","","","","","","","","","","","","","",0,"","","","","","","",0,0,0,"","","","","","","","","","","","","","","","","",0,0,"","","","","","","","","","","",null,"","","","",149,"",149,"",149,"",149,""]
[{"$f":"IF(OR(J155=Translate!$B$27,OR(J155=Translate!$C$27,OR(J155=Translate!$C$28,OR(J155=Translate!$B$28)))),\"\",DB155)","v":""},null,"Select","Select","Select","Select","Select",null,null,"Selectionner","2022-03-09","","",{"$nulls":9},"","","","","","","","",null,"",0,"","",0,{"$nulls":7},"","","","","","","","","","","","","","","","",0,"","","","","","","",0,0,0,"","","","","","","","","","","","","","","","","",0,0,"","","","","","","","","","","",null,"","","","",150,"",150,"",150,"",150,""]
[{"$f":"IF(OR(J156=Translate!$B$27,OR(J156=Translate!$C$27,OR(J156=Translate!$C$28,OR(J156=Translate!$B$28)))),\"\",DB156)","v":""},null,"Select","Select","Select","Select","Select",null,null,"Selectionner","2022-03-09","","",{"$nulls":9},"","","","","","","","",null,"",0,"","",0,{"$nulls":7},"","","","","","","","","","","","","","","","",0,"","","","","","","",0,0,0,"","","","","","","","","","","","","","","","","",0,0,"","","","","","","","","","","",null,"","","","",151,"",151,"",151,"",151,""]
[{"$f":"IF(OR(J157=Translate!$B$27,OR(J157=Translate!$C$27,OR(J157=Translate!$C$28,OR(J157=Translate!$B$28)))),\"\",DB157)","v":""},null,"Select","Select","Select","Select","Select",null,null,"Selectionner","2022-03-09","","",{"$nulls":9},"","","","","","","","",null,"",0,"","",0,{"$nulls":7},"","","","","","","","","","","","","","","","",0,"","","","","","","",0,0,0,"","","","","","","","","","","","","","","","","",0,0,"","","","","","","","","","","",null,"","","","",152,"",152,"",152,"",152,""]
[{"$f":"IF(OR(J158=Translate!$B$27,OR(J158=Translate!$C$27,OR(J158=Translate!$C$28,OR(J158=Translate!$B$28)))),\"\",DB158)","v":""},null,"Select","Select","Select","Select","Select",null,null,"Selectionner","2022-03-09","","",{"$nulls":9},"","","","","","","","",null,"",0,"","",0,{"$nulls":7},"","","","","","","","","","","","","","","","",0,"","","","","","","",0,0,0,"","","","","","","","","","","","","","","","","",0,0,"","","","","","","","","","","",null,"","","","",153,"",153,"",153,"",153,""]
[{"$f":"IF(OR(J159=Translate!$B$27,OR(J159=Translate!$C$27,OR(J159=Translate!$C$28,OR(J159=Translate!$B$28)))),\"\",DB159)","v":""},null,"Select","Select","Select","Select","Select",null,null,"Selectionner","2022-03-09","","",{"$nulls":9},"","","","","","","","",null,"",0,"","",0,{"$nulls":7},"","","","","","","","","","","","","","","","",0,"","","","","","","",0,0,0,"","","","","","","","","","","","","","","","","",0,0,"","","","","","","","","","","",null,"","","","",154,"",154,"",154,"",154,""]
[{"$f":"IF(OR(J160=Translate!$B$27,OR(J160=Translate!$C$27,OR(J160=Translate!$C$28,OR(J160=Translate!$B$28)))),\"\",DB160)","v":""},null,"Select","Select","Select","Select","Select",null,null,"Selectionner","2022-03-09","","",{"$nulls":9},"","","","","","","","",null,"",0,"","",0,{"$nulls":7},"","","","","","","","","","","","","","","","",0,"","","","","","","",0,0,0,"","","","","","","","","","","","","","","","","",0,0,"","","","","","","","","","","",null,"","","","",155,"",155,"",155,"",155,""]
[{"$f":"IF(OR(J161=Translate!$B$27,OR(J161=Translate!$C$27,OR(J161=Translate!$C$28,OR(J161=Translate!$B$28)))),\"\",DB161)","v":""},null,"Select","Select","Select","Select","Select",null,null,"Selectionner","2022-03-09","","",{"$nulls":9},"","","","","","","","",null,"",0,"","",0,{"$nulls":7},"","","","","","","","","","","","","","","","",0,"","","","","","","",0,0,0,"","","","","","","","","","","","","","","","","",0,0,"","","","","","","","","","","",null,"","","","",156,"",156,"",156,"",156,""]
[{"$f":"IF(OR(J162=Translate!$B$27,OR(J162=Translate!$C$27,OR(J162=Translate!$C$28,OR(J162=Translate!$B$28)))),\"\",DB162)","v":""},null,"Select","Select","Select","Select","Select",null,null,"Selectionner","2022-03-09","","",{"$nulls":9},"","","","","","","","",null,"",0,"","",0,{"$nulls":7},"","","","","","","","","","","","","","","","",0,"","","","","","","",0,0,0,"","","","","","","","","","","","","","","","","",0,0,"","","","","","","","","","","",null,"","","","",157,"",157,"",157,"",157,""]
[{"$f":"IF(OR(J163=Translate!$B$27,OR(J163=Translate!$C$27,OR(J163=Translate!$C$28,OR(J163=Translate!$B$28)))),\"\",DB163)","v":""},null,"Select","Select","Select","Select","Select",null,null,"Selectionner","2022-03-09","","",{"$nulls":9},"","","","","","","","",null,"",0,"","",0,{"$nulls":7},"","","","","","","","","","","","","","","","",0,"","","","","","","",0,0,0,"","","","","","","","","","","","","","","","","",0,0,"","","","","","","","","","","",null,"","","","",158,"",158,"",158,"",158,""]
[{"$f":"IF(OR(J164=Translate!$B$27,OR(J164=Translate!$C$27,OR(J164=Translate!$C$28,OR(J164=Translate!$B$28)))),\"\",DB164)","v":""},null,"Select","Select","Select","Select","Select",null,null,"Selectionner","2022-03-09","","",{"$nulls":9},"","","","","","","","",null,"",0,"","",0,{"$nulls":7},"","","","","","","","","","","","","","","","",0,"","","","","","","",0,0,0,"","","","","","","","","","","","","","","","","",0,0,"","","","","","","","","","","",null,"","","","",159,"",159,"",159,"",159,""]
[{"$f":"IF(OR(J165=Translate!$B$27,OR(J165=Translate!$C$27,OR(J165=Translate!$C$28,OR(J165=Translate!$B$28)))),\"\",DB165)","v":""},null,"Select","Select","Select","Select","Select",null,null,"Selectionner","2022-03-09","","",{"$nulls":9},"","","","","","","","",null,"",0,"","",0,{"$nulls":7},"","","","","","","","","","","","","","","","",0,"","","","","","","",0,0,0,"","","","","","","","","","","","","","","","","",0,0,"","","","","","","","","","","",null,"","","","",160,"",160,"",160,"",160,""]
[{"$f":"IF(OR(J166=Translate!$B$27,OR(J166=Translate!$C$27,OR(J166=Translate!$C$28,OR(J166=Translate!$B$28)))),\"\",DB166)","v":""},null,"Select","Select","Select","Select","Select",null,null,"Selectionner","2022-03-09","","",{"$nulls":9},"","","","","","","","",null,"",0,"","",0,{"$nulls":7},"","","","","","","","","","","","","","","","",0,"","","","","","","",0,0,0,"","","","","","","","","","","","","","","","","",0,0,"","","","","","","","","","","",null,"","","","",161,"",161,"",161,"",161,""]
[{"$f":"IF(OR(J167=Translate!$B$27,OR(J167=Translate!$C$27,OR(J167=Translate!$C$28,OR(J167=Translate!$B$28)))),\"\",DB167)","v":""},null,"Select","Select","Select","Select","Select",null,null,"Selectionner","2022-03-09","","",{"$nulls":9},"","","","","","","","",null,"",0,"","",0,{"$nulls":7},"","","","","","","","","","","","","","","","",0,"","","","","","","",0,0,0,"","","","","","","","","","","","","","","","","",0,0,"","","","","","","","","","","",null,"","","","",162,"",162,"",162,"",162,""]
[{"$f":"IF(OR(J168=Translate!$B$27,OR(J168=Translate!$C$27,OR(J168=Translate!$C$28,OR(J168=Translate!$B$28)))),\"\",DB168)","v":""},null,"Select","Select","Select","Select","Select",null,null,"Selectionner","2022-03-09","","",{"$nulls":9},"","","","","","","","",null,"",0,"","",0,{"$nulls":7},"","","","","","","","","","","","","","","","",0,"","","","","","","",0,0,0,"","","","","","","","","","","","","","","","","",0,0,"","","","","","","","","","","",null,"","","","",163,"",163,"",163,"",163,""]
[{"$f":"IF(OR(J169=Translate!$B$27,OR(J169=Translate!$C$27,OR(J169=Translate!$C$28,OR(J169=Translate!$B$28)))),\"\",DB169)","v":""},null,"Select","Select","Select","Select","Select",null,null,"Selectionner","2022-03-09","","",{"$nulls":9},"","","","","","","","",null,"",0,"","",0,{"$nulls":7},"","","","","","","","","","","","","","","","",0,"","","","","","","",0,0,0,"","","","","","","","","","","","","","","","","",0,0,"","","","","","","","","","","",null,"","","","",164,"",164,"",164,"",164,""]
[{"$f":"IF(OR(J170=Translate!$B$27,OR(J170=Translate!$C$27,OR(J170=Translate!$C$28,OR(J170=Translate!$B$28)))),\"\",DB170)","v":""},null,"Select","Select","Select","Select","Select",null,null,"Selectionner","2022-03-09","","",{"$nulls":9},"","","","","","","","",null,"",0,"","",0,{"$nulls":7},"","","","","","","","","","","","","","","","",0,"","","","","","","",0,0,0,"","","","","","","","","","","","","","","","","",0,0,"","","","","","","","","","","",null,"","","","",165,"",165,"",165,"",165,""]
[{"$f":"IF(OR(J171=Translate!$B$27,OR(J171=Translate!$C$27,OR(J171=Translate!$C$28,OR(J171=Translate!$B$28)))),\"\",DB171)","v":""},null,"Select","Select","Select","Select","Select",null,null,"Selectionner","2022-03-09","","",{"$nulls":9},"","","","","","","","",null,"",0,"","",0,{"$nulls":7},"","","","","","","","","","","","","","","","",0,"","","","","","","",0,0,0,"","","","","","","","","","","","","","","","","",0,0,"","","","","","","","","","","",null,"","","","",166,"",166,"",166,"",166,""]
[{"$f":"IF(OR(J172=Translate!$B$27,OR(J172=Translate!$C$27,OR(J172=Translate!$C$28,OR(J172=Translate!$B$28)))),\"\",DB172)","v":""},null,"Select","Select","Select","Select","Select",null,null,"Selectionner","2022-03-09","","",{"$nulls":9},"","","","","","","","",null,"",0,"","",0,{"$nulls":7},"","","","","","","","","","","","","","","","",0,"","","","","","","",0,0,0,"","","","","","","","","","","","","","","","","",0,0,"","","","","","","","","","","",null,"","","","",167,"",167,"",167,"",167,""]
[{"$f":"IF(OR(J173=Translate!$B$27,OR(J173=Translate!$C$27,OR(J173=Translate!$C$28,OR(J173=Translate!$B$28)))),\"\",DB173)","v":""},null,"Select","Select","Select","Select","Select",null,null,"Selectionner","2022-03-09","","",{"$nulls":9},"","","","","","","","",null,"",0,"","",0,{"$nulls":7},"","","","","","","","","","","","","","","","",0,"","","","","","","",0,0,0,"","","","","","","","","","","","","","","","","",0,0,"","","","","","","","","","","",null,"","","","",168,"",168,"",168,"",168,""]
[{"$f":"IF(OR(J174=Translate!$B$27,OR(J174=Translate!$C$27,OR(J174=Translate!$C$28,OR(J174=Translate!$B$28)))),\"\",DB174)","v":""},null,"Select","Select","Select","Select","Select",null,null,"Selectionner","2022-03-09","","",{"$nulls":9},"","","","","","","","",null,"",0,"","",0,{"$nulls":7},"","","","","","","","","","","","","","","","",0,"","","","","","","",0,0,0,"","","","","","","","","","","","","","","","","",0,0,"","","","","","","","","","","",null,"","","","",169,"",169,"",169,"",169,""]
[{"$f":"IF(OR(J175=Translate!$B$27,OR(J175=Translate!$C$27,OR(J175=Translate!$C$28,OR(J175=Translate!$B$28)))),\"\",DB175)","v":""},null,"Select","Select","Select","Select","Select",null,null,"Selectionner","2022-03-09","","",{"$nulls":9},"","","","","","","","",null,"",0,"","",0,{"$nulls":7},"","","","","","","","","","","","","","","","",0,"","","","","","","",0,0,0,"","","","","","","","","","","","","","","","","",0,0,"","","","","","","","","","","",null,"","","","",170,"",170,"",170,"",170,""]
[{"$f":"IF(OR(J176=Translate!$B$27,OR(J176=Translate!$C$27,OR(J176=Translate!$C$28,OR(J176=Translate!$B$28)))),\"\",DB176)","v":""},null,"Select","Select","Select","Select","Select",null,null,"Selectionner","2022-03-09","","",{"$nulls":9},"","","","","","","","",null,"",0,"","",0,{"$nulls":7},"","","","","","","","","","","","","","","","",0,"","","","","","","",0,0,0,"","","","","","","","","","","","","","","","","",0,0,"","","","","","","","","","","",null,"","","","",171,"",171,"",171,"",171,""]
[{"$f":"IF(OR(J177=Translate!$B$27,OR(J177=Translate!$C$27,OR(J177=Translate!$C$28,OR(J177=Translate!$B$28)))),\"\",DB177)","v":""},null,"Select","Select","Select","Select","Select",null,null,"Selectionner","2022-03-09","","",{"$nulls":9},"","","","","","","","",null,"",0,"","",0,{"$nulls":7},"","","","","","","","","","","","","","","","",0,"","","","","","","",0,0,0,"","","","","","","","","","","","","","","","","",0,0,"","","","","","","","","","","",null,"","","","",172,"",172,"",172,"",172,""]
[{"$f":"IF(OR(J178=Translate!$B$27,OR(J178=Translate!$C$27,OR(J178=Translate!$C$28,OR(J178=Translate!$B$28)))),\"\",DB178)","v":""},null,"Select","Select","Select","Select","Select",null,null,"Selectionner","2022-03-09","","",{"$nulls":9},"","","","","","","","",null,"",0,"","",0,{"$nulls":7},"","","","","","","","","","","","","","","","",0,"","","","","","","",0,0,0,"","","","","","","","","","","","","","","","","",0,0,"","","","","","","","","","","",null,"","","","",173,"",173,"",173,"",173,""]
[{"$f":"IF(OR(J179=Translate!$B$27,OR(J179=Translate!$C$27,OR(J179=Translate!$C$28,OR(J179=Translate!$B$28)))),\"\",DB179)","v":""},null,"Select","Select","Select","Select","Select",null,null,"Selectionner","2022-03-09","","",{"$nulls":9},"","","","","","","","",null,"",0,"","",0,{"$nulls":7},"","","","","","","","","","","","","","","","",0,"","","","","","","",0,0,0,"","","","","","","","","","","","","","","","","",0,0,"","","","","","","","","","","",null,"","","","",174,"",174,"",174,"",174,""]
[{"$f":"IF(OR(J180=Translate!$B$27,OR(J180=Translate!$C$27,OR(J180=Translate!$C$28,OR(J180=Translate!$B$28)))),\"\",DB180)","v":""},null,"Select","Select","Select","Select","Select",null,null,"Selectionner","2022-03-09","","",{"$nulls":9},"","","","","","","","",null,"",0,"","",0,{"$nulls":7},"","","","","","","","","","","","","","","","",0,"","","","","","","",0,0,0,"","","","","","","","","","","","","","","","","",0,0,"","","","","","","","","","","",null,"","","","",175,"",175,"",175,"",175,""]
[{"$f":"IF(OR(J181=Translate!$B$27,OR(J181=Translate!$C$27,OR(J181=Translate!$C$28,OR(J181=Translate!$B$28)))),\"\",DB181)","v":""},null,"Select","Select","Select","Select","Select",null,null,"Selectionner","2022-03-09","","",{"$nulls":9},"","","","","","","","",null,"",0,"","",0,{"$nulls":7},"","","","","","","","","","","","","","","","",0,"","","","","","","",0,0,0,"","","","","","","","","","","","","","","","","",0,0,"","","","","","","","","","","",null,"","","","",176,"",176,"",176,"",176,""]
[{"$f":"IF(OR(J182=Translate!$B$27,OR(J182=Translate!$C$27,OR(J182=Translate!$C$28,OR(J182=Translate!$B$28)))),\"\",DB182)","v":""},null,"Select","Select","Select","Select","Select",null,null,"Selectionner","2022-03-09","","",{"$nulls":9},"","","","","","","","",null,"",0,"","",0,{"$nulls":7},"","","","","","","","","","","","","","","","",0,"","","","","","","",0,0,0,"","","","","","","","","","","","","","","","","",0,0,"","","","","","","","","","","",null,"","","","",177,"",177,"",177,"",177,""]
[{"$f":"IF(OR(J183=Translate!$B$27,OR(J183=Translate!$C$27,OR(J183=Translate!$C$28,OR(J183=Translate!$B$28)))),\"\",DB183)","v":""},null,"Select","Select","Select","Select","Select",null,null,"Selectionner","2022-03-09","","",{"$nulls":9},"","","","","","","","",null,"",0,"","",0,{"$nulls":7},"","","","","","","","","","","","","","","","",0,"","","","","","","",0,0,0,"","","","","","","","","","","","","","","","","",0,0,"","","","","","","","","","","",null,"","","","",178,"",178,"",178,"",178,""]
[{"$f":"IF(OR(J184=Translate!$B$27,OR(J184=Translate!$C$27,OR(J184=Translate!$C$28,OR(J184=Translate!$B$28)))),\"\",DB184)","v":""},null,"Select","Select","Select","Select","Select",null,null,"Selectionner","2022-03-09","","",{"$nulls":9},"","","","","","","","",null,"",0,"","",0,{"$nulls":7},"","","","","","","","","","","","","","","","",0,"","","","","","","",0,0,0,"","","","","","","","","","","","","","","","","",0,0,"","","","","","","","","","","",null,"","","","",179,"",179,"",179,"",179,""]
[{"$f":"IF(OR(J185=Translate!$B$27,OR(J185=Translate!$C$27,OR(J185=Translate!$C$28,OR(J185=Translate!$B$28)))),\"\",DB185)","v":""},null,"Select","Select","Select","Select","Select",null,null,"Selectionner","2022-03-09","","",{"$nulls":9},"","","","","","","","",null,"",0,"","",0,{"$nulls":7},"","","","","","","","","","","","","","","","",0,"","","","","","","",0,0,0,"","","","","","","","","","","","","","","","","",0,0,"","","","","","","","","","","",null,"","","","",180,"",180,"",180,"",180,""]
[{"$f":"IF(OR(J186=Translate!$B$27,OR(J186=Translate!$C$27,OR(J186=Translate!$C$28,OR(J186=Translate!$B$28)))),\"\",DB186)","v":""},null,"Select","Select","Select","Select","Select",null,null,"Selectionner","2022-03-09","","",{"$nulls":9},"","","","","","","","",null,"",0,"","",0,{"$nulls":7},"","","","","","","","","","","","","","","","",0,"","","","","","","",0,0,0,"","","","","","","","","","","","","","","","","",0,0,"","","","","","","","","","","",null,"","","","",181,"",181,"",181,"",181,""]
[{"$f":"IF(OR(J187=Translate!$B$27,OR(J187=Translate!$C$27,OR(J187=Translate!$C$28,OR(J187=Translate!$B$28)))),\"\",DB187)","v":""},null,"Select","Select","Select","Select","Select",null,null,"Selectionner","2022-03-09","","",{"$nulls":9},"","","","","","","","",null,"",0,"","",0,{"$nulls":7},"","","","","","","","","","","","","","","","",0,"","","","","","","",0,0,0,"","","","","","","","","","","","","","","","","",0,0,"","","","","","","","","","","",null,"","","","",182,"",182,"",182,"",182,""]
[{"$f":"IF(OR(J188=Translate!$B$27,OR(J188=Translate!$C$27,OR(J188=Translate!$C$28,OR(J188=Translate!$B$28)))),\"\",DB188)","v":""},null,"Select","Select","Select","Select","Select",null,null,"Selectionner","2022-03-09","","",{"$nulls":9},"","","","","","","","",null,"",0,"","",0,{"$nulls":7},"","","","","","","","","","","","","","","","",0,"","","","","","","",0,0,0,"","","","","","","","","","","","","","","","","",0,0,"","","","","","","","","","","",null,"","","","",183,"",183,"",183,"",183,""]
[{"$f":"IF(OR(J189=Translate!$B$27,OR(J189=Translate!$C$27,OR(J189=Translate!$C$28,OR(J189=Translate!$B$28)))),\"\",DB189)","v":""},null,"Select","Select","Select","Select","Select",null,null,"Selectionner","2022-03-09","","",{"$nulls":9},"","","","","","","","",null,"",0,"","",0,{"$nulls":7},"","","","","","","","","","","","","","","","",0,"","","","","","","",0,0,0,"","","","","","","","","","","","","","","","","",0,0,"","","","","","","","","","","",null,"","","","",184,"",184,"",184,"",184,""]
[{"$f":"IF(OR(J190=Translate!$B$27,OR(J190=Translate!$C$27,OR(J190=Translate!$C$28,OR(J190=Translate!$B$28)))),\"\",DB190)","v":""},null,"Select","Select","Select","Select","Select",null,null,"Selectionner","2022-03-09","","",{"$nulls":9},"","","","","","","","",null,"",0,"","",0,{"$nulls":7},"","","","","","","","","","","","","","","","",0,"","","","","","","",0,0,0,"","","","","","","","","","","","","","","","","",0,0,"","","","","","","","","","","",null,"","","","",185,"",185,"",185,"",185,""]
[{"$f":"IF(OR(J191=Translate!$B$27,OR(J191=Translate!$C$27,OR(J191=Translate!$C$28,OR(J191=Translate!$B$28)))),\"\",DB191)","v":""},null,"Select","Select","Select","Select","Select",null,null,"Selectionner","2022-03-09","","",{"$nulls":9},"","","","","","","","",null,"",0,"","",0,{"$nulls":7},"","","","","","","","","","","","","","","","",0,"","","","","","","",0,0,0,"","","","","","","","","","","","","","","","","",0,0,"","","","","","","","","","","",null,"","","","",186,"",186,"",186,"",186,""]
[{"$f":"IF(OR(J192=Translate!$B$27,OR(J192=Translate!$C$27,OR(J192=Translate!$C$28,OR(J192=Translate!$B$28)))),\"\",DB192)","v":""},null,"Select","Select","Select","Select","Select",null,null,"Selectionner","2022-03-09","","",{"$nulls":9},"","","","","","","","",null,"",0,"","",0,{"$nulls":7},"","","","","","","","","","","","","","","","",0,"","","","","","","",0,0,0,"","","","","","","","","","","","","","","","","",0,0,"","","","","","","","","","","",null,"","","","",187,"",187,"",187,"",187,""]
[{"$f":"IF(OR(J193=Translate!$B$27,OR(J193=Translate!$C$27,OR(J193=Translate!$C$28,OR(J193=Translate!$B$28)))),\"\",DB193)","v":""},null,"Select","Select","Select","Select","Select",null,null,"Selectionner","2022-03-09","","",{"$nulls":9},"","","","","","","","",null,"",0,"","",0,{"$nulls":7},"","","","","","","","","","","","","","","","",0,"","","","","","","",0,0,0,"","","","","","","","","","","","","","","","","",0,0,"","","","","","","","","","","",null,"","","","",188,"",188,"",188,"",188,""]
[{"$f":"IF(OR(J194=Translate!$B$27,OR(J194=Translate!$C$27,OR(J194=Translate!$C$28,OR(J194=Translate!$B$28)))),\"\",DB194)","v":""},null,"Select","Select","Select","Select","Select",null,null,"Selectionner","2022-03-09","","",{"$nulls":9},"","","","","","","","",null,"",0,"","",0,{"$nulls":7},"","","","","","","","","","","","","","","","",0,"","","","","","","",0,0,0,"","","","","","","","","","","","","","","","","",0,0,"","","","","","","","","","","",null,"","","","",189,"",189,"",189,"",189,""]
[{"$f":"IF(OR(J195=Translate!$B$27,OR(J195=Translate!$C$27,OR(J195=Translate!$C$28,OR(J195=Translate!$B$28)))),\"\",DB195)","v":""},null,"Select","Select","Select","Select","Select",null,null,"Selectionner","2022-03-09","","",{"$nulls":9},"","","","","","","","",null,"",0,"","",0,{"$nulls":7},"","","","","","","","","","","","","","","","",0,"","","","","","","",0,0,0,"","","","","","","","","","","","","","","","","",0,0,"","","","","","","","","","","",null,"","","","",190,"",190,"",190,"",190,""]
[{"$f":"IF(OR(J196=Translate!$B$27,OR(J196=Translate!$C$27,OR(J196=Translate!$C$28,OR(J196=Translate!$B$28)))),\"\",DB196)","v":""},null,"Select","Select","Select","Select","Select",null,null,"Selectionner","2022-03-09","","",{"$nulls":9},"","","","","","","","",null,"",0,"","",0,{"$nulls":7},"","","","","","","","","","","","","","","","",0,"","","","","","","",0,0,0,"","","","","","","","","","","","","","","","","",0,0,"","","","","","","","","","","",null,"","","","",191,"",191,"",191,"",191,""]
[{"$f":"IF(OR(J197=Translate!$B$27,OR(J197=Translate!$C$27,OR(J197=Translate!$C$28,OR(J197=Translate!$B$28)))),\"\",DB197)","v":""},null,"Select","Select","Select","Select","Select",null,null,"Selectionner","2022-03-09","","",{"$nulls":9},"","","","","","","","",null,"",0,"","",0,{"$nulls":7},"","","","","","","","","","","","","","","","",0,"","","","","","","",0,0,0,"","","","","","","","","","","","","","","","","",0,0,"","","","","","","","","","","",null,"","","","",192,"",192,"",192,"",192,""]
[{"$f":"IF(OR(J198=Translate!$B$27,OR(J198=Translate!$C$27,OR(J198=Translate!$C$28,OR(J198=Translate!$B$28)))),\"\",DB198)","v":""},null,"Select","Select","Select","Select","Select",null,null,"Selectionner","2022-03-09","","",{"$nulls":9},{"$f":"IF(B198=\"\",\"\",1)","v":""},{"$f":"IF(E198=\"Fonds Mondial\",W198,\"\")","v":""},{"$f":"IF(E198=\"CCM\",W198,\"\")","v":""},{"$f":"IF(E198=\"PNLIT\",W198,\"\")","v":""},{"$f":"IF(E198=\"MSP\",W198,\"\")","v":""},{"$f":"IF(E198=\"DPML\",W198,\"\")","v":""},{"$f":"IF(E198=\"DNSIS\",W198,\"\")","v":""},{"$f":"IF(E198=\"Autres\",W198,\"\")","v":""},null,"",0,"","",0,{"$nulls":7},{"$f":"IF(AND(F198=$AR$5,AND(BQ198=1)),1,\"\")","v":""},{"$f":"IF(AND(F198=$AS$5,AND(BQ198=1)),1,\"\")","v":""},{"$f":"IF(AND(F198=$AT$5,AND(BQ198=1)),1,\"\")","v":""},{"$f":"IF(AND(F198=$AU$5,AND(BQ198=1)),1,\"\")","v":""},{"$f":"IF(AND(F198=$AV$5,AND(BQ198=1)),1,\"\")","v":""},{"$f":"IF(AND(F198=$AW$5,AND(BQ198=1)),1,\"\")","v":""},{"$f":"IF(AND(F198=$AX$5,AND(BQ198=1)),1,\"\")","v":""},{"$f":"IF(AND(F198=$AY$5,AND(BQ198=1)),1,\"\")","v":""},{"$f":"IF(AND(F198=$AZ$5,AND(BQ198=1)),1,\"\")","v":""},{"$f":"IF(AND(F198=$BA$5,AND(BQ198=1)),1,\"\")","v":""},{"$f":"IF(AND(F198=$BB$5,AND(BQ198=1)),1,\"\")","v":""},{"$f":"IF(AND(F198=$BC$5,AND(BQ198=1)),1,\"\")","v":""},{"$f":"IF(AND(F198=$BD$5,AND(BQ198=1)),1,\"\")","v":""},{"$f":"IF(AND(F198=$BE$5,AND(BQ198=1)),1,\"\")","v":""},{"$f":"IF(AND(F198=$BF$5,AND(BQ198=1)),1,\"\")","v":""},{"$f":"IF(AND(F198=$BG$5,AND(BQ198=1)),1,\"\")","v":""},0,"","","","","","","",0,{"$f":"IF(OR(B198=\"\",OR(C198=\"Select\",OR(E198=\"Select\",OR(F198=\"Select\",OR(I198=\"\",OR(D198=\"Select\",OR(J198=\"Select\"))))))),0,1)","v":0},0,"",{"$f":"IF(C198=$BT$5,1,\"\")","v":""},{"$f":"IF(C198=$BU$5,1,\"\")","v":""},{"$f":"IF(C198=$BV$5,1,\"\")","v":""},{"$f":"IF(C198=$BW$5,1,\"\")","v":""},{"$f":"IF(C198=$BX$5,1,\"\")","v":""},{"$f":"IF(C198=$BY$5,1,\"\")","v":""},{"$f":"IF(C198=$BZ$5,1,\"\")","v":""},{"$f":"IF(C198=$CA$5,1,\"\")","v":""},{"$f":"IF(C198=$CB$5,1,\"\")","v":""},{"$f":"IF(D198=$CC$5,1,\"\")","v":""},{"$f":"IF(D198=$CD$5,1,\"\")","v":""},{"$f":"IF(D198=$CE$5,1,\"\")","v":""},{"$f":"IF(D198=$CF$5,1,\"\")","v":""},{"$f":"IF(D198=$CG$5,1,\"\")","v":""},{"$f":"IF(D198=$CH$5,1,\"\")","v":""},"",0,0,{"$f":"IF(AND(F198=$CL$5,AND(BQ198=1)),1,\"\")","v":""},{"$f":"IF(AND(F198=$CM$5,AND(BQ198=1)),1,\"\")","v":""},{"$f":"IF(AND(F198=$CN$5,AND(BQ198=1)),1,\"\")","v":""},{"$f":"IF(AND(F198=$CO$5,AND(BQ198=1)),1,\"\")","v":""},{"$f":"IF(AND(F198=$CP$5,AND(BQ198=1)),1,\"\")","v":""},{"$f":"IF(AND(F198=$CQ$5,AND(BQ198=1)),1,\"\")","v":""},{"$f":"IF(AND(F198=$CR$5,AND(BQ198=1)),1,\"\")","v":""},{"$f":"IF(AND(F198=$CS$5,AND(BQ198=1)),1,\"\")","v":""},{"$f":"IF(AND(F198=$CT$5,AND(BQ198=1)),1,\"\")","v":""},{"$f":"IF(AND(F198=$CU$5,AND(BQ198=1)),1,\"\")","v":""},{"$f":"IF(AND(F198=$CV$5,AND(BQ198=1)),1,\"\")","v":""},null,"","","","",193,"",193,"",193,"",193,""]
[{"$f":"IF(OR(J199=Translate!$B$27,OR(J199=Translate!$C$27,OR(J199=Translate!$C$28,OR(J199=Translate!$B$28)))),\"\",DB199)","v":""},null,"Select","Select","Select","Select","Select",null,null,"Selectionner",{"$f":"TODAY()","v":"2022-03-09"},{"$f":"IF(OR(I199=\"\",OR(J199=$R$14,OR(J199=$R$9))),\"\",I199-K199)","v":""},{"$f":"IF(BR199=1,L199,\"\")","v":""},{"$nulls":9},"","","","","","","","",null,{"$f":"IF(M199<0,1,\"\")","v":""},{"$f":"IF(AND(J199=\"Réalisée\",AND(M199=\"\")),1,0)","v":0},"",{"$f":"IF(AND(M199>0,M199<15),1,\"\")","v":""},{"$f":"IF(AND(J199=\"En cours\",AND(M199>14)),1,0)","v":0},{"$nulls":7},"","","","","","","","","","","","","","","","",{"$f":"BQ199","v":0},{"$f":"IF(AND(J199=$BI$5,AND(BQ199=1)),1,\"\")","v":""},{"$f":"IF(AND(J199=$BJ$5,AND(BQ199=1)),1,\"\")","v":""},{"$f":"IF(AND(J199=$BK$5,AND(BQ199=1)),1,\"\")","v":""},{"$f":"IF(AND(J199=$BL$5,AND(BQ199=1)),1,\"\")","v":""},{"$f":"IF(AND(J199=$BM$5,AND(BQ199=1)),1,\"\")","v":""},{"$f":"IF(AND(J199=$BN$5,AND(BQ199=1)),1,\"\")","v":""},{"$f":"IF(M199<0,1,\"\")","v":""},{"$f":"IF(OR(J199=$BI$5,OR(J199=$BN$5,OR(J199=$CZ$5))),1,0)","v":0},0,{"$f":"IF(OR(J199=$BI$5,OR(J199=$BM$5,OR(J199=$R$10,OR(J199=$R$15,OR(J199=$R$18))))),\"\",BQ199)","v":0},{"$f":"IF(C199=$BS$5,1,\"\")","v":""},"","","","","","","","","","","","","","","",{"$f":"IF(AND(M199>0,M199<15),1,\"\")","v":""},{"$f":"IF((M199>14),1,0)*CK199","v":0},{"$f":"IF(M199=\"\",0,1)","v":0},"","","","","","","","","","","",null,{"$f":"IF(AND(J199=$CX$5,AND(BQ199=1)),1,\"\")","v":""},{"$f":"IF(AND(J199=$CY$5,AND(BQ199=1)),1,\"\")","v":""},{"$f":"IF(AND(J199=$CZ$5,AND(BQ199=1)),1,\"\")","v":""},{"$f":"IF(AND(J199=$DA$5,AND(BQ199=1)),1,\"\")","v":""},194,{"$f":"IF(B199=\"\",\"\",B199)","v":""},{"$f":"DF199","v":194},{"$f":"IF(OR(I199=\"\",OR(J199=\"Select\")),\"\",I199)","v":""},{"$f":"DB199","v":194},{"$f":"IF(F199=\"Select\",\"\",F199)","v":""},{"$f":"DF199","v":194},{"$f":"IF(C199=\"Select\",\"\",C199)","v":""}]
[{"$f":"IF(OR(J200=Translate!$B$27,OR(J200=Translate!$C$27,OR(J200=Translate!$C$28,OR(J200=Translate!$B$28)))),\"\",DB200)","v":""},null,"Select","Select","Select","Select","Select",null,null,"Selectionner","2022-03-09","","",{"$nulls":9},"","","","","","","","",null,"",0,"","",0,{"$nulls":7},"","","","","","","","","","","","","","","","",0,"","","","","","","",0,0,0,"","","","","","","","","","","","","","","","","",0,0,"","","","","","","","","","","",null,"","","","",195,"",195,"",195,"",195,""]
[{"$f":"IF(OR(J201=Translate!$B$27,OR(J201=Translate!$C$27,OR(J201=Translate!$C$28,OR(J201=Translate!$B$28)))),\"\",DB201)","v":""},null,"Select","Select","Select","Select","Select",null,null,"Selectionner","2022-03-09","","",{"$nulls":9},"","","","","","","","",null,"",0,{"$f":"IF(J201=\"Réalisée\",AG201,\"\")","v":""},"",0,{"$nulls":7},"","","","","","","","","","","","","","","","",0,"","","","","","","",0,0,0,"","","","","","","","","","","","","","","","","",0,0,"","","","","","","","","","","",null,"","","","",196,"",196,"",196,"",196,""]
[{"$f":"IF(OR(J202=Translate!$B$27,OR(J202=Translate!$C$27,OR(J202=Translate!$C$28,OR(J202=Translate!$B$28)))),\"\",DB202)","v":""},null,"Select","Select","Select","Select","Select",null,null,"Selectionner","2022-03-09","","",{"$nulls":9},"","","","","","","","",null,"",0,"","",0,{"$nulls":7},"","","","","","","","","","","","","","","","",0,"","","","","","","",0,0,0,"","","","","","","","","","","","","","","","","",0,0,"","","","","","","","","","","",null,"","","","",197,"",197,"",197,"",197,""]
[{"$f":"IF(OR(J203=Translate!$B$27,OR(J203=Translate!$C$27,OR(J203=Translate!$C$28,OR(J203=Translate!$B$28)))),\"\",DB203)","v":""},null,"Select","Select","Select","Select","Select",null,null,"Selectionner","2022-03-09","","",{"$nulls":9},"","","","","","","","",null,"",0,"","",0,{"$nulls":7},"","","","","","","","","","","","","","","","",0,"","","","","","","",0,0,0,"","","","","","","","","","","","","","","","","",0,0,"","","","","","","","","","","",null,"","","","",198,"",198,"",198,"",198,""]
[{"$f":"IF(OR(J204=Translate!$B$27,OR(J204=Translate!$C$27,OR(J204=Translate!$C$28,OR(J204=Translate!$B$28)))),\"\",DB204)","v":""},null,"Select","Select","Select","Select","Select",null,null,"Selectionner","2022-03-09","","",{"$nulls":9},"","","","","","","","",null,"",0,"","",0,{"$nulls":7},"","","","","","","","","","","","","","","","",0,"","","","","","","",0,0,0,"","","","","","","","","","","","","","","","","",0,0,"","","","","","","","","","","",null,"","","","",199,"",199,"",199,"",199,""]
[{"$f":"IF(OR(J205=Translate!$B$27,OR(J205=Translate!$C$27,OR(J205=Translate!$C$28,OR(J205=Translate!$B$28)))),\"\",DB205)","v":""},null,"Select","Select","Select","Select","Select",null,null,"Selectionner","2022-03-09","","",{"$nulls":9},"","","","","","","","",null,"",0,"","",0,{"$nulls":7},"","","","","","","","","","","","","","","","",0,"","","","","","","",0,0,0,"","","","","","","","","","","","","","","","","",0,0,"","","","","","","","","","","",null,"","","","",200,"",200,"",200,"",200,""]
[{"$f":"IF(OR(J206=Translate!$B$27,OR(J206=Translate!$C$27,OR(J206=Translate!$C$28,OR(J206=Translate!$B$28)))),\"\",DB206)","v":""},null,"Select","Select","Select","Select","Select",null,null,"Selectionner","2022-03-09","","",{"$nulls":9},"","","","","","","","",null,"",0,"","",0,{"$nulls":7},"","","","","","","","","","","","","","","","",0,"","","","","","","",0,0,0,"","","","","","","","","","","","","","","","","",0,0,"","","","","","","","","","","",null,"","","","",201,"",201,"",201,"",201,""]
[{"$f":"IF(OR(J207=Translate!$B$27,OR(J207=Translate!$C$27,OR(J207=Translate!$C$28,OR(J207=Translate!$B$28)))),\"\",DB207)","v":""},null,"Select","Select","Select","Select","Select",null,null,"Selectionner","2022-03-09","","",{"$nulls":9},"","","","","","","","",null,"",0,"","",0,{"$nulls":7},"","","","","","","","","","","","","","","","",0,"","","","","","","",0,0,0,"","","","","","","","","","","","","","","","","",0,0,"","","","","","","","","","","",null,"","","","",202,"",202,"",202,"",202,""]
[{"$f":"IF(OR(J208=Translate!$B$27,OR(J208=Translate!$C$27,OR(J208=Translate!$C$28,OR(J208=Translate!$B$28)))),\"\",DB208)","v":""},null,"Select","Select","Select","Select","Select",null,null,"Selectionner","2022-03-09","","",{"$nulls":9},"","","","","","","","",null,"",0,"","",0,{"$nulls":7},"","","","","","","","","","","","","","","","",0,"","","","","","","",0,0,0,"","","","","","","","","","","","","","","","","",0,0,"","","","","","","","","","","",null,"","","","",203,"",203,"",203,"",203,""]
[{"$f":"IF(OR(J209=Translate!$B$27,OR(J209=Translate!$C$27,OR(J209=Translate!$C$28,OR(J209=Translate!$B$28)))),\"\",DB209)","v":""},null,"Select","Select","Select","Select","Select",null,null,"Selectionner","2022-03-09","","",{"$nulls":9},"","","","","","","","",null,"",0,"","",0,{"$nulls":7},"","","","","","","","","","","","","","","","",0,"","","","","","","",0,0,0,"","","","","","","","","","","","","","","","","",0,0,"","","","","","","","","","","",null,"","","","",204,"",204,"",204,"",204,""]
[{"$f":"IF(OR(J210=Translate!$B$27,OR(J210=Translate!$C$27,OR(J210=Translate!$C$28,OR(J210=Translate!$B$28)))),\"\",DB210)","v":""},null,"Select","Select","Select","Select","Select",null,null,"Selectionner","2022-03-09","","",{"$nulls":9},"","","","","","","","",null,"",0,"","",0,{"$nulls":7},"","","","","","","","","","","","","","","","",0,"","","","","","","",0,0,0,"","","","","","","","","","","","","","","","","",0,0,"","","","","","","","","","","",null,"","","","",205,"",205,"",205,"",205,""]
[{"$f":"IF(OR(J211=Translate!$B$27,OR(J211=Translate!$C$27,OR(J211=Translate!$C$28,OR(J211=Translate!$B$28)))),\"\",DB211)","v":""},null,"Select","Select","Select","Select","Select",null,null,"Selectionner","2022-03-09","","",{"$nulls":9},"","","","","","","","",null,"",0,"","",0,{"$nulls":7},"","","","","","","","","","","","","","","","",0,"","","","","","","",0,0,0,"","","","","","","","","","","","","","","","","",0,0,"","","","","","","","","","","",null,"","","","",206,"",206,"",206,"",206,""]
[{"$f":"IF(OR(J212=Translate!$B$27,OR(J212=Translate!$C$27,OR(J212=Translate!$C$28,OR(J212=Translate!$B$28)))),\"\",DB212)","v":""},null,"Select","Select","Select","Select","Select",null,null,"Selectionner","2022-03-09","","",{"$nulls":9},"","","","","","","","",null,"",0,"","",0,{"$nulls":7},"","","","","","","","","","","","","","","","",0,"","","","","","","",0,0,0,"","","","","","","","","","","","","","","","","",0,0,"","","","","","","","","","","",null,"","","","",207,"",207,"",207,"",207,""]
[{"$f":"IF(OR(J213=Translate!$B$27,OR(J213=Translate!$C$27,OR(J213=Translate!$C$28,OR(J213=Translate!$B$28)))),\"\",DB213)","v":""},null,"Select","Select","Select","Select","Select",null,null,"Selectionner","2022-03-09","","",{"$nulls":9},"","","","","","","","",null,"",0,"","",0,{"$nulls":7},"","","","","","","","","","","","","","","","",0,"","","","","","","",0,0,0,"","","","","","","","","","","","","","","","","",0,0,"","","","","","","","","","","",null,"","","","",208,"",208,"",208,"",208,""]
[{"$f":"IF(OR(J214=Translate!$B$27,OR(J214=Translate!$C$27,OR(J214=Translate!$C$28,OR(J214=Translate!$B$28)))),\"\",DB214)","v":""},null,"Select","Select","Select","Select","Select",null,null,"Selectionner","2022-03-09","","",{"$nulls":9},"","","","","","","","",null,"",0,"","",0,{"$nulls":7},"","","","","","","","","","","","","","","","",0,"","","","","","","",0,0,0,"","","","","","","","","","","","","","","","","",0,0,"","","","","","","","","","","",null,"","","","",209,"",209,"",209,"",209,""]
[{"$f":"IF(OR(J215=Translate!$B$27,OR(J215=Translate!$C$27,OR(J215=Translate!$C$28,OR(J215=Translate!$B$28)))),\"\",DB215)","v":""},null,"Select","Select","Select","Select","Select",null,null,"Selectionner","2022-03-09","","",{"$nulls":9},"","","","","","","","",null,"",0,"","",0,{"$nulls":7},"","","","","","","","","","","","","","","","",0,"","","","","","","",0,0,0,"","","","","","","","","","","","","","","","","",0,0,"","","","","","","","","","","",null,"","","","",210,"",210,"",210,"",210,""]
[{"$f":"IF(OR(J216=Translate!$B$27,OR(J216=Translate!$C$27,OR(J216=Translate!$C$28,OR(J216=Translate!$B$28)))),\"\",DB216)","v":""},null,"Select","Select","Select","Select","Select",null,null,"Selectionner","2022-03-09","","",{"$nulls":9},"","","","","","","","",null,"",0,"","",0,{"$nulls":7},"","","","","","","","","","","","","","","","",0,"","","","","","","",0,0,0,"","","","","","","","","","","","","","","","","",0,0,"","","","","","","","","","","",null,"","","","",211,"",211,"",211,"",211,""]
[{"$f":"IF(OR(J217=Translate!$B$27,OR(J217=Translate!$C$27,OR(J217=Translate!$C$28,OR(J217=Translate!$B$28)))),\"\",DB217)","v":""},null,"Select","Select","Select","Select","Select",null,null,"Selectionner","2022-03-09","","",{"$nulls":9},"","","","","","","","",null,"",0,"","",0,{"$nulls":7},"","","","","","","","","","","","","","","","",0,"","","","","","","",0,0,0,"","","","","","","","","","","","","","","","","",0,0,"","","","","","","","","","","",null,"","","","",212,"",212,"",212,"",212,""]
[{"$f":"IF(OR(J218=Translate!$B$27,OR(J218=Translate!$C$27,OR(J218=Translate!$C$28,OR(J218=Translate!$B$28)))),\"\",DB218)","v":""},null,"Select","Select","Select","Select","Select",null,null,"Selectionner","2022-03-09","","",{"$nulls":9},"","","","","","","","",null,"",0,"","",0,{"$nulls":7},"","","","","","","","","","","","","","","","",0,"","","","","","","",0,0,0,"","","","","","","","","","","","","","","","","",0,0,"","","","","","","","","","","",null,"","","","",213,"",213,"",213,"",213,""]
[{"$f":"IF(OR(J219=Translate!$B$27,OR(J219=Translate!$C$27,OR(J219=Translate!$C$28,OR(J219=Translate!$B$28)))),\"\",DB219)","v":""},null,"Select","Select","Select","Select","Select",null,null,"Selectionner","2022-03-09","","",{"$nulls":9},"","","","","","","","",null,"",0,"","",0,{"$nulls":7},"","","","","","","","","","","","","","","","",0,"","","","","","","",0,0,0,"","","","","","","","","","","","","","","","","",0,0,"","","","","","","","","","","",null,"","","","",214,"",214,"",214,"",214,""]
[{"$f":"IF(OR(J220=Translate!$B$27,OR(J220=Translate!$C$27,OR(J220=Translate!$C$28,OR(J220=Translate!$B$28)))),\"\",DB220)","v":""},null,"Select","Select","Select","Select","Select",null,null,"Selectionner","2022-03-09","","",{"$nulls":9},"","","","","","","","",null,"",0,"","",0,{"$nulls":7},"","","","","","","","","","","","","","","","",0,"","","","","","","",0,0,0,"","","","","","","","","","","","","","","","","",0,0,"","","","","","","","","","","",null,"","","","",215,"",215,"",215,"",215,""]
[{"$f":"IF(OR(J221=Translate!$B$27,OR(J221=Translate!$C$27,OR(J221=Translate!$C$28,OR(J221=Translate!$B$28)))),\"\",DB221)","v":""},null,"Select","Select","Select","Select","Select",null,null,"Selectionner","2022-03-09","","",{"$nulls":9},"","","","","","","","",null,"",0,"","",0,{"$nulls":7},"","","","","","","","","","","","","","","","",0,"","","","","","","",0,0,0,"","","","","","","","","","","","","","","","","",0,0,"","","","","","","","","","","",null,"","","","",216,"",216,"",216,"",216,""]
[{"$f":"IF(OR(J222=Translate!$B$27,OR(J222=Translate!$C$27,OR(J222=Translate!$C$28,OR(J222=Translate!$B$28)))),\"\",DB222)","v":""},null,"Select","Select","Select","Select","Select",null,null,"Selectionner","2022-03-09","","",{"$nulls":9},"","","","","","","","",null,"",0,"","",0,{"$nulls":7},"","","","","","","","","","","","","","","","",0,"","","","","","","",0,0,0,"","","","","","","","","","","","","","","","","",0,0,"","","","","","","","","","","",null,"","","","",217,"",217,"",217,"",217,""]
[{"$f":"IF(OR(J223=Translate!$B$27,OR(J223=Translate!$C$27,OR(J223=Translate!$C$28,OR(J223=Translate!$B$28)))),\"\",DB223)","v":""},null,"Select","Select","Select","Select","Select",null,null,"Selectionner","2022-03-09","","",{"$nulls":9},"","","","","","","","",null,"",0,"","",0,{"$nulls":7},"","","","","","","","","","","","","","","","",0,"","","","","","","",0,0,0,"","","","","","","","","","","","","","","","","",0,0,"","","","","","","","","","","",null,"","","","",218,"",218,"",218,"",218,""]
[{"$f":"IF(OR(J224=Translate!$B$27,OR(J224=Translate!$C$27,OR(J224=Translate!$C$28,OR(J224=Translate!$B$28)))),\"\",DB224)","v":""},null,"Select","Select","Select","Select","Select",null,null,"Selectionner","2022-03-09","","",{"$nulls":9},"","","","","","","","",null,"",0,"","",0,{"$nulls":7},"","","","","","","","","","","","","","","","",0,"","","","","","","",0,0,0,"","","","","","","","","","","","","","","","","",0,0,"","","","","","","","","","","",null,"","","","",219,"",219,"",219,"",219,""]
[{"$f":"IF(OR(J225=Translate!$B$27,OR(J225=Translate!$C$27,OR(J225=Translate!$C$28,OR(J225=Translate!$B$28)))),\"\",DB225)","v":""},null,"Select","Select","Select","Select","Select",null,null,"Selectionner","2022-03-09","","",{"$nulls":9},"","","","","","","","",null,"",0,"","",0,{"$nulls":7},"","","","","","","","","","","","","","","","",0,"","","","","","","",0,0,0,"","","","","","","","","","","","","","","","","",0,0,"","","","","","","","","","","",null,"","","","",220,"",220,"",220,"",220,""]
[{"$f":"IF(OR(J226=Translate!$B$27,OR(J226=Translate!$C$27,OR(J226=Translate!$C$28,OR(J226=Translate!$B$28)))),\"\",DB226)","v":""},null,"Select","Select","Select","Select","Select",null,null,"Selectionner","2022-03-09","","",{"$nulls":9},"","","","","","","","",null,"",0,"","",0,{"$nulls":7},"","","","","","","","","","","","","","","","",0,"","","","","","","",0,0,0,"","","","","","","","","","","","","","","","","",0,0,"","","","","","","","","","","",null,"","","","",221,"",221,"",221,"",221,""]
[{"$f":"IF(OR(J227=Translate!$B$27,OR(J227=Translate!$C$27,OR(J227=Translate!$C$28,OR(J227=Translate!$B$28)))),\"\",DB227)","v":""},null,"Select","Select","Select","Select","Select",null,null,"Selectionner","2022-03-09","","",{"$nulls":9},"","","","","","","","",null,"",0,"","",0,{"$nulls":7},"","","","","","","","","","","","","","","","",0,"","","","","","","",0,0,0,"","","","","","","","","","","","","","","","","",0,0,"","","","","","","","","","","",null,"","","","",222,"",222,"",222,"",222,""]
[{"$f":"IF(OR(J228=Translate!$B$27,OR(J228=Translate!$C$27,OR(J228=Translate!$C$28,OR(J228=Translate!$B$28)))),\"\",DB228)","v":""},null,"Select","Select","Select","Select","Select",null,null,"Selectionner","2022-03-09","","",{"$nulls":9},"","","","","","","","",null,"",0,"","",0,{"$nulls":7},"","","","","","","","","","","","","","","","",0,"","","","","","","",0,0,0,"","","","","","","","","","","","","","","","","",0,0,"","","","","","","","","","","",null,"","","","",223,"",223,"",223,"",223,""]
[{"$f":"IF(OR(J229=Translate!$B$27,OR(J229=Translate!$C$27,OR(J229=Translate!$C$28,OR(J229=Translate!$B$28)))),\"\",DB229)","v":""},null,"Select","Select","Select","Select","Select",null,null,"Selectionner","2022-03-09","","",{"$nulls":9},"","","","","","","","",null,"",0,"","",0,{"$nulls":7},"","","","","","","","","","","","","","","","",0,"","","","","","","",0,0,0,"","","","","","","","","","","","","","","","","",0,0,"","","","","","","","","","","",null,"","","","",224,"",224,"",224,"",224,""]
[{"$f":"IF(OR(J230=Translate!$B$27,OR(J230=Translate!$C$27,OR(J230=Translate!$C$28,OR(J230=Translate!$B$28)))),\"\",DB230)","v":""},null,"Select","Select","Select","Select","Select",null,null,"Selectionner","2022-03-09","","",{"$nulls":9},"","","","","","","","",null,"",0,"","",0,{"$nulls":7},"","","","","","","","","","","","","","","","",0,"","","","","","","",0,0,0,"","","","","","","","","","","","","","","","","",0,0,"","","","","","","","","","","",null,"","","","",225,"",225,"",225,"",225,""]
[{"$f":"IF(OR(J231=Translate!$B$27,OR(J231=Translate!$C$27,OR(J231=Translate!$C$28,OR(J231=Translate!$B$28)))),\"\",DB231)","v":""},null,"Select","Select","Select","Select","Select",null,null,"Selectionner","2022-03-09","","",{"$nulls":9},"","","","","","","","",null,"",0,"","",0,{"$nulls":7},"","","","","","","","","","","","","","","","",0,"","","","","","","",0,0,0,"","","","","","","","","","","","","","","","","",0,0,"","","","","","","","","","","",null,"","","","",226,"",226,"",226,"",226,""]
[{"$f":"IF(OR(J232=Translate!$B$27,OR(J232=Translate!$C$27,OR(J232=Translate!$C$28,OR(J232=Translate!$B$28)))),\"\",DB232)","v":""},null,"Select","Select","Select","Select","Select",null,null,"Selectionner","2022-03-09","","",{"$nulls":9},"","","","","","","","",null,"",0,"","",0,{"$nulls":7},"","","","","","","","","","","","","","","","",0,"","","","","","","",0,0,0,"","","","","","","","","","","","","","","","","",0,0,"","","","","","","","","","","",null,"","","","",227,"",227,"",227,"",227,""]
[{"$f":"IF(OR(J233=Translate!$B$27,OR(J233=Translate!$C$27,OR(J233=Translate!$C$28,OR(J233=Translate!$B$28)))),\"\",DB233)","v":""},null,"Select","Select","Select","Select","Select",null,null,"Selectionner","2022-03-09","","",{"$nulls":9},"","","","","","","","",null,"",0,"","",0,{"$nulls":7},"","","","","","","","","","","","","","","","",0,"","","","","","","",0,0,0,"","","","","","","","","","","","","","","","","",0,0,"","","","","","","","","","","",null,"","","","",228,"",228,"",228,"",228,""]
[{"$f":"IF(OR(J234=Translate!$B$27,OR(J234=Translate!$C$27,OR(J234=Translate!$C$28,OR(J234=Translate!$B$28)))),\"\",DB234)","v":""},null,"Select","Select","Select","Select","Select",null,null,"Selectionner","2022-03-09","","",{"$nulls":9},"","","","","","","","",null,"",0,"","",0,{"$nulls":7},"","","","","","","","","","","","","","","","",0,"","","","","","","",0,0,0,"","","","","","","","","","","","","","","","","",0,0,"","","","","","","","","","","",null,"","","","",229,"",229,"",229,"",229,""]
[{"$f":"IF(OR(J235=Translate!$B$27,OR(J235=Translate!$C$27,OR(J235=Translate!$C$28,OR(J235=Translate!$B$28)))),\"\",DB235)","v":""},null,"Select","Select","Select","Select","Select",null,null,"Selectionner","2022-03-09","","",{"$nulls":9},"","","","","","","","",null,"",0,"","",0,{"$nulls":7},"","","","","","","","","","","","","","","","",0,"","","","","","","",0,0,0,"","","","","","","","","","","","","","","","","",0,0,"","","","","","","","","","","",null,"","","","",230,"",230,"",230,"",230,""]
[{"$f":"IF(OR(J236=Translate!$B$27,OR(J236=Translate!$C$27,OR(J236=Translate!$C$28,OR(J236=Translate!$B$28)))),\"\",DB236)","v":""},null,"Select","Select","Select","Select","Select",null,null,"Selectionner","2022-03-09","","",{"$nulls":9},"","","","","","","","",null,"",0,"","",0,{"$nulls":7},"","","","","","","","","","","","","","","","",0,"","","","","","","",0,0,0,"","","","","","","","","","","","","","","","","",0,0,"","","","","","","","","","","",null,"","","","",231,"",231,"",231,"",231,""]
[{"$f":"IF(OR(J237=Translate!$B$27,OR(J237=Translate!$C$27,OR(J237=Translate!$C$28,OR(J237=Translate!$B$28)))),\"\",DB237)","v":""},null,"Select","Select","Select","Select","Select",null,null,"Selectionner","2022-03-09","","",{"$nulls":9},"","","","","","","","",null,"",0,"","",0,{"$nulls":7},"","","","","","","","","","","","","","","","",0,"","","","","","","",0,0,0,"","","","","","","","","","","","","","","","","",0,0,"","","","","","","","","","","",null,"","","","",232,"",232,"",232,"",232,""]
[{"$f":"IF(OR(J238=Translate!$B$27,OR(J238=Translate!$C$27,OR(J238=Translate!$C$28,OR(J238=Translate!$B$28)))),\"\",DB238)","v":""},null,"Select","Select","Select","Select","Select",null,null,"Selectionner","2022-03-09","","",{"$nulls":9},"","","","","","","","",null,"",0,"","",0,{"$nulls":7},"","","","","","","","","","","","","","","","",0,"","","","","","","",0,0,0,"","","","","","","","","","","","","","","","","",0,0,"","","","","","","","","","","",null,"","","","",233,"",233,"",233,"",233,""]
[{"$f":"IF(OR(J239=Translate!$B$27,OR(J239=Translate!$C$27,OR(J239=Translate!$C$28,OR(J239=Translate!$B$28)))),\"\",DB239)","v":""},null,"Select","Select","Select","Select","Select",null,null,"Selectionner","2022-03-09","","",{"$nulls":9},"","","","","","","","",null,"",0,"","",0,{"$nulls":7},"","","","","","","","","","","","","","","","",0,"","","","","","","",0,0,0,"","","","","","","","","","","","","","","","","",0,0,"","","","","","","","","","","",null,"","","","",234,"",234,"",234,"",234,""]
[{"$f":"IF(OR(J240=Translate!$B$27,OR(J240=Translate!$C$27,OR(J240=Translate!$C$28,OR(J240=Translate!$B$28)))),\"\",DB240)","v":""},null,"Select","Select","Select","Select","Select",null,null,"Selectionner","2022-03-09","","",{"$nulls":9},"","","","","","","","",null,"",0,"","",0,{"$nulls":7},"","","","","","","","","","","","","","","","",0,"","","","","","","",0,0,0,"","","","","","","","","","","","","","","","","",0,0,"","","","","","","","","","","",null,"","","","",235,"",235,"",235,"",235,""]
[{"$f":"IF(OR(J241=Translate!$B$27,OR(J241=Translate!$C$27,OR(J241=Translate!$C$28,OR(J241=Translate!$B$28)))),\"\",DB241)","v":""},null,"Select","Select","Select","Select","Select",null,null,"Selectionner","2022-03-09","","",{"$nulls":9},"","","","","","","","",null,"",0,"","",0,{"$nulls":7},"","","","","","","","","","","","","","","","",0,"","","","","","","",0,0,0,"","","","","","","","","","","","","","","","","",0,0,"","","","","","","","","","","",null,"","","","",236,"",236,"",236,"",236,""]
[{"$f":"IF(OR(J242=Translate!$B$27,OR(J242=Translate!$C$27,OR(J242=Translate!$C$28,OR(J242=Translate!$B$28)))),\"\",DB242)","v":""},null,"Select","Select","Select","Select","Select",null,null,"Selectionner","2022-03-09","","",{"$nulls":9},"","","","","","","","",null,"",0,"","",0,{"$nulls":7},"","","","","","","","","","","","","","","","",0,"","","","","","","",0,0,0,"","","","","","","","","","","","","","","","","",0,0,"","","","","","","","","","","",null,"","","","",237,"",237,"",237,"",237,""]
[{"$f":"IF(OR(J243=Translate!$B$27,OR(J243=Translate!$C$27,OR(J243=Translate!$C$28,OR(J243=Translate!$B$28)))),\"\",DB243)","v":""},null,"Select","Select","Select","Select","Select",null,null,"Selectionner","2022-03-09","","",{"$nulls":9},"","","","","","","","",null,"",0,"","",0,{"$nulls":7},"","","","","","","","","","","","","","","","",0,"","","","","","","",0,0,0,"","","","","","","","","","","","","","","","","",0,0,"","","","","","","","","","","",null,"","","","",238,"",238,"",238,"",238,""]
[{"$f":"IF(OR(J244=Translate!$B$27,OR(J244=Translate!$C$27,OR(J244=Translate!$C$28,OR(J244=Translate!$B$28)))),\"\",DB244)","v":""},null,"Select","Select","Select","Select","Select",null,null,"Selectionner","2022-03-09","","",{"$nulls":9},"","","","","","","","",null,"",0,"","",0,{"$nulls":7},"","","","","","","","","","","","","","","","",0,"","","","","","","",0,0,0,"","","","","","","","","","","","","","","","","",0,0,"","","","","","","","","","","",null,"","","","",239,"",239,"",239,"",239,""]
[{"$f":"IF(OR(J245=Translate!$B$27,OR(J245=Translate!$C$27,OR(J245=Translate!$C$28,OR(J245=Translate!$B$28)))),\"\",DB245)","v":""},null,"Select","Select","Select","Select","Select",null,null,"Selectionner","2022-03-09","","",{"$nulls":9},"","","","","","","","",null,"",0,"","",0,{"$nulls":7},"","","","","","","","","","","","","","","","",0,"","","","","","","",0,0,0,"","","","","","","","","","","","","","","","","",0,0,"","","","","","","","","","","",null,"","","","",240,"",240,"",240,"",240,""]
[{"$f":"IF(OR(J246=Translate!$B$27,OR(J246=Translate!$C$27,OR(J246=Translate!$C$28,OR(J246=Translate!$B$28)))),\"\",DB246)","v":""},null,"Select","Select","Select","Select","Select",null,null,"Selectionner","2022-03-09","","",{"$nulls":9},"","","","","","","","",null,"",0,"","",0,{"$nulls":7},"","","","","","","","","","","","","","","","",0,"","","","","","","",0,0,0,"","","","","","","","","","","","","","","","","",0,0,"","","","","","","","","","","",null,"","","","",241,"",241,"",241,"",241,""]
[{"$f":"IF(OR(J247=Translate!$B$27,OR(J247=Translate!$C$27,OR(J247=Translate!$C$28,OR(J247=Translate!$B$28)))),\"\",DB247)","v":""},null,"Select","Select","Select","Select","Select",null,null,"Selectionner","2022-03-09","","",{"$nulls":9},"","","","","","","","",null,"",0,"","",0,{"$nulls":7},"","","","","","","","","","","","","","","","",0,"","","","","","","",0,0,0,"","","","","","","","","","","","","","","","","",0,0,"","","","","","","","","","","",null,"","","","",242,"",242,"",242,"",242,""]
[{"$f":"IF(OR(J248=Translate!$B$27,OR(J248=Translate!$C$27,OR(J248=Translate!$C$28,OR(J248=Translate!$B$28)))),\"\",DB248)","v":""},null,"Select","Select","Select","Select","Select",null,null,"Selectionner","2022-03-09","","",{"$nulls":9},"","","","","","","","",null,"",0,"","",0,{"$nulls":7},"","","","","","","","","","","","","","","","",0,"","","","","","","",0,0,0,"","","","","","","","","","","","","","","","","",0,0,"","","","","","","","","","","",null,"","","","",243,"",243,"",243,"",243,""]
[{"$f":"IF(OR(J249=Translate!$B$27,OR(J249=Translate!$C$27,OR(J249=Translate!$C$28,OR(J249=Translate!$B$28)))),\"\",DB249)","v":""},null,"Select","Select","Select","Select","Select",null,null,"Selectionner","2022-03-09","","",{"$nulls":9},"","","","","","","","",null,"",0,"","",0,{"$nulls":7},"","","","","","","","","","","","","","","","",0,"","","","","","","",0,0,0,"","","","","","","","","","","","","","","","","",0,0,"","","","","","","","","","","",null,"","","","",244,"",244,"",244,"",244,""]
[{"$f":"IF(OR(J250=Translate!$B$27,OR(J250=Translate!$C$27,OR(J250=Translate!$C$28,OR(J250=Translate!$B$28)))),\"\",DB250)","v":""},null,"Select","Select","Select","Select","Select",null,null,"Selectionner","2022-03-09","","",{"$nulls":9},"","","","","","","","",null,"",0,"","",0,{"$nulls":7},"","","","","","","","","","","","","","","","",0,"","","","","","","",0,0,0,"","","","","","","","","","","","","","","","","",0,0,"","","","","","","","","","","",null,"","","","",245,"",245,"",245,"",245,""]
[{"$f":"IF(OR(J251=Translate!$B$27,OR(J251=Translate!$C$27,OR(J251=Translate!$C$28,OR(J251=Translate!$B$28)))),\"\",DB251)","v":""},null,"Select","Select","Select","Select","Select",null,null,"Selectionner","2022-03-09","","",{"$nulls":9},"","","","","","","","",null,"",0,"","",0,{"$nulls":7},"","","","","","","","","","","","","","","","",0,"","","","","","","",0,0,0,"","","","","","","","","","","","","","","","","",0,0,"","","","","","","","","","","",null,"","","","",246,"",246,"",246,"",246,""]
[{"$f":"IF(OR(J252=Translate!$B$27,OR(J252=Translate!$C$27,OR(J252=Translate!$C$28,OR(J252=Translate!$B$28)))),\"\",DB252)","v":""},null,"Select","Select","Select","Select","Select",null,null,"Selectionner","2022-03-09","","",{"$nulls":9},"","","","","","","","",null,"",0,"","",0,{"$nulls":7},"","","","","","","","","","","","","","","","",0,"","","","","","","",0,0,0,"","","","","","","","","","","","","","","","","",0,0,"","","","","","","","","","","",null,"","","","",247,"",247,"",247,"",247,""]
[{"$f":"IF(OR(J253=Translate!$B$27,OR(J253=Translate!$C$27,OR(J253=Translate!$C$28,OR(J253=Translate!$B$28)))),\"\",DB253)","v":""},null,"Select","Select","Select","Select","Select",null,null,"Selectionner","2022-03-09","","",{"$nulls":9},"","","","","","","","",null,"",0,"","",0,{"$nulls":7},"","","","","","","","","","","","","","","","",0,"","","","","","","",0,0,0,"","","","","","","","","","","","","","","","","",0,0,"","","","","","","","","","","",null,"","","","",248,"",248,"",248,"",248,""]
[{"$f":"IF(OR(J254=Translate!$B$27,OR(J254=Translate!$C$27,OR(J254=Translate!$C$28,OR(J254=Translate!$B$28)))),\"\",DB254)","v":""},null,"Select","Select","Select","Select","Select",null,null,"Selectionner","2022-03-09","","",{"$nulls":9},"","","","","","","","",null,"",0,"","",0,{"$nulls":7},"","","","","","","","","","","","","","","","",0,"","","","","","","",0,0,0,"","","","","","","","","","","","","","","","","",0,0,"","","","","","","","","","","",null,"","","","",249,"",249,"",249,"",249,""]
[{"$f":"IF(OR(J255=Translate!$B$27,OR(J255=Translate!$C$27,OR(J255=Translate!$C$28,OR(J255=Translate!$B$28)))),\"\",DB255)","v":""},null,"Select","Select","Select","Select","Select",null,null,"Selectionner","2022-03-09","","",{"$nulls":9},"","","","","","","","",null,"",0,"","",0,{"$nulls":7},"","","","","","","","","","","","","","","","",0,"","","","","","","",0,0,0,"","","","","","","","","","","","","","","","","",0,0,"","","","","","","","","","","",null,"","","","",250,"",250,"",250,"",250,""]
[{"$f":"IF(OR(J256=Translate!$B$27,OR(J256=Translate!$C$27,OR(J256=Translate!$C$28,OR(J256=Translate!$B$28)))),\"\",DB256)","v":""},null,"Select","Select","Select","Select","Select",null,null,"Selectionner","2022-03-09","","",{"$nulls":9},"","","","","","","","",null,"",0,"","",0,{"$nulls":7},"","","","","","","","","","","","","","","","",0,"","","","","","","",0,0,0,"","","","","","","","","","","","","","","","","",0,0,"","","","","","","","","","","",null,"","","","",251,"",251,"",251,"",251,""]
[{"$f":"IF(OR(J257=Translate!$B$27,OR(J257=Translate!$C$27,OR(J257=Translate!$C$28,OR(J257=Translate!$B$28)))),\"\",DB257)","v":""},null,"Select","Select","Select","Select","Select",null,null,"Selectionner","2022-03-09","","",{"$nulls":9},"","","","","","","","",null,"",0,"","",0,{"$nulls":7},"","","","","","","","","","","","","","","","",0,"","","","","","","",0,0,0,"","","","","","","","","","","","","","","","","",0,0,"","","","","","","","","","","",null,"","","","",252,"",252,"",252,"",252,""]
[{"$f":"IF(OR(J258=Translate!$B$27,OR(J258=Translate!$C$27,OR(J258=Translate!$C$28,OR(J258=Translate!$B$28)))),\"\",DB258)","v":""},null,"Select","Select","Select","Select","Select",null,null,"Selectionner","2022-03-09","","",{"$nulls":9},"","","","","","","","",null,"",0,"","",0,{"$nulls":7},"","","","","","","","","","","","","","","","",0,"","","","","","","",0,0,0,"","","","","","","","","","","","","","","","","",0,0,"","","","","","","","","","","",null,"","","","",253,"",253,"",253,"",253,""]
[{"$f":"IF(OR(J259=Translate!$B$27,OR(J259=Translate!$C$27,OR(J259=Translate!$C$28,OR(J259=Translate!$B$28)))),\"\",DB259)","v":""},null,"Select","Select","Select","Select","Select",null,null,"Selectionner","2022-03-09","","",{"$nulls":9},"","","","","","","","",null,"",0,"","",0,{"$nulls":7},"","","","","","","","","","","","","","","","",0,"","","","","","","",0,0,0,"","","","","","","","","","","","","","","","","",0,0,"","","","","","","","","","","",null,"","","","",254,"",254,"",254,"",254,""]
[{"$f":"IF(OR(J260=Translate!$B$27,OR(J260=Translate!$C$27,OR(J260=Translate!$C$28,OR(J260=Translate!$B$28)))),\"\",DB260)","v":""},null,"Select","Select","Select","Select","Select",null,null,"Selectionner","2022-03-09","","",{"$nulls":9},"","","","","","","","",null,"",0,"","",0,{"$nulls":7},"","","","","","","","","","","","","","","","",0,"","","","","","","",0,0,0,"","","","","","","","","","","","","","","","","",0,0,"","","","","","","","","","","",null,"","","","",255,"",255,"",255,"",255,""]
[{"$f":"IF(OR(J261=Translate!$B$27,OR(J261=Translate!$C$27,OR(J261=Translate!$C$28,OR(J261=Translate!$B$28)))),\"\",DB261)","v":""},null,"Select","Select","Select","Select","Select",null,null,"Selectionner","2022-03-09","","",{"$nulls":9},"","","","","","","","",null,"",0,"","",0,{"$nulls":7},"","","","","","","","","","","","","","","","",0,"","","","","","","",0,0,0,"","","","","","","","","","","","","","","","","",0,0,"","","","","","","","","","","",null,"","","","",256,"",256,"",256,"",256,""]
[{"$f":"IF(OR(J262=Translate!$B$27,OR(J262=Translate!$C$27,OR(J262=Translate!$C$28,OR(J262=Translate!$B$28)))),\"\",DB262)","v":""},null,"Select","Select","Select","Select","Select",null,null,"Selectionner","2022-03-09","","",{"$nulls":9},{"$f":"IF(B262=\"\",\"\",1)","v":""},{"$f":"IF(E262=\"Fonds Mondial\",W262,\"\")","v":""},{"$f":"IF(E262=\"CCM\",W262,\"\")","v":""},{"$f":"IF(E262=\"PNLIT\",W262,\"\")","v":""},{"$f":"IF(E262=\"MSP\",W262,\"\")","v":""},{"$f":"IF(E262=\"DPML\",W262,\"\")","v":""},{"$f":"IF(E262=\"DNSIS\",W262,\"\")","v":""},{"$f":"IF(E262=\"Autres\",W262,\"\")","v":""},null,"",0,"","",0,{"$nulls":7},{"$f":"IF(AND(F262=$AR$5,AND(BQ262=1)),1,\"\")","v":""},{"$f":"IF(AND(F262=$AS$5,AND(BQ262=1)),1,\"\")","v":""},{"$f":"IF(AND(F262=$AT$5,AND(BQ262=1)),1,\"\")","v":""},{"$f":"IF(AND(F262=$AU$5,AND(BQ262=1)),1,\"\")","v":""},{"$f":"IF(AND(F262=$AV$5,AND(BQ262=1)),1,\"\")","v":""},{"$f":"IF(AND(F262=$AW$5,AND(BQ262=1)),1,\"\")","v":""},{"$f":"IF(AND(F262=$AX$5,AND(BQ262=1)),1,\"\")","v":""},{"$f":"IF(AND(F262=$AY$5,AND(BQ262=1)),1,\"\")","v":""},{"$f":"IF(AND(F262=$AZ$5,AND(BQ262=1)),1,\"\")","v":""},{"$f":"IF(AND(F262=$BA$5,AND(BQ262=1)),1,\"\")","v":""},{"$f":"IF(AND(F262=$BB$5,AND(BQ262=1)),1,\"\")","v":""},{"$f":"IF(AND(F262=$BC$5,AND(BQ262=1)),1,\"\")","v":""},{"$f":"IF(AND(F262=$BD$5,AND(BQ262=1)),1,\"\")","v":""},{"$f":"IF(AND(F262=$BE$5,AND(BQ262=1)),1,\"\")","v":""},{"$f":"IF(AND(F262=$BF$5,AND(BQ262=1)),1,\"\")","v":""},{"$f":"IF(AND(F262=$BG$5,AND(BQ262=1)),1,\"\")","v":""},0,"","","","","","","",0,{"$f":"IF(OR(B262=\"\",OR(C262=\"Select\",OR(E262=\"Select\",OR(F262=\"Select\",OR(I262=\"\",OR(D262=\"Select\",OR(J262=\"Select\"))))))),0,1)","v":0},0,"",{"$f":"IF(C262=$BT$5,1,\"\")","v":""},{"$f":"IF(C262=$BU$5,1,\"\")","v":""},{"$f":"IF(C262=$BV$5,1,\"\")","v":""},{"$f":"IF(C262=$BW$5,1,\"\")","v":""},{"$f":"IF(C262=$BX$5,1,\"\")","v":""},{"$f":"IF(C262=$BY$5,1,\"\")","v":""},{"$f":"IF(C262=$BZ$5,1,\"\")","v":""},{"$f":"IF(C262=$CA$5,1,\"\")","v":""},{"$f":"IF(C262=$CB$5,1,\"\")","v":""},{"$f":"IF(D262=$CC$5,1,\"\")","v":""},{"$f":"IF(D262=$CD$5,1,\"\")","v":""},{"$f":"IF(D262=$CE$5,1,\"\")","v":""},{"$f":"IF(D262=$CF$5,1,\"\")","v":""},{"$f":"IF(D262=$CG$5,1,\"\")","v":""},{"$f":"IF(D262=$CH$5,1,\"\")","v":""},"",0,0,{"$f":"IF(AND(F262=$CL$5,AND(BQ262=1)),1,\"\")","v":""},{"$f":"IF(AND(F262=$CM$5,AND(BQ262=1)),1,\"\")","v":""},{"$f":"IF(AND(F262=$CN$5,AND(BQ262=1)),1,\"\")","v":""},{"$f":"IF(AND(F262=$CO$5,AND(BQ262=1)),1,\"\")","v":""},{"$f":"IF(AND(F262=$CP$5,AND(BQ262=1)),1,\"\")","v":""},{"$f":"IF(AND(F262=$CQ$5,AND(BQ262=1)),1,\"\")","v":""},{"$f":"IF(AND(F262=$CR$5,AND(BQ262=1)),1,\"\")","v":""},{"$f":"IF(AND(F262=$CS$5,AND(BQ262=1)),1,\"\")","v":""},{"$f":"IF(AND(F262=$CT$5,AND(BQ262=1)),1,\"\")","v":""},{"$f":"IF(AND(F262=$CU$5,AND(BQ262=1)),1,\"\")","v":""},{"$f":"IF(AND(F262=$CV$5,AND(BQ262=1)),1,\"\")","v":""},null,"","","","",257,"",257,"",257,"",257,""]
[{"$f":"IF(OR(J263=Translate!$B$27,OR(J263=Translate!$C$27,OR(J263=Translate!$C$28,OR(J263=Translate!$B$28)))),\"\",DB263)","v":""},null,"Select","Select","Select","Select","Select",null,null,"Selectionner",{"$f":"TODAY()","v":"2022-03-09"},{"$f":"IF(OR(I263=\"\",OR(J263=$R$14,OR(J263=$R$9))),\"\",I263-K263)","v":""},{"$f":"IF(BR263=1,L263,\"\")","v":""},{"$nulls":9},"","","","","","","","",null,{"$f":"IF(M263<0,1,\"\")","v":""},{"$f":"IF(AND(J263=\"Réalisée\",AND(M263=\"\")),1,0)","v":0},"",{"$f":"IF(AND(M263>0,M263<15),1,\"\")","v":""},{"$f":"IF(AND(J263=\"En cours\",AND(M263>14)),1,0)","v":0},{"$nulls":7},"","","","","","","","","","","","","","","","",{"$f":"BQ263","v":0},{"$f":"IF(AND(J263=$BI$5,AND(BQ263=1)),1,\"\")","v":""},{"$f":"IF(AND(J263=$BJ$5,AND(BQ263=1)),1,\"\")","v":""},{"$f":"IF(AND(J263=$BK$5,AND(BQ263=1)),1,\"\")","v":""},{"$f":"IF(AND(J263=$BL$5,AND(BQ263=1)),1,\"\")","v":""},{"$f":"IF(AND(J263=$BM$5,AND(BQ263=1)),1,\"\")","v":""},{"$f":"IF(AND(J263=$BN$5,AND(BQ263=1)),1,\"\")","v":""},{"$f":"IF(M263<0,1,\"\")","v":""},{"$f":"IF(OR(J263=$BI$5,OR(J263=$BN$5,OR(J263=$CZ$5))),1,0)","v":0},0,{"$f":"IF(OR(J263=$BI$5,OR(J263=$BM$5,OR(J263=$R$10,OR(J263=$R$15,OR(J263=$R$18))))),\"\",BQ263)","v":0},{"$f":"IF(C263=$BS$5,1,\"\")","v":""},"","","","","","","","","","","","","","","",{"$f":"IF(AND(M263>0,M263<15),1,\"\")","v":""},{"$f":"IF((M263>14),1,0)*CK263","v":0},{"$f":"IF(M263=\"\",0,1)","v":0},"","","","","","","","","","","",null,{"$f":"IF(AND(J263=$CX$5,AND(BQ263=1)),1,\"\")","v":""},{"$f":"IF(AND(J263=$CY$5,AND(BQ263=1)),1,\"\")","v":""},{"$f":"IF(AND(J263=$CZ$5,AND(BQ263=1)),1,\"\")","v":""},{"$f":"IF(AND(J263=$DA$5,AND(BQ263=1)),1,\"\")","v":""},258,{"$f":"IF(B263=\"\",\"\",B263)","v":""},{"$f":"DF263","v":258},{"$f":"IF(OR(I263=\"\",OR(J263=\"Select\")),\"\",I263)","v":""},{"$f":"DB263","v":258},{"$f":"IF(F263=\"Select\",\"\",F263)","v":""},{"$f":"DF263","v":258},{"$f":"IF(C263=\"Select\",\"\",C263)","v":""}]
[{"$f":"IF(OR(J264=Translate!$B$27,OR(J264=Translate!$C$27,OR(J264=Translate!$C$28,OR(J264=Translate!$B$28)))),\"\",DB264)","v":""},null,"Select","Select","Select","Select","Select",null,null,"Selectionner","2022-03-09","","",{"$nulls":9},"","","","","","","","",null,"",0,"","",0,{"$nulls":7},"","","","","","","","","","","","","","","","",0,"","","","","","","",0,0,0,"","","","","","","","","","","","","","","","","",0,0,"","","","","","","","","","","",null,"","","","",259,"",259,"",259,"",259,""]
[{"$f":"IF(OR(J265=Translate!$B$27,OR(J265=Translate!$C$27,OR(J265=Translate!$C$28,OR(J265=Translate!$B$28)))),\"\",DB265)","v":""},null,"Select","Select","Select","Select","Select",null,null,"Selectionner","2022-03-09","","",{"$nulls":9},"","","","","","","","",null,"",0,{"$f":"IF(J265=\"Réalisée\",AG265,\"\")","v":""},"",0,{"$nulls":7},"","","","","","","","","","","","","","","","",0,"","","","","","","",0,0,0,"","","","","","","","","","","","","","","","","",0,0,"","","","","","","","","","","",null,"","","","",260,"",260,"",260,"",260,""]
[{"$f":"IF(OR(J266=Translate!$B$27,OR(J266=Translate!$C$27,OR(J266=Translate!$C$28,OR(J266=Translate!$B$28)))),\"\",DB266)","v":""},null,"Select","Select","Select","Select","Select",null,null,"Selectionner","2022-03-09","","",{"$nulls":9},"","","","","","","","",null,"",0,"","",0,{"$nulls":7},"","","","","","","","","","","","","","","","",0,"","","","","","","",0,0,0,"","","","","","","","","","","","","","","","","",0,0,"","","","","","","","","","","",null,"","","","",261,"",261,"",261,"",261,""]
[{"$f":"IF(OR(J267=Translate!$B$27,OR(J267=Translate!$C$27,OR(J267=Translate!$C$28,OR(J267=Translate!$B$28)))),\"\",DB267)","v":""},null,"Select","Select","Select","Select","Select",null,null,"Selectionner","2022-03-09","","",{"$nulls":9},"","","","","","","","",null,"",0,"","",0,{"$nulls":7},"","","","","","","","","","","","","","","","",0,"","","","","","","",0,0,0,"","","","","","","","","","","","","","","","","",0,0,"","","","","","","","","","","",null,"","","","",262,"",262,"",262,"",262,""]
[{"$f":"IF(OR(J268=Translate!$B$27,OR(J268=Translate!$C$27,OR(J268=Translate!$C$28,OR(J268=Translate!$B$28)))),\"\",DB268)","v":""},null,"Select","Select","Select","Select","Select",null,null,"Selectionner","2022-03-09","","",{"$nulls":9},"","","","","","","","",null,"",0,"","",0,{"$nulls":7},"","","","","","","","","","","","","","","","",0,"","","","","","","",0,0,0,"","","","","","","","","","","","","","","","","",0,0,"","","","","","","","","","","",null,"","","","",263,"",263,"",263,"",263,""]
[{"$f":"IF(OR(J269=Translate!$B$27,OR(J269=Translate!$C$27,OR(J269=Translate!$C$28,OR(J269=Translate!$B$28)))),\"\",DB269)","v":""},null,"Select","Select","Select","Select","Select",null,null,"Selectionner","2022-03-09","","",{"$nulls":9},"","","","","","","","",null,"",0,"","",0,{"$nulls":7},"","","","","","","","","","","","","","","","",0,"","","","","","","",0,0,0,"","","","","","","","","","","","","","","","","",0,0,"","","","","","","","","","","",null,"","","","",264,"",264,"",264,"",264,""]
[{"$f":"IF(OR(J270=Translate!$B$27,OR(J270=Translate!$C$27,OR(J270=Translate!$C$28,OR(J270=Translate!$B$28)))),\"\",DB270)","v":""},null,"Select","Select","Select","Select","Select",null,null,"Selectionner","2022-03-09","","",{"$nulls":9},"","","","","","","","",null,"",0,"","",0,{"$nulls":7},"","","","","","","","","","","","","","","","",0,"","","","","","","",0,0,0,"","","","","","","","","","","","","","","","","",0,0,"","","","","","","","","","","",null,"","","","",265,"",265,"",265,"",265,""]
[{"$f":"IF(OR(J271=Translate!$B$27,OR(J271=Translate!$C$27,OR(J271=Translate!$C$28,OR(J271=Translate!$B$28)))),\"\",DB271)","v":""},null,"Select","Select","Select","Select","Select",null,null,"Selectionner","2022-03-09","","",{"$nulls":9},"","","","","","","","",null,"",0,"","",0,{"$nulls":7},"","","","","","","","","","","","","","","","",0,"","","","","","","",0,0,0,"","","","","","","","","","","","","","","","","",0,0,"","","","","","","","","","","",null,"","","","",266,"",266,"",266,"",266,""]
[{"$f":"IF(OR(J272=Translate!$B$27,OR(J272=Translate!$C$27,OR(J272=Translate!$C$28,OR(J272=Translate!$B$28)))),\"\",DB272)","v":""},null,"Select","Select","Select","Select","Select",null,null,"Selectionner","2022-03-09","","",{"$nulls":9},"","","","","","","","",null,"",0,"","",0,{"$nulls":7},"","","","","","","","","","","","","","","","",0,"","","","","","","",0,0,0,"","","","","","","","","","","","","","","","","",0,0,"","","","","","","","","","","",null,"","","","",267,"",267,"",267,"",267,""]
[{"$f":"IF(OR(J273=Translate!$B$27,OR(J273=Translate!$C$27,OR(J273=Translate!$C$28,OR(J273=Translate!$B$28)))),\"\",DB273)","v":""},null,"Select","Select","Select","Select","Select",null,null,"Selectionner","2022-03-09","","",{"$nulls":9},"","","","","","","","",null,"",0,"","",0,{"$nulls":7},"","","","","","","","","","","","","","","","",0,"","","","","","","",0,0,0,"","","","","","","","","","","","","","","","","",0,0,"","","","","","","","","","","",null,"","","","",268,"",268,"",268,"",268,""]
[{"$f":"IF(OR(J274=Translate!$B$27,OR(J274=Translate!$C$27,OR(J274=Translate!$C$28,OR(J274=Translate!$B$28)))),\"\",DB274)","v":""},null,"Select","Select","Select","Select","Select",null,null,"Selectionner","2022-03-09","","",{"$nulls":9},"","","","","","","","",null,"",0,"","",0,{"$nulls":7},"","","","","","","","","","","","","","","","",0,"","","","","","","",0,0,0,"","","","","","","","","","","","","","","","","",0,0,"","","","","","","","","","","",null,"","","","",269,"",269,"",269,"",269,""]
[{"$f":"IF(OR(J275=Translate!$B$27,OR(J275=Translate!$C$27,OR(J275=Translate!$C$28,OR(J275=Translate!$B$28)))),\"\",DB275)","v":""},null,"Select","Select","Select","Select","Select",null,null,"Selectionner","2022-03-09","","",{"$nulls":9},"","","","","","","","",null,"",0,"","",0,{"$nulls":7},"","","","","","","","","","","","","","","","",0,"","","","","","","",0,0,0,"","","","","","","","","","","","","","","","","",0,0,"","","","","","","","","","","",null,"","","","",270,"",270,"",270,"",270,""]
[{"$f":"IF(OR(J276=Translate!$B$27,OR(J276=Translate!$C$27,OR(J276=Translate!$C$28,OR(J276=Translate!$B$28)))),\"\",DB276)","v":""},null,"Select","Select","Select","Select","Select",null,null,"Selectionner","2022-03-09","","",{"$nulls":9},"","","","","","","","",null,"",0,"","",0,{"$nulls":7},"","","","","","","","","","","","","","","","",0,"","","","","","","",0,0,0,"","","","","","","","","","","","","","","","","",0,0,"","","","","","","","","","","",null,"","","","",271,"",271,"",271,"",271,""]
[{"$f":"IF(OR(J277=Translate!$B$27,OR(J277=Translate!$C$27,OR(J277=Translate!$C$28,OR(J277=Translate!$B$28)))),\"\",DB277)","v":""},null,"Select","Select","Select","Select","Select",null,null,"Selectionner","2022-03-09","","",{"$nulls":9},"","","","","","","","",null,"",0,"","",0,{"$nulls":7},"","","","","","","","","","","","","","","","",0,"","","","","","","",0,0,0,"","","","","","","","","","","","","","","","","",0,0,"","","","","","","","","","","",null,"","","","",272,"",272,"",272,"",272,""]
[{"$f":"IF(OR(J278=Translate!$B$27,OR(J278=Translate!$C$27,OR(J278=Translate!$C$28,OR(J278=Translate!$B$28)))),\"\",DB278)","v":""},null,"Select","Select","Select","Select","Select",null,null,"Selectionner","2022-03-09","","",{"$nulls":9},"","","","","","","","",null,"",0,"","",0,{"$nulls":7},"","","","","","","","","","","","","","","","",0,"","","","","","","",0,0,0,"","","","","","","","","","","","","","","","","",0,0,"","","","","","","","","","","",null,"","","","",273,"",273,"",273,"",273,""]
[{"$f":"IF(OR(J279=Translate!$B$27,OR(J279=Translate!$C$27,OR(J279=Translate!$C$28,OR(J279=Translate!$B$28)))),\"\",DB279)","v":""},null,"Select","Select","Select","Select","Select",null,null,"Selectionner","2022-03-09","","",{"$nulls":9},"","","","","","","","",null,"",0,"","",0,{"$nulls":7},"","","","","","","","","","","","","","","","",0,"","","","","","","",0,0,0,"","","","","","","","","","","","","","","","","",0,0,"","","","","","","","","","","",null,"","","","",274,"",274,"",274,"",274,""]
[{"$f":"IF(OR(J280=Translate!$B$27,OR(J280=Translate!$C$27,OR(J280=Translate!$C$28,OR(J280=Translate!$B$28)))),\"\",DB280)","v":""},null,"Select","Select","Select","Select","Select",null,null,"Selectionner","2022-03-09","","",{"$nulls":9},"","","","","","","","",null,"",0,"","",0,{"$nulls":7},"","","","","","","","","","","","","","","","",0,"","","","","","","",0,0,0,"","","","","","","","","","","","","","","","","",0,0,"","","","","","","","","","","",null,"","","","",275,"",275,"",275,"",275,""]
[{"$f":"IF(OR(J281=Translate!$B$27,OR(J281=Translate!$C$27,OR(J281=Translate!$C$28,OR(J281=Translate!$B$28)))),\"\",DB281)","v":""},null,"Select","Select","Select","Select","Select",null,null,"Selectionner","2022-03-09","","",{"$nulls":9},"","","","","","","","",null,"",0,"","",0,{"$nulls":7},"","","","","","","","","","","","","","","","",0,"","","","","","","",0,0,0,"","","","","","","","","","","","","","","","","",0,0,"","","","","","","","","","","",null,"","","","",276,"",276,"",276,"",276,""]
[{"$f":"IF(OR(J282=Translate!$B$27,OR(J282=Translate!$C$27,OR(J282=Translate!$C$28,OR(J282=Translate!$B$28)))),\"\",DB282)","v":""},null,"Select","Select","Select","Select","Select",null,null,"Selectionner","2022-03-09","","",{"$nulls":9},"","","","","","","","",null,"",0,"","",0,{"$nulls":7},"","","","","","","","","","","","","","","","",0,"","","","","","","",0,0,0,"","","","","","","","","","","","","","","","","",0,0,"","","","","","","","","","","",null,"","","","",277,"",277,"",277,"",277,""]
[{"$f":"IF(OR(J283=Translate!$B$27,OR(J283=Translate!$C$27,OR(J283=Translate!$C$28,OR(J283=Translate!$B$28)))),\"\",DB283)","v":""},null,"Select","Select","Select","Select","Select",null,null,"Selectionner","2022-03-09","","",{"$nulls":9},"","","","","","","","",null,"",0,"","",0,{"$nulls":7},"","","","","","","","","","","","","","","","",0,"","","","","","","",0,0,0,"","","","","","","","","","","","","","","","","",0,0,"","","","","","","","","","","",null,"","","","",278,"",278,"",278,"",278,""]
[{"$f":"IF(OR(J284=Translate!$B$27,OR(J284=Translate!$C$27,OR(J284=Translate!$C$28,OR(J284=Translate!$B$28)))),\"\",DB284)","v":""},null,"Select","Select","Select","Select","Select",null,null,"Selectionner","2022-03-09","","",{"$nulls":9},"","","","","","","","",null,"",0,"","",0,{"$nulls":7},"","","","","","","","","","","","","","","","",0,"","","","","","","",0,0,0,"","","","","","","","","","","","","","","","","",0,0,"","","","","","","","","","","",null,"","","","",279,"",279,"",279,"",279,""]
[{"$f":"IF(OR(J285=Translate!$B$27,OR(J285=Translate!$C$27,OR(J285=Translate!$C$28,OR(J285=Translate!$B$28)))),\"\",DB285)","v":""},null,"Select","Select","Select","Select","Select",null,null,"Selectionner","2022-03-09","","",{"$nulls":9},"","","","","","","","",null,"",0,"","",0,{"$nulls":7},"","","","","","","","","","","","","","","","",0,"","","","","","","",0,0,0,"","","","","","","","","","","","","","","","","",0,0,"","","","","","","","","","","",null,"","","","",280,"",280,"",280,"",280,""]
[{"$f":"IF(OR(J286=Translate!$B$27,OR(J286=Translate!$C$27,OR(J286=Translate!$C$28,OR(J286=Translate!$B$28)))),\"\",DB286)","v":""},null,"Select","Select","Select","Select","Select",null,null,"Selectionner","2022-03-09","","",{"$nulls":9},"","","","","","","","",null,"",0,"","",0,{"$nulls":7},"","","","","","","","","","","","","","","","",0,"","","","","","","",0,0,0,"","","","","","","","","","","","","","","","","",0,0,"","","","","","","","","","","",null,"","","","",281,"",281,"",281,"",281,""]
[{"$f":"IF(OR(J287=Translate!$B$27,OR(J287=Translate!$C$27,OR(J287=Translate!$C$28,OR(J287=Translate!$B$28)))),\"\",DB287)","v":""},null,"Select","Select","Select","Select","Select",null,null,"Selectionner","2022-03-09","","",{"$nulls":9},"","","","","","","","",null,"",0,"","",0,{"$nulls":7},"","","","","","","","","","","","","","","","",0,"","","","","","","",0,0,0,"","","","","","","","","","","","","","","","","",0,0,"","","","","","","","","","","",null,"","","","",282,"",282,"",282,"",282,""]
[{"$f":"IF(OR(J288=Translate!$B$27,OR(J288=Translate!$C$27,OR(J288=Translate!$C$28,OR(J288=Translate!$B$28)))),\"\",DB288)","v":""},null,"Select","Select","Select","Select","Select",null,null,"Selectionner","2022-03-09","","",{"$nulls":9},"","","","","","","","",null,"",0,"","",0,{"$nulls":7},"","","","","","","","","","","","","","","","",0,"","","","","","","",0,0,0,"","","","","","","","","","","","","","","","","",0,0,"","","","","","","","","","","",null,"","","","",283,"",283,"",283,"",283,""]
[{"$f":"IF(OR(J289=Translate!$B$27,OR(J289=Translate!$C$27,OR(J289=Translate!$C$28,OR(J289=Translate!$B$28)))),\"\",DB289)","v":""},null,"Select","Select","Select","Select","Select",null,null,"Selectionner","2022-03-09","","",{"$nulls":9},"","","","","","","","",null,"",0,"","",0,{"$nulls":7},"","","","","","","","","","","","","","","","",0,"","","","","","","",0,0,0,"","","","","","","","","","","","","","","","","",0,0,"","","","","","","","","","","",null,"","","","",284,"",284,"",284,"",284,""]
[{"$f":"IF(OR(J290=Translate!$B$27,OR(J290=Translate!$C$27,OR(J290=Translate!$C$28,OR(J290=Translate!$B$28)))),\"\",DB290)","v":""},null,"Select","Select","Select","Select","Select",null,null,"Selectionner","2022-03-09","","",{"$nulls":9},"","","","","","","","",null,"",0,"","",0,{"$nulls":7},"","","","","","","","","","","","","","","","",0,"","","","","","","",0,0,0,"","","","","","","","","","","","","","","","","",0,0,"","","","","","","","","","","",null,"","","","",285,"",285,"",285,"",285,""]
[{"$f":"IF(OR(J291=Translate!$B$27,OR(J291=Translate!$C$27,OR(J291=Translate!$C$28,OR(J291=Translate!$B$28)))),\"\",DB291)","v":""},null,"Select","Select","Select","Select","Select",null,null,"Selectionner","2022-03-09","","",{"$nulls":9},"","","","","","","","",null,"",0,"","",0,{"$nulls":7},"","","","","","","","","","","","","","","","",0,"","","","","","","",0,0,0,"","","","","","","","","","","","","","","","","",0,0,"","","","","","","","","","","",null,"","","","",286,"",286,"",286,"",286,""]
[{"$f":"IF(OR(J292=Translate!$B$27,OR(J292=Translate!$C$27,OR(J292=Translate!$C$28,OR(J292=Translate!$B$28)))),\"\",DB292)","v":""},null,"Select","Select","Select","Select","Select",null,null,"Selectionner","2022-03-09","","",{"$nulls":9},"","","","","","","","",null,"",0,"","",0,{"$nulls":7},"","","","","","","","","","","","","","","","",0,"","","","","","","",0,0,0,"","","","","","","","","","","","","","","","","",0,0,"","","","","","","","","","","",null,"","","","",287,"",287,"",287,"",287,""]
[{"$f":"IF(OR(J293=Translate!$B$27,OR(J293=Translate!$C$27,OR(J293=Translate!$C$28,OR(J293=Translate!$B$28)))),\"\",DB293)","v":""},null,"Select","Select","Select","Select","Select",null,null,"Selectionner","2022-03-09","","",{"$nulls":9},"","","","","","","","",null,"",0,"","",0,{"$nulls":7},"","","","","","","","","","","","","","","","",0,"","","","","","","",0,0,0,"","","","","","","","","","","","","","","","","",0,0,"","","","","","","","","","","",null,"","","","",288,"",288,"",288,"",288,""]
[{"$f":"IF(OR(J294=Translate!$B$27,OR(J294=Translate!$C$27,OR(J294=Translate!$C$28,OR(J294=Translate!$B$28)))),\"\",DB294)","v":""},null,"Select","Select","Select","Select","Select",null,null,"Selectionner","2022-03-09","","",{"$nulls":9},"","","","","","","","",null,"",0,"","",0,{"$nulls":7},"","","","","","","","","","","","","","","","",0,"","","","","","","",0,0,0,"","","","","","","","","","","","","","","","","",0,0,"","","","","","","","","","","",null,"","","","",289,"",289,"",289,"",289,""]
[{"$f":"IF(OR(J295=Translate!$B$27,OR(J295=Translate!$C$27,OR(J295=Translate!$C$28,OR(J295=Translate!$B$28)))),\"\",DB295)","v":""},null,"Select","Select","Select","Select","Select",null,null,"Selectionner","2022-03-09","","",{"$nulls":9},"","","","","","","","",null,"",0,"","",0,{"$nulls":7},"","","","","","","","","","","","","","","","",0,"","","","","","","",0,0,0,"","","","","","","","","","","","","","","","","",0,0,"","","","","","","","","","","",null,"","","","",290,"",290,"",290,"",290,""]
[{"$f":"IF(OR(J296=Translate!$B$27,OR(J296=Translate!$C$27,OR(J296=Translate!$C$28,OR(J296=Translate!$B$28)))),\"\",DB296)","v":""},null,"Select","Select","Select","Select","Select",null,null,"Selectionner","2022-03-09","","",{"$nulls":9},"","","","","","","","",null,"",0,"","",0,{"$nulls":7},"","","","","","","","","","","","","","","","",0,"","","","","","","",0,0,0,"","","","","","","","","","","","","","","","","",0,0,"","","","","","","","","","","",null,"","","","",291,"",291,"",291,"",291,""]
[{"$f":"IF(OR(J297=Translate!$B$27,OR(J297=Translate!$C$27,OR(J297=Translate!$C$28,OR(J297=Translate!$B$28)))),\"\",DB297)","v":""},null,"Select","Select","Select","Select","Select",null,null,"Selectionner","2022-03-09","","",{"$nulls":9},"","","","","","","","",null,"",0,"","",0,{"$nulls":7},"","","","","","","","","","","","","","","","",0,"","","","","","","",0,0,0,"","","","","","","","","","","","","","","","","",0,0,"","","","","","","","","","","",null,"","","","",292,"",292,"",292,"",292,""]
[{"$f":"IF(OR(J298=Translate!$B$27,OR(J298=Translate!$C$27,OR(J298=Translate!$C$28,OR(J298=Translate!$B$28)))),\"\",DB298)","v":""},null,"Select","Select","Select","Select","Select",null,null,"Selectionner","2022-03-09","","",{"$nulls":9},"","","","","","","","",null,"",0,"","",0,{"$nulls":7},"","","","","","","","","","","","","","","","",0,"","","","","","","",0,0,0,"","","","","","","","","","","","","","","","","",0,0,"","","","","","","","","","","",null,"","","","",293,"",293,"",293,"",293,""]
[{"$f":"IF(OR(J299=Translate!$B$27,OR(J299=Translate!$C$27,OR(J299=Translate!$C$28,OR(J299=Translate!$B$28)))),\"\",DB299)","v":""},null,"Select","Select","Select","Select","Select",null,null,"Selectionner","2022-03-09","","",{"$nulls":9},"","","","","","","","",null,"",0,"","",0,{"$nulls":7},"","","","","","","","","","","","","","","","",0,"","","","","","","",0,0,0,"","","","","","","","","","","","","","","","","",0,0,"","","","","","","","","","","",null,"","","","",294,"",294,"",294,"",294,""]
[{"$f":"IF(OR(J300=Translate!$B$27,OR(J300=Translate!$C$27,OR(J300=Translate!$C$28,OR(J300=Translate!$B$28)))),\"\",DB300)","v":""},null,"Select","Select","Select","Select","Select",null,null,"Selectionner","2022-03-09","","",{"$nulls":9},"","","","","","","","",null,"",0,"","",0,{"$nulls":7},"","","","","","","","","","","","","","","","",0,"","","","","","","",0,0,0,"","","","","","","","","","","","","","","","","",0,0,"","","","","","","","","","","",null,"","","","",295,"",295,"",295,"",295,""]
[{"$f":"IF(OR(J301=Translate!$B$27,OR(J301=Translate!$C$27,OR(J301=Translate!$C$28,OR(J301=Translate!$B$28)))),\"\",DB301)","v":""},null,"Select","Select","Select","Select","Select",null,null,"Selectionner","2022-03-09","","",{"$nulls":9},"","","","","","","","",null,"",0,"","",0,{"$nulls":7},"","","","","","","","","","","","","","","","",0,"","","","","","","",0,0,0,"","","","","","","","","","","","","","","","","",0,0,"","","","","","","","","","","",null,"","","","",296,"",296,"",296,"",296,""]
[{"$f":"IF(OR(J302=Translate!$B$27,OR(J302=Translate!$C$27,OR(J302=Translate!$C$28,OR(J302=Translate!$B$28)))),\"\",DB302)","v":""},null,"Select","Select","Select","Select","Select",null,null,"Selectionner","2022-03-09","","",{"$nulls":9},"","","","","","","","",null,"",0,"","",0,{"$nulls":7},"","","","","","","","","","","","","","","","",0,"","","","","","","",0,0,0,"","","","","","","","","","","","","","","","","",0,0,"","","","","","","","","","","",null,"","","","",297,"",297,"",297,"",297,""]
[{"$f":"IF(OR(J303=Translate!$B$27,OR(J303=Translate!$C$27,OR(J303=Translate!$C$28,OR(J303=Translate!$B$28)))),\"\",DB303)","v":""},null,"Select","Select","Select","Select","Select",null,null,"Selectionner","2022-03-09","","",{"$nulls":9},"","","","","","","","",null,"",0,"","",0,{"$nulls":7},"","","","","","","","","","","","","","","","",0,"","","","","","","",0,0,0,"","","","","","","","","","","","","","","","","",0,0,"","","","","","","","","","","",null,"","","","",298,"",298,"",298,"",298,""]
[{"$f":"IF(OR(J304=Translate!$B$27,OR(J304=Translate!$C$27,OR(J304=Translate!$C$28,OR(J304=Translate!$B$28)))),\"\",DB304)","v":""},null,"Select","Select","Select","Select","Select",null,null,"Selectionner","2022-03-09","","",{"$nulls":9},"","","","","","","","",null,"",0,"","",0,{"$nulls":7},"","","","","","","","","","","","","","","","",0,"","","","","","","",0,0,0,"","","","","","","","","","","","","","","","","",0,0,"","","","","","","","","","","",null,"","","","",299,"",299,"",299,"",299,""]
[{"$f":"IF(OR(J305=Translate!$B$27,OR(J305=Translate!$C$27,OR(J305=Translate!$C$28,OR(J305=Translate!$B$28)))),\"\",DB305)","v":""},null,"Select","Select","Select","Select","Select",null,null,"Selectionner","2022-03-09","","",{"$nulls":9},"","","","","","","","",null,"",0,"","",0,{"$nulls":7},"","","","","","","","","","","","","","","","",0,"","","","","","","",0,0,0,"","","","","","","","","","","","","","","","","",0,0,"","","","","","","","","","","",null,"","","","",300,"",300,"",300,"",300,""]
[{"$f":"IF(OR(J306=Translate!$B$27,OR(J306=Translate!$C$27,OR(J306=Translate!$C$28,OR(J306=Translate!$B$28)))),\"\",DB306)","v":""},null,"Select","Select","Select","Select","Select",null,null,"Selectionner","2022-03-09","","",{"$nulls":9},"","","","","","","","",null,"",0,"","",0,{"$nulls":7},"","","","","","","","","","","","","","","","",0,"","","","","","","",0,0,0,"","","","","","","","","","","","","","","","","",0,0,"","","","","","","","","","","",null,"","","","",301,"",301,"",301,"",301,""]
[{"$f":"IF(OR(J307=Translate!$B$27,OR(J307=Translate!$C$27,OR(J307=Translate!$C$28,OR(J307=Translate!$B$28)))),\"\",DB307)","v":""},null,"Select","Select","Select","Select","Select",null,null,"Selectionner","2022-03-09","","",{"$nulls":9},"","","","","","","","",null,"",0,"","",0,{"$nulls":7},"","","","","","","","","","","","","","","","",0,"","","","","","","",0,0,0,"","","","","","","","","","","","","","","","","",0,0,"","","","","","","","","","","",null,"","","","",302,"",302,"",302,"",302,""]
[{"$f":"IF(OR(J308=Translate!$B$27,OR(J308=Translate!$C$27,OR(J308=Translate!$C$28,OR(J308=Translate!$B$28)))),\"\",DB308)","v":""},null,"Select","Select","Select","Select","Select",null,null,"Selectionner","2022-03-09","","",{"$nulls":9},"","","","","","","","",null,"",0,"","",0,{"$nulls":7},"","","","","","","","","","","","","","","","",0,"","","","","","","",0,0,0,"","","","","","","","","","","","","","","","","",0,0,"","","","","","","","","","","",null,"","","","",303,"",303,"",303,"",303,""]
[{"$f":"IF(OR(J309=Translate!$B$27,OR(J309=Translate!$C$27,OR(J309=Translate!$C$28,OR(J309=Translate!$B$28)))),\"\",DB309)","v":""},null,"Select","Select","Select","Select","Select",null,null,"Selectionner","2022-03-09","","",{"$nulls":9},"","","","","","","","",null,"",0,"","",0,{"$nulls":7},"","","","","","","","","","","","","","","","",0,"","","","","","","",0,0,0,"","","","","","","","","","","","","","","","","",0,0,"","","","","","","","","","","",null,"","","","",304,"",304,"",304,"",304,""]
[{"$f":"IF(OR(J310=Translate!$B$27,OR(J310=Translate!$C$27,OR(J310=Translate!$C$28,OR(J310=Translate!$B$28)))),\"\",DB310)","v":""},null,"Select","Select","Select","Select","Select",null,null,"Selectionner","2022-03-09","","",{"$nulls":9},"","","","","","","","",null,"",0,"","",0,{"$nulls":7},"","","","","","","","","","","","","","","","",0,"","","","","","","",0,0,0,"","","","","","","","","","","","","","","","","",0,0,"","","","","","","","","","","",null,"","","","",305,"",305,"",305,"",305,""]
[{"$f":"IF(OR(J311=Translate!$B$27,OR(J311=Translate!$C$27,OR(J311=Translate!$C$28,OR(J311=Translate!$B$28)))),\"\",DB311)","v":""},null,"Select","Select","Select","Select","Select",null,null,"Selectionner","2022-03-09","","",{"$nulls":9},"","","","","","","","",null,"",0,"","",0,{"$nulls":7},"","","","","","","","","","","","","","","","",0,"","","","","","","",0,0,0,"","","","","","","","","","","","","","","","","",0,0,"","","","","","","","","","","",null,"","","","",306,"",306,"",306,"",306,""]
[{"$f":"IF(OR(J312=Translate!$B$27,OR(J312=Translate!$C$27,OR(J312=Translate!$C$28,OR(J312=Translate!$B$28)))),\"\",DB312)","v":""},null,"Select","Select","Select","Select","Select",null,null,"Selectionner","2022-03-09","","",{"$nulls":9},"","","","","","","","",null,"",0,"","",0,{"$nulls":7},"","","","","","","","","","","","","","","","",0,"","","","","","","",0,0,0,"","","","","","","","","","","","","","","","","",0,0,"","","","","","","","","","","",null,"","","","",307,"",307,"",307,"",307,""]
[{"$f":"IF(OR(J313=Translate!$B$27,OR(J313=Translate!$C$27,OR(J313=Translate!$C$28,OR(J313=Translate!$B$28)))),\"\",DB313)","v":""},null,"Select","Select","Select","Select","Select",null,null,"Selectionner","2022-03-09","","",{"$nulls":9},"","","","","","","","",null,"",0,"","",0,{"$nulls":7},"","","","","","","","","","","","","","","","",0,"","","","","","","",0,0,0,"","","","","","","","","","","","","","","","","",0,0,"","","","","","","","","","","",null,"","","","",308,"",308,"",308,"",308,""]
[{"$f":"IF(OR(J314=Translate!$B$27,OR(J314=Translate!$C$27,OR(J314=Translate!$C$28,OR(J314=Translate!$B$28)))),\"\",DB314)","v":""},null,"Select","Select","Select","Select","Select",null,null,"Selectionner","2022-03-09","","",{"$nulls":9},"","","","","","","","",null,"",0,"","",0,{"$nulls":7},"","","","","","","","","","","","","","","","",0,"","","","","","","",0,0,0,"","","","","","","","","","","","","","","","","",0,0,"","","","","","","","","","","",null,"","","","",309,"",309,"",309,"",309,""]
[{"$f":"IF(OR(J315=Translate!$B$27,OR(J315=Translate!$C$27,OR(J315=Translate!$C$28,OR(J315=Translate!$B$28)))),\"\",DB315)","v":""},null,"Select","Select","Select","Select","Select",null,null,"Selectionner","2022-03-09","","",{"$nulls":9},"","","","","","","","",null,"",0,"","",0,{"$nulls":7},"","","","","","","","","","","","","","","","",0,"","","","","","","",0,0,0,"","","","","","","","","","","","","","","","","",0,0,"","","","","","","","","","","",null,"","","","",310,"",310,"",310,"",310,""]
[{"$f":"IF(OR(J316=Translate!$B$27,OR(J316=Translate!$C$27,OR(J316=Translate!$C$28,OR(J316=Translate!$B$28)))),\"\",DB316)","v":""},null,"Select","Select","Select","Select","Select",null,null,"Selectionner","2022-03-09","","",{"$nulls":9},"","","","","","","","",null,"",0,"","",0,{"$nulls":7},"","","","","","","","","","","","","","","","",0,"","","","","","","",0,0,0,"","","","","","","","","","","","","","","","","",0,0,"","","","","","","","","","","",null,"","","","",311,"",311,"",311,"",311,""]
[{"$f":"IF(OR(J317=Translate!$B$27,OR(J317=Translate!$C$27,OR(J317=Translate!$C$28,OR(J317=Translate!$B$28)))),\"\",DB317)","v":""},null,"Select","Select","Select","Select","Select",null,null,"Selectionner","2022-03-09","","",{"$nulls":9},"","","","","","","","",null,"",0,"","",0,{"$nulls":7},"","","","","","","","","","","","","","","","",0,"","","","","","","",0,0,0,"","","","","","","","","","","","","","","","","",0,0,"","","","","","","","","","","",null,"","","","",312,"",312,"",312,"",312,""]
[{"$f":"IF(OR(J318=Translate!$B$27,OR(J318=Translate!$C$27,OR(J318=Translate!$C$28,OR(J318=Translate!$B$28)))),\"\",DB318)","v":""},null,"Select","Select","Select","Select","Select",null,null,"Selectionner","2022-03-09","","",{"$nulls":9},"","","","","","","","",null,"",0,"","",0,{"$nulls":7},"","","","","","","","","","","","","","","","",0,"","","","","","","",0,0,0,"","","","","","","","","","","","","","","","","",0,0,"","","","","","","","","","","",null,"","","","",313,"",313,"",313,"",313,""]
[{"$f":"IF(OR(J319=Translate!$B$27,OR(J319=Translate!$C$27,OR(J319=Translate!$C$28,OR(J319=Translate!$B$28)))),\"\",DB319)","v":""},null,"Select","Select","Select","Select","Select",null,null,"Selectionner","2022-03-09","","",{"$nulls":9},"","","","","","","","",null,"",0,"","",0,{"$nulls":7},"","","","","","","","","","","","","","","","",0,"","","","","","","",0,0,0,"","","","","","","","","","","","","","","","","",0,0,"","","","","","","","","","","",null,"","","","",314,"",314,"",314,"",314,""]
[{"$f":"IF(OR(J320=Translate!$B$27,OR(J320=Translate!$C$27,OR(J320=Translate!$C$28,OR(J320=Translate!$B$28)))),\"\",DB320)","v":""},null,"Select","Select","Select","Select","Select",null,null,"Selectionner","2022-03-09","","",{"$nulls":9},"","","","","","","","",null,"",0,"","",0,{"$nulls":7},"","","","","","","","","","","","","","","","",0,"","","","","","","",0,0,0,"","","","","","","","","","","","","","","","","",0,0,"","","","","","","","","","","",null,"","","","",315,"",315,"",315,"",315,""]
[{"$f":"IF(OR(J321=Translate!$B$27,OR(J321=Translate!$C$27,OR(J321=Translate!$C$28,OR(J321=Translate!$B$28)))),\"\",DB321)","v":""},null,"Select","Select","Select","Select","Select",null,null,"Selectionner","2022-03-09","","",{"$nulls":9},"","","","","","","","",null,"",0,"","",0,{"$nulls":7},"","","","","","","","","","","","","","","","",0,"","","","","","","",0,0,0,"","","","","","","","","","","","","","","","","",0,0,"","","","","","","","","","","",null,"","","","",316,"",316,"",316,"",316,""]
[{"$f":"IF(OR(J322=Translate!$B$27,OR(J322=Translate!$C$27,OR(J322=Translate!$C$28,OR(J322=Translate!$B$28)))),\"\",DB322)","v":""},null,"Select","Select","Select","Select","Select",null,null,"Selectionner","2022-03-09","","",{"$nulls":9},"","","","","","","","",null,"",0,"","",0,{"$nulls":7},"","","","","","","","","","","","","","","","",0,"","","","","","","",0,0,0,"","","","","","","","","","","","","","","","","",0,0,"","","","","","","","","","","",null,"","","","",317,"",317,"",317,"",317,""]
[{"$f":"IF(OR(J323=Translate!$B$27,OR(J323=Translate!$C$27,OR(J323=Translate!$C$28,OR(J323=Translate!$B$28)))),\"\",DB323)","v":""},null,"Select","Select","Select","Select","Select",null,null,"Selectionner","2022-03-09","","",{"$nulls":9},"","","","","","","","",null,"",0,"","",0,{"$nulls":7},"","","","","","","","","","","","","","","","",0,"","","","","","","",0,0,0,"","","","","","","","","","","","","","","","","",0,0,"","","","","","","","","","","",null,"","","","",318,"",318,"",318,"",318,""]
[{"$f":"IF(OR(J324=Translate!$B$27,OR(J324=Translate!$C$27,OR(J324=Translate!$C$28,OR(J324=Translate!$B$28)))),\"\",DB324)","v":""},null,"Select","Select","Select","Select","Select",null,null,"Selectionner","2022-03-09","","",{"$nulls":9},"","","","","","","","",null,"",0,"","",0,{"$nulls":7},"","","","","","","","","","","","","","","","",0,"","","","","","","",0,0,0,"","","","","","","","","","","","","","","","","",0,0,"","","","","","","","","","","",null,"","","","",319,"",319,"",319,"",319,""]
[{"$f":"IF(OR(J325=Translate!$B$27,OR(J325=Translate!$C$27,OR(J325=Translate!$C$28,OR(J325=Translate!$B$28)))),\"\",DB325)","v":""},null,"Select","Select","Select","Select","Select",null,null,"Selectionner","2022-03-09","","",{"$nulls":9},"","","","","","","","",null,"",0,"","",0,{"$nulls":7},"","","","","","","","","","","","","","","","",0,"","","","","","","",0,0,0,"","","","","","","","","","","","","","","","","",0,0,"","","","","","","","","","","",null,"","","","",320,"",320,"",320,"",320,""]
[{"$f":"IF(OR(J326=Translate!$B$27,OR(J326=Translate!$C$27,OR(J326=Translate!$C$28,OR(J326=Translate!$B$28)))),\"\",DB326)","v":""},null,"Select","Select","Select","Select","Select",null,null,"Selectionner","2022-03-09","","",{"$nulls":9},{"$f":"IF(B326=\"\",\"\",1)","v":""},{"$f":"IF(E326=\"Fonds Mondial\",W326,\"\")","v":""},{"$f":"IF(E326=\"CCM\",W326,\"\")","v":""},{"$f":"IF(E326=\"PNLIT\",W326,\"\")","v":""},{"$f":"IF(E326=\"MSP\",W326,\"\")","v":""},{"$f":"IF(E326=\"DPML\",W326,\"\")","v":""},{"$f":"IF(E326=\"DNSIS\",W326,\"\")","v":""},{"$f":"IF(E326=\"Autres\",W326,\"\")","v":""},null,"",0,"","",0,{"$nulls":7},{"$f":"IF(AND(F326=$AR$5,AND(BQ326=1)),1,\"\")","v":""},{"$f":"IF(AND(F326=$AS$5,AND(BQ326=1)),1,\"\")","v":""},{"$f":"IF(AND(F326=$AT$5,AND(BQ326=1)),1,\"\")","v":""},{"$f":"IF(AND(F326=$AU$5,AND(BQ326=1)),1,\"\")","v":""},{"$f":"IF(AND(F326=$AV$5,AND(BQ326=1)),1,\"\")","v":""},{"$f":"IF(AND(F326=$AW$5,AND(BQ326=1)),1,\"\")","v":""},{"$f":"IF(AND(F326=$AX$5,AND(BQ326=1)),1,\"\")","v":""},{"$f":"IF(AND(F326=$AY$5,AND(BQ326=1)),1,\"\")","v":""},{"$f":"IF(AND(F326=$AZ$5,AND(BQ326=1)),1,\"\")","v":""},{"$f":"IF(AND(F326=$BA$5,AND(BQ326=1)),1,\"\")","v":""},{"$f":"IF(AND(F326=$BB$5,AND(BQ326=1)),1,\"\")","v":""},{"$f":"IF(AND(F326=$BC$5,AND(BQ326=1)),1,\"\")","v":""},{"$f":"IF(AND(F326=$BD$5,AND(BQ326=1)),1,\"\")","v":""},{"$f":"IF(AND(F326=$BE$5,AND(BQ326=1)),1,\"\")","v":""},{"$f":"IF(AND(F326=$BF$5,AND(BQ326=1)),1,\"\")","v":""},{"$f":"IF(AND(F326=$BG$5,AND(BQ326=1)),1,\"\")","v":""},0,"","","","","","","",0,{"$f":"IF(OR(B326=\"\",OR(C326=\"Select\",OR(E326=\"Select\",OR(F326=\"Select\",OR(I326=\"\",OR(D326=\"Select\",OR(J326=\"Select\"))))))),0,1)","v":0},0,"",{"$f":"IF(C326=$BT$5,1,\"\")","v":""},{"$f":"IF(C326=$BU$5,1,\"\")","v":""},{"$f":"IF(C326=$BV$5,1,\"\")","v":""},{"$f":"IF(C326=$BW$5,1,\"\")","v":""},{"$f":"IF(C326=$BX$5,1,\"\")","v":""},{"$f":"IF(C326=$BY$5,1,\"\")","v":""},{"$f":"IF(C326=$BZ$5,1,\"\")","v":""},{"$f":"IF(C326=$CA$5,1,\"\")","v":""},{"$f":"IF(C326=$CB$5,1,\"\")","v":""},{"$f":"IF(D326=$CC$5,1,\"\")","v":""},{"$f":"IF(D326=$CD$5,1,\"\")","v":""},{"$f":"IF(D326=$CE$5,1,\"\")","v":""},{"$f":"IF(D326=$CF$5,1,\"\")","v":""},{"$f":"IF(D326=$CG$5,1,\"\")","v":""},{"$f":"IF(D326=$CH$5,1,\"\")","v":""},"",0,0,{"$f":"IF(AND(F326=$CL$5,AND(BQ326=1)),1,\"\")","v":""},{"$f":"IF(AND(F326=$CM$5,AND(BQ326=1)),1,\"\")","v":""},{"$f":"IF(AND(F326=$CN$5,AND(BQ326=1)),1,\"\")","v":""},{"$f":"IF(AND(F326=$CO$5,AND(BQ326=1)),1,\"\")","v":""},{"$f":"IF(AND(F326=$CP$5,AND(BQ326=1)),1,\"\")","v":""},{"$f":"IF(AND(F326=$CQ$5,AND(BQ326=1)),1,\"\")","v":""},{"$f":"IF(AND(F326=$CR$5,AND(BQ326=1)),1,\"\")","v":""},{"$f":"IF(AND(F326=$CS$5,AND(BQ326=1)),1,\"\")","v":""},{"$f":"IF(AND(F326=$CT$5,AND(BQ326=1)),1,\"\")","v":""},{"$f":"IF(AND(F326=$CU$5,AND(BQ326=1)),1,\"\")","v":""},{"$f":"IF(AND(F326=$CV$5,AND(BQ326=1)),1,\"\")","v":""},null,"","","","",321,"",321,"",321,"",321,""]
[{"$f":"IF(OR(J327=Translate!$B$27,OR(J327=Translate!$C$27,OR(J327=Translate!$C$28,OR(J327=Translate!$B$28)))),\"\",DB327)","v":""},null,"Select","Select","Select","Select","Select",null,null,"Selectionner",{"$f":"TODAY()","v":"2022-03-09"},{"$f":"IF(OR(I327=\"\",OR(J327=$R$14,OR(J327=$R$9))),\"\",I327-K327)","v":""},{"$f":"IF(BR327=1,L327,\"\")","v":""},{"$nulls":9},"","","","","","","","",null,{"$f":"IF(M327<0,1,\"\")","v":""},{"$f":"IF(AND(J327=\"Réalisée\",AND(M327=\"\")),1,0)","v":0},"",{"$f":"IF(AND(M327>0,M327<15),1,\"\")","v":""},{"$f":"IF(AND(J327=\"En cours\",AND(M327>14)),1,0)","v":0},{"$nulls":7},"","","","","","","","","","","","","","","","",{"$f":"BQ327","v":0},{"$f":"IF(AND(J327=$BI$5,AND(BQ327=1)),1,\"\")","v":""},{"$f":"IF(AND(J327=$BJ$5,AND(BQ327=1)),1,\"\")","v":""},{"$f":"IF(AND(J327=$BK$5,AND(BQ327=1)),1,\"\")","v":""},{"$f":"IF(AND(J327=$BL$5,AND(BQ327=1)),1,\"\")","v":""},{"$f":"IF(AND(J327=$BM$5,AND(BQ327=1)),1,\"\")","v":""},{"$f":"IF(AND(J327=$BN$5,AND(BQ327=1)),1,\"\")","v":""},{"$f":"IF(M327<0,1,\"\")","v":""},{"$f":"IF(OR(J327=$BI$5,OR(J327=$BN$5,OR(J327=$CZ$5))),1,0)","v":0},0,{"$f":"IF(OR(J327=$BI$5,OR(J327=$BM$5,OR(J327=$R$10,OR(J327=$R$15,OR(J327=$R$18))))),\"\",BQ327)","v":0},{"$f":"IF(C327=$BS$5,1,\"\")","v":""},"","","","","","","","","","","","","","","",{"$f":"IF(AND(M327>0,M327<15),1,\"\")","v":""},{"$f":"IF((M327>14),1,0)*CK327","v":0},{"$f":"IF(M327=\"\",0,1)","v":0},"","","","","","","","","","","",null,{"$f":"IF(AND(J327=$CX$5,AND(BQ327=1)),1,\"\")","v":""},{"$f":"IF(AND(J327=$CY$5,AND(BQ327=1)),1,\"\")","v":""},{"$f":"IF(AND(J327=$CZ$5,AND(BQ327=1)),1,\"\")","v":""},{"$f":"IF(AND(J327=$DA$5,AND(BQ327=1)),1,\"\")","v":""},322,{"$f":"IF(B327=\"\",\"\",B327)","v":""},{"$f":"DF327","v":322},{"$f":"IF(OR(I327=\"\",OR(J327=\"Select\")),\"\",I327)","v":""},{"$f":"DB327","v":322},{"$f":"IF(F327=\"Select\",\"\",F327)","v":""},{"$f":"DF327","v":322},{"$f":"IF(C327=\"Select\",\"\",C327)","v":""}]
[{"$f":"IF(OR(J328=Translate!$B$27,OR(J328=Translate!$C$27,OR(J328=Translate!$C$28,OR(J328=Translate!$B$28)))),\"\",DB328)","v":""},null,"Select","Select","Select","Select","Select",null,null,"Selectionner","2022-03-09","","",{"$nulls":9},"","","","","","","","",null,"",0,"","",0,{"$nulls":7},"","","","","","","","","","","","","","","","",0,"","","","","","","",0,0,0,"","","","","","","","","","","","","","","","","",0,0,"","","","","","","","","","","",null,"","","","",323,"",323,"",323,"",323,""]
[{"$f":"IF(OR(J329=Translate!$B$27,OR(J329=Translate!$C$27,OR(J329=Translate!$C$28,OR(J329=Translate!$B$28)))),\"\",DB329)","v":""},null,"Select","Select","Select","Select","Select",null,null,"Selectionner","2022-03-09","","",{"$nulls":9},"","","","","","","","",null,"",0,{"$f":"IF(J329=\"Réalisée\",AG329,\"\")","v":""},"",0,{"$nulls":7},"","","","","","","","","","","","","","","","",0,"","","","","","","",0,0,0,"","","","","","","","","","","","","","","","","",0,0,"","","","","","","","","","","",null,"","","","",324,"",324,"",324,"",324,""]
[{"$f":"IF(OR(J330=Translate!$B$27,OR(J330=Translate!$C$27,OR(J330=Translate!$C$28,OR(J330=Translate!$B$28)))),\"\",DB330)","v":""},null,"Select","Select","Select","Select","Select",null,null,"Selectionner","2022-03-09","","",{"$nulls":9},"","","","","","","","",null,"",0,"","",0,{"$nulls":7},"","","","","","","","","","","","","","","","",0,"","","","","","","",0,0,0,"","","","","","","","","","","","","","","","","",0,0,"","","","","","","","","","","",null,"","","","",325,"",325,"",325,"",325,""]
[{"$f":"IF(OR(J331=Translate!$B$27,OR(J331=Translate!$C$27,OR(J331=Translate!$C$28,OR(J331=Translate!$B$28)))),\"\",DB331)","v":""},null,"Select","Select","Select","Select","Select",null,null,"Selectionner","2022-03-09","","",{"$nulls":9},"","","","","","","","",null,"",0,"","",0,{"$nulls":7},"","","","","","","","","","","","","","","","",0,"","","","","","","",0,0,0,"","","","","","","","","","","","","","","","","",0,0,"","","","","","","","","","","",null,"","","","",326,"",326,"",326,"",326,""]
[{"$f":"IF(OR(J332=Translate!$B$27,OR(J332=Translate!$C$27,OR(J332=Translate!$C$28,OR(J332=Translate!$B$28)))),\"\",DB332)","v":""},null,"Select","Select","Select","Select","Select",null,null,"Selectionner","2022-03-09","","",{"$nulls":9},"","","","","","","","",null,"",0,"","",0,{"$nulls":7},"","","","","","","","","","","","","","","","",0,"","","","","","","",0,0,0,"","","","","","","","","","","","","","","","","",0,0,"","","","","","","","","","","",null,"","","","",327,"",327,"",327,"",327,""]
[{"$f":"IF(OR(J333=Translate!$B$27,OR(J333=Translate!$C$27,OR(J333=Translate!$C$28,OR(J333=Translate!$B$28)))),\"\",DB333)","v":""},null,"Select","Select","Select","Select","Select",null,null,"Selectionner","2022-03-09","","",{"$nulls":9},"","","","","","","","",null,"",0,"","",0,{"$nulls":7},"","","","","","","","","","","","","","","","",0,"","","","","","","",0,0,0,"","","","","","","","","","","","","","","","","",0,0,"","","","","","","","","","","",null,"","","","",328,"",328,"",328,"",328,""]
[{"$f":"IF(OR(J334=Translate!$B$27,OR(J334=Translate!$C$27,OR(J334=Translate!$C$28,OR(J334=Translate!$B$28)))),\"\",DB334)","v":""},null,"Select","Select","Select","Select","Select",null,null,"Selectionner","2022-03-09","","",{"$nulls":9},"","","","","","","","",null,"",0,"","",0,{"$nulls":7},"","","","","","","","","","","","","","","","",0,"","","","","","","",0,0,0,"","","","","","","","","","","","","","","","","",0,0,"","","","","","","","","","","",null,"","","","",329,"",329,"",329,"",329,""]
[{"$f":"IF(OR(J335=Translate!$B$27,OR(J335=Translate!$C$27,OR(J335=Translate!$C$28,OR(J335=Translate!$B$28)))),\"\",DB335)","v":""},null,"Select","Select","Select","Select","Select",null,null,"Selectionner","2022-03-09","","",{"$nulls":9},"","","","","","","","",null,"",0,"","",0,{"$nulls":7},"","","","","","","","","","","","","","","","",0,"","","","","","","",0,0,0,"","","","","","","","","","","","","","","","","",0,0,"","","","","","","","","","","",null,"","","","",330,"",330,"",330,"",330,""]
[{"$f":"IF(OR(J336=Translate!$B$27,OR(J336=Translate!$C$27,OR(J336=Translate!$C$28,OR(J336=Translate!$B$28)))),\"\",DB336)","v":""},null,"Select","Select","Select","Select","Select",null,null,"Selectionner","2022-03-09","","",{"$nulls":9},"","","","","","","","",null,"",0,"","",0,{"$nulls":7},"","","","","","","","","","","","","","","","",0,"","","","","","","",0,0,0,"","","","","","","","","","","","","","","","","",0,0,"","","","","","","","","","","",null,"","","","",331,"",331,"",331,"",331,""]
[{"$f":"IF(OR(J337=Translate!$B$27,OR(J337=Translate!$C$27,OR(J337=Translate!$C$28,OR(J337=Translate!$B$28)))),\"\",DB337)","v":""},null,"Select","Select","Select","Select","Select",null,null,"Selectionner","2022-03-09","","",{"$nulls":9},"","","","","","","","",null,"",0,"","",0,{"$nulls":7},"","","","","","","","","","","","","","","","",0,"","","","","","","",0,0,0,"","","","","","","","","","","","","","","","","",0,0,"","","","","","","","","","","",null,"","","","",332,"",332,"",332,"",332,""]
[{"$f":"IF(OR(J338=Translate!$B$27,OR(J338=Translate!$C$27,OR(J338=Translate!$C$28,OR(J338=Translate!$B$28)))),\"\",DB338)","v":""},null,"Select","Select","Select","Select","Select",null,null,"Selectionner","2022-03-09","","",{"$nulls":9},"","","","","","","","",null,"",0,"","",0,{"$nulls":7},"","","","","","","","","","","","","","","","",0,"","","","","","","",0,0,0,"","","","","","","","","","","","","","","","","",0,0,"","","","","","","","","","","",null,"","","","",333,"",333,"",333,"",333,""]
[{"$f":"IF(OR(J339=Translate!$B$27,OR(J339=Translate!$C$27,OR(J339=Translate!$C$28,OR(J339=Translate!$B$28)))),\"\",DB339)","v":""},null,"Select","Select","Select","Select","Select",null,null,"Selectionner","2022-03-09","","",{"$nulls":9},"","","","","","","","",null,"",0,"","",0,{"$nulls":7},"","","","","","","","","","","","","","","","",0,"","","","","","","",0,0,0,"","","","","","","","","","","","","","","","","",0,0,"","","","","","","","","","","",null,"","","","",334,"",334,"",334,"",334,""]
[{"$f":"IF(OR(J340=Translate!$B$27,OR(J340=Translate!$C$27,OR(J340=Translate!$C$28,OR(J340=Translate!$B$28)))),\"\",DB340)","v":""},null,"Select","Select","Select","Select","Select",null,null,"Selectionner","2022-03-09","","",{"$nulls":9},"","","","","","","","",null,"",0,"","",0,{"$nulls":7},"","","","","","","","","","","","","","","","",0,"","","","","","","",0,0,0,"","","","","","","","","","","","","","","","","",0,0,"","","","","","","","","","","",null,"","","","",335,"",335,"",335,"",335,""]
[{"$f":"IF(OR(J341=Translate!$B$27,OR(J341=Translate!$C$27,OR(J341=Translate!$C$28,OR(J341=Translate!$B$28)))),\"\",DB341)","v":""},null,"Select","Select","Select","Select","Select",null,null,"Selectionner","2022-03-09","","",{"$nulls":9},"","","","","","","","",null,"",0,"","",0,{"$nulls":7},"","","","","","","","","","","","","","","","",0,"","","","","","","",0,0,0,"","","","","","","","","","","","","","","","","",0,0,"","","","","","","","","","","",null,"","","","",336,"",336,"",336,"",336,""]
[{"$f":"IF(OR(J342=Translate!$B$27,OR(J342=Translate!$C$27,OR(J342=Translate!$C$28,OR(J342=Translate!$B$28)))),\"\",DB342)","v":""},null,"Select","Select","Select","Select","Select",null,null,"Selectionner","2022-03-09","","",{"$nulls":9},"","","","","","","","",null,"",0,"","",0,{"$nulls":7},"","","","","","","","","","","","","","","","",0,"","","","","","","",0,0,0,"","","","","","","","","","","","","","","","","",0,0,"","","","","","","","","","","",null,"","","","",337,"",337,"",337,"",337,""]
[{"$f":"IF(OR(J343=Translate!$B$27,OR(J343=Translate!$C$27,OR(J343=Translate!$C$28,OR(J343=Translate!$B$28)))),\"\",DB343)","v":""},null,"Select","Select","Select","Select","Select",null,null,"Selectionner","2022-03-09","","",{"$nulls":9},"","","","","","","","",null,"",0,"","",0,{"$nulls":7},"","","","","","","","","","","","","","","","",0,"","","","","","","",0,0,0,"","","","","","","","","","","","","","","","","",0,0,"","","","","","","","","","","",null,"","","","",338,"",338,"",338,"",338,""]
[{"$f":"IF(OR(J344=Translate!$B$27,OR(J344=Translate!$C$27,OR(J344=Translate!$C$28,OR(J344=Translate!$B$28)))),\"\",DB344)","v":""},null,"Select","Select","Select","Select","Select",null,null,"Selectionner","2022-03-09","","",{"$nulls":9},"","","","","","","","",null,"",0,"","",0,{"$nulls":7},"","","","","","","","","","","","","","","","",0,"","","","","","","",0,0,0,"","","","","","","","","","","","","","","","","",0,0,"","","","","","","","","","","",null,"","","","",339,"",339,"",339,"",339,""]
[{"$f":"IF(OR(J345=Translate!$B$27,OR(J345=Translate!$C$27,OR(J345=Translate!$C$28,OR(J345=Translate!$B$28)))),\"\",DB345)","v":""},null,"Select","Select","Select","Select","Select",null,null,"Selectionner","2022-03-09","","",{"$nulls":9},"","","","","","","","",null,"",0,"","",0,{"$nulls":7},"","","","","","","","","","","","","","","","",0,"","","","","","","",0,0,0,"","","","","","","","","","","","","","","","","",0,0,"","","","","","","","","","","",null,"","","","",340,"",340,"",340,"",340,""]
[{"$f":"IF(OR(J346=Translate!$B$27,OR(J346=Translate!$C$27,OR(J346=Translate!$C$28,OR(J346=Translate!$B$28)))),\"\",DB346)","v":""},null,"Select","Select","Select","Select","Select",null,null,"Selectionner","2022-03-09","","",{"$nulls":9},"","","","","","","","",null,"",0,"","",0,{"$nulls":7},"","","","","","","","","","","","","","","","",0,"","","","","","","",0,0,0,"","","","","","","","","","","","","","","","","",0,0,"","","","","","","","","","","",null,"","","","",341,"",341,"",341,"",341,""]
[{"$f":"IF(OR(J347=Translate!$B$27,OR(J347=Translate!$C$27,OR(J347=Translate!$C$28,OR(J347=Translate!$B$28)))),\"\",DB347)","v":""},null,"Select","Select","Select","Select","Select",null,null,"Selectionner","2022-03-09","","",{"$nulls":9},"","","","","","","","",null,"",0,"","",0,{"$nulls":7},"","","","","","","","","","","","","","","","",0,"","","","","","","",0,0,0,"","","","","","","","","","","","","","","","","",0,0,"","","","","","","","","","","",null,"","","","",342,"",342,"",342,"",342,""]
[{"$f":"IF(OR(J348=Translate!$B$27,OR(J348=Translate!$C$27,OR(J348=Translate!$C$28,OR(J348=Translate!$B$28)))),\"\",DB348)","v":""},null,"Select","Select","Select","Select","Select",null,null,"Selectionner","2022-03-09","","",{"$nulls":9},"","","","","","","","",null,"",0,"","",0,{"$nulls":7},"","","","","","","","","","","","","","","","",0,"","","","","","","",0,0,0,"","","","","","","","","","","","","","","","","",0,0,"","","","","","","","","","","",null,"","","","",343,"",343,"",343,"",343,""]
[{"$f":"IF(OR(J349=Translate!$B$27,OR(J349=Translate!$C$27,OR(J349=Translate!$C$28,OR(J349=Translate!$B$28)))),\"\",DB349)","v":""},null,"Select","Select","Select","Select","Select",null,null,"Selectionner","2022-03-09","","",{"$nulls":9},"","","","","","","","",null,"",0,"","",0,{"$nulls":7},"","","","","","","","","","","","","","","","",0,"","","","","","","",0,0,0,"","","","","","","","","","","","","","","","","",0,0,"","","","","","","","","","","",null,"","","","",344,"",344,"",344,"",344,""]
[{"$f":"IF(OR(J350=Translate!$B$27,OR(J350=Translate!$C$27,OR(J350=Translate!$C$28,OR(J350=Translate!$B$28)))),\"\",DB350)","v":""},null,"Select","Select","Select","Select","Select",null,null,"Selectionner","2022-03-09","","",{"$nulls":9},"","","","","","","","",null,"",0,"","",0,{"$nulls":7},"","","","","","","","","","","","","","","","",0,"","","","","","","",0,0,0,"","","","","","","","","","","","","","","","","",0,0,"","","","","","","","","","","",null,"","","","",345,"",345,"",345,"",345,""]
[{"$f":"IF(OR(J351=Translate!$B$27,OR(J351=Translate!$C$27,OR(J351=Translate!$C$28,OR(J351=Translate!$B$28)))),\"\",DB351)","v":""},null,"Select","Select","Select","Select","Select",null,null,"Selectionner","2022-03-09","","",{"$nulls":9},"","","","","","","","",null,"",0,"","",0,{"$nulls":7},"","","","","","","","","","","","","","","","",0,"","","","","","","",0,0,0,"","","","","","","","","","","","","","","","","",0,0,"","","","","","","","","","","",null,"","","","",346,"",346,"",346,"",346,""]
[{"$f":"IF(OR(J352=Translate!$B$27,OR(J352=Translate!$C$27,OR(J352=Translate!$C$28,OR(J352=Translate!$B$28)))),\"\",DB352)","v":""},null,"Select","Select","Select","Select","Select",null,null,"Selectionner","2022-03-09","","",{"$nulls":9},"","","","","","","","",null,"",0,"","",0,{"$nulls":7},"","","","","","","","","","","","","","","","",0,"","","","","","","",0,0,0,"","","","","","","","","","","","","","","","","",0,0,"","","","","","","","","","","",null,"","","","",347,"",347,"",347,"",347,""]
[{"$f":"IF(OR(J353=Translate!$B$27,OR(J353=Translate!$C$27,OR(J353=Translate!$C$28,OR(J353=Translate!$B$28)))),\"\",DB353)","v":""},null,"Select","Select","Select","Select","Select",null,null,"Selectionner","2022-03-09","","",{"$nulls":9},"","","","","","","","",null,"",0,"","",0,{"$nulls":7},"","","","","","","","","","","","","","","","",0,"","","","","","","",0,0,0,"","","","","","","","","","","","","","","","","",0,0,"","","","","","","","","","","",null,"","","","",348,"",348,"",348,"",348,""]
[{"$f":"IF(OR(J354=Translate!$B$27,OR(J354=Translate!$C$27,OR(J354=Translate!$C$28,OR(J354=Translate!$B$28)))),\"\",DB354)","v":""},null,"Select","Select","Select","Select","Select",null,null,"Selectionner","2022-03-09","","",{"$nulls":9},"","","","","","","","",null,"",0,"","",0,{"$nulls":7},"","","","","","","","","","","","","","","","",0,"","","","","","","",0,0,0,"","","","","","","","","","","","","","","","","",0,0,"","","","","","","","","","","",null,"","","","",349,"",349,"",349,"",349,""]
[{"$f":"IF(OR(J355=Translate!$B$27,OR(J355=Translate!$C$27,OR(J355=Translate!$C$28,OR(J355=Translate!$B$28)))),\"\",DB355)","v":""},null,"Select","Select","Select","Select","Select",null,null,"Selectionner","2022-03-09","","",{"$nulls":9},"","","","","","","","",null,"",0,"","",0,{"$nulls":7},"","","","","","","","","","","","","","","","",0,"","","","","","","",0,0,0,"","","","","","","","","","","","","","","","","",0,0,"","","","","","","","","","","",null,"","","","",350,"",350,"",350,"",350,""]
[{"$f":"IF(OR(J356=Translate!$B$27,OR(J356=Translate!$C$27,OR(J356=Translate!$C$28,OR(J356=Translate!$B$28)))),\"\",DB356)","v":""},null,"Select","Select","Select","Select","Select",null,null,"Selectionner","2022-03-09","","",{"$nulls":9},"","","","","","","","",null,"",0,"","",0,{"$nulls":7},"","","","","","","","","","","","","","","","",0,"","","","","","","",0,0,0,"","","","","","","","","","","","","","","","","",0,0,"","","","","","","","","","","",null,"","","","",351,"",351,"",351,"",351,""]
[{"$f":"IF(OR(J357=Translate!$B$27,OR(J357=Translate!$C$27,OR(J357=Translate!$C$28,OR(J357=Translate!$B$28)))),\"\",DB357)","v":""},null,"Select","Select","Select","Select","Select",null,null,"Selectionner","2022-03-09","","",{"$nulls":9},"","","","","","","","",null,"",0,"","",0,{"$nulls":7},"","","","","","","","","","","","","","","","",0,"","","","","","","",0,0,0,"","","","","","","","","","","","","","","","","",0,0,"","","","","","","","","","","",null,"","","","",352,"",352,"",352,"",352,""]
[{"$f":"IF(OR(J358=Translate!$B$27,OR(J358=Translate!$C$27,OR(J358=Translate!$C$28,OR(J358=Translate!$B$28)))),\"\",DB358)","v":""},null,"Select","Select","Select","Select","Select",null,null,"Selectionner","2022-03-09","","",{"$nulls":9},"","","","","","","","",null,"",0,"","",0,{"$nulls":7},"","","","","","","","","","","","","","","","",0,"","","","","","","",0,0,0,"","","","","","","","","","","","","","","","","",0,0,"","","","","","","","","","","",null,"","","","",353,"",353,"",353,"",353,""]
[{"$f":"IF(OR(J359=Translate!$B$27,OR(J359=Translate!$C$27,OR(J359=Translate!$C$28,OR(J359=Translate!$B$28)))),\"\",DB359)","v":""},null,"Select","Select","Select","Select","Select",null,null,"Selectionner","2022-03-09","","",{"$nulls":9},"","","","","","","","",null,"",0,"","",0,{"$nulls":7},"","","","","","","","","","","","","","","","",0,"","","","","","","",0,0,0,"","","","","","","","","","","","","","","","","",0,0,"","","","","","","","","","","",null,"","","","",354,"",354,"",354,"",354,""]
[{"$f":"IF(OR(J360=Translate!$B$27,OR(J360=Translate!$C$27,OR(J360=Translate!$C$28,OR(J360=Translate!$B$28)))),\"\",DB360)","v":""},null,"Select","Select","Select","Select","Select",null,null,"Selectionner","2022-03-09","","",{"$nulls":9},"","","","","","","","",null,"",0,"","",0,{"$nulls":7},"","","","","","","","","","","","","","","","",0,"","","","","","","",0,0,0,"","","","","","","","","","","","","","","","","",0,0,"","","","","","","","","","","",null,"","","","",355,"",355,"",355,"",355,""]
[{"$f":"IF(OR(J361=Translate!$B$27,OR(J361=Translate!$C$27,OR(J361=Translate!$C$28,OR(J361=Translate!$B$28)))),\"\",DB361)","v":""},null,"Select","Select","Select","Select","Select",null,null,"Selectionner","2022-03-09","","",{"$nulls":9},"","","","","","","","",null,"",0,"","",0,{"$nulls":7},"","","","","","","","","","","","","","","","",0,"","","","","","","",0,0,0,"","","","","","","","","","","","","","","","","",0,0,"","","","","","","","","","","",null,"","","","",356,"",356,"",356,"",356,""]
[{"$f":"IF(OR(J362=Translate!$B$27,OR(J362=Translate!$C$27,OR(J362=Translate!$C$28,OR(J362=Translate!$B$28)))),\"\",DB362)","v":""},null,"Select","Select","Select","Select","Select",null,null,"Selectionner","2022-03-09","","",{"$nulls":9},"","","","","","","","",null,"",0,"","",0,{"$nulls":7},"","","","","","","","","","","","","","","","",0,"","","","","","","",0,0,0,"","","","","","","","","","","","","","","","","",0,0,"","","","","","","","","","","",null,"","","","",357,"",357,"",357,"",357,""]
[{"$f":"IF(OR(J363=Translate!$B$27,OR(J363=Translate!$C$27,OR(J363=Translate!$C$28,OR(J363=Translate!$B$28)))),\"\",DB363)","v":""},null,"Select","Select","Select","Select","Select",null,null,"Selectionner","2022-03-09","","",{"$nulls":9},"","","","","","","","",null,"",0,"","",0,{"$nulls":7},"","","","","","","","","","","","","","","","",0,"","","","","","","",0,0,0,"","","","","","","","","","","","","","","","","",0,0,"","","","","","","","","","","",null,"","","","",358,"",358,"",358,"",358,""]
[{"$f":"IF(OR(J364=Translate!$B$27,OR(J364=Translate!$C$27,OR(J364=Translate!$C$28,OR(J364=Translate!$B$28)))),\"\",DB364)","v":""},null,"Select","Select","Select","Select","Select",null,null,"Selectionner","2022-03-09","","",{"$nulls":9},"","","","","","","","",null,"",0,"","",0,{"$nulls":7},"","","","","","","","","","","","","","","","",0,"","","","","","","",0,0,0,"","","","","","","","","","","","","","","","","",0,0,"","","","","","","","","","","",null,"","","","",359,"",359,"",359,"",359,""]
[{"$f":"IF(OR(J365=Translate!$B$27,OR(J365=Translate!$C$27,OR(J365=Translate!$C$28,OR(J365=Translate!$B$28)))),\"\",DB365)","v":""},null,"Select","Select","Select","Select","Select",null,null,"Selectionner","2022-03-09","","",{"$nulls":9},"","","","","","","","",null,"",0,"","",0,{"$nulls":7},"","","","","","","","","","","","","","","","",0,"","","","","","","",0,0,0,"","","","","","","","","","","","","","","","","",0,0,"","","","","","","","","","","",null,"","","","",360,"",360,"",360,"",360,""]
[{"$f":"IF(OR(J366=Translate!$B$27,OR(J366=Translate!$C$27,OR(J366=Translate!$C$28,OR(J366=Translate!$B$28)))),\"\",DB366)","v":""},null,"Select","Select","Select","Select","Select",null,null,"Selectionner","2022-03-09","","",{"$nulls":9},"","","","","","","","",null,"",0,"","",0,{"$nulls":7},"","","","","","","","","","","","","","","","",0,"","","","","","","",0,0,0,"","","","","","","","","","","","","","","","","",0,0,"","","","","","","","","","","",null,"","","","",361,"",361,"",361,"",361,""]
[{"$f":"IF(OR(J367=Translate!$B$27,OR(J367=Translate!$C$27,OR(J367=Translate!$C$28,OR(J367=Translate!$B$28)))),\"\",DB367)","v":""},null,"Select","Select","Select","Select","Select",null,null,"Selectionner","2022-03-09","","",{"$nulls":9},"","","","","","","","",null,"",0,"","",0,{"$nulls":7},"","","","","","","","","","","","","","","","",0,"","","","","","","",0,0,0,"","","","","","","","","","","","","","","","","",0,0,"","","","","","","","","","","",null,"","","","",362,"",362,"",362,"",362,""]
[{"$f":"IF(OR(J368=Translate!$B$27,OR(J368=Translate!$C$27,OR(J368=Translate!$C$28,OR(J368=Translate!$B$28)))),\"\",DB368)","v":""},null,"Select","Select","Select","Select","Select",null,null,"Selectionner","2022-03-09","","",{"$nulls":9},"","","","","","","","",null,"",0,"","",0,{"$nulls":7},"","","","","","","","","","","","","","","","",0,"","","","","","","",0,0,0,"","","","","","","","","","","","","","","","","",0,0,"","","","","","","","","","","",null,"","","","",363,"",363,"",363,"",363,""]
[{"$f":"IF(OR(J369=Translate!$B$27,OR(J369=Translate!$C$27,OR(J369=Translate!$C$28,OR(J369=Translate!$B$28)))),\"\",DB369)","v":""},null,"Select","Select","Select","Select","Select",null,null,"Selectionner","2022-03-09","","",{"$nulls":9},"","","","","","","","",null,"",0,"","",0,{"$nulls":7},"","","","","","","","","","","","","","","","",0,"","","","","","","",0,0,0,"","","","","","","","","","","","","","","","","",0,0,"","","","","","","","","","","",null,"","","","",364,"",364,"",364,"",364,""]
[{"$f":"IF(OR(J370=Translate!$B$27,OR(J370=Translate!$C$27,OR(J370=Translate!$C$28,OR(J370=Translate!$B$28)))),\"\",DB370)","v":""},null,"Select","Select","Select","Select","Select",null,null,"Selectionner","2022-03-09","","",{"$nulls":9},"","","","","","","","",null,"",0,"","",0,{"$nulls":7},"","","","","","","","","","","","","","","","",0,"","","","","","","",0,0,0,"","","","","","","","","","","","","","","","","",0,0,"","","","","","","","","","","",null,"","","","",365,"",365,"",365,"",365,""]
[{"$f":"IF(OR(J371=Translate!$B$27,OR(J371=Translate!$C$27,OR(J371=Translate!$C$28,OR(J371=Translate!$B$28)))),\"\",DB371)","v":""},null,"Select","Select","Select","Select","Select",null,null,"Selectionner","2022-03-09","","",{"$nulls":9},"","","","","","","","",null,"",0,"","",0,{"$nulls":7},"","","","","","","","","","","","","","","","",0,"","","","","","","",0,0,0,"","","","","","","","","","","","","","","","","",0,0,"","","","","","","","","","","",null,"","","","",366,"",366,"",366,"",366,""]
[{"$f":"IF(OR(J372=Translate!$B$27,OR(J372=Translate!$C$27,OR(J372=Translate!$C$28,OR(J372=Translate!$B$28)))),\"\",DB372)","v":""},null,"Select","Select","Select","Select","Select",null,null,"Selectionner","2022-03-09","","",{"$nulls":9},"","","","","","","","",null,"",0,"","",0,{"$nulls":7},"","","","","","","","","","","","","","","","",0,"","","","","","","",0,0,0,"","","","","","","","","","","","","","","","","",0,0,"","","","","","","","","","","",null,"","","","",367,"",367,"",367,"",367,""]
[{"$nulls":35},"Origine Activ/rec","Origine structure","Domaine","delai","structure","type action",null,null,"","","","","","","","","","","","","","","","",0,"","","","","","","",0,0,"","","","","","","","","","","","","","","","","","",0,0,"","","","","","","","","","","",null,"","","","",null,null,0,null,0]
[{"$nulls":35},"Select","Select","Select",{"$f":"Guidelines!Q46","v":"Selectionner"},{"$f":"Guidelines!M46","v":"Select"},{"$nulls":69},0]
[{"$nulls":35},{"$f":"Guidelines!Y33","v":"Fonds Mondial"},"Struture publique","Gestion du programme",{"$f":"Guidelines!Q47","v":"Réalisée"},{"$f":"Guidelines!M47","v":"CNLS"}]
[{"$nulls":35},{"$f":"Guidelines!Y34","v":"ICN/CCM"},"Struture privee","Gouvernance nationale",{"$f":"Guidelines!Q48","v":"En cours/toujours valide"},{"$f":"Guidelines!M48","v":"PNLS"},{"$nulls":28},{"$f":"SUMIF(BS6:BS373,1,BI6:BI373)","v":0}]
[{"$nulls":35},{"$f":"Guidelines!Y35","v":"PR"},"Societe civile (Assoc. ONG..)","Suivi evaluation",{"$f":"Guidelines!Q49","v":"Non Réalisée"},{"$f":"Guidelines!M49","v":0},{"$f":"Guidelines!N46","v":"Select"}]
[{"$nulls":35},{"$f":"Guidelines!Y36","v":"SR"},"ONG/Structures internationales","Gestion des achats/stocks",{"$f":"Guidelines!Q50","v":"Non applicable"},{"$f":"Guidelines!M50","v":0},{"$f":"Guidelines!N47","v":"Condition de l'accord "}]
[{"$nulls":35},{"$f":"Guidelines!Y37","v":"Agent local du Fonds (LFA)"},"Partenaires ","Finances",{"$f":"Guidelines!Q51","v":"Immediat (en cours)"},{"$f":"Guidelines!M51","v":0},{"$f":"Guidelines!N48","v":"Mesures de gestion"}]
[{"$nulls":35},{"$f":"Guidelines!Y38","v":"Agent fiscal"},"Autres","Autres",{"$f":"Guidelines!Q52","v":"Immediat (realise)"},{"$f":"Guidelines!M52","v":0},{"$f":"Guidelines!N49","v":"Recommandations OIG"},{"$nulls":29},{"$f":"CA378","v":0}]
[{"$nulls":35},{"$f":"Guidelines!Y39","v":"Ministere de la sante"},null,null,{"$f":"Guidelines!Q53","v":"Immediat (non realise)"},{"$f":"Guidelines!M53","v":0},{"$f":"Guidelines!N50","v":"Actions/recommandations Equipe pays"},{"$nulls":29},{"$f":"CA379","v":0}]
[{"$nulls":35},{"$f":"Guidelines!Y40","v":"Autres"},null,null,{"$f":"Guidelines!Q54","v":"Sans delai (en cours)"},{"$f":"Guidelines!M54","v":0},{"$f":"Guidelines!N51","v":"Actions suite revue PU/PUDR"},{"$nulls":29},0]
[{"$nulls":38},{"$f":"Guidelines!Q55","v":"Sans delai (realise)"},{"$f":"Guidelines!M55","v":0},{"$f":"Guidelines!N52","v":"Actions/Recommandations LFA"},{"$nulls":29},0]
[{"$nulls":38},{"$f":"Guidelines!Q56","v":"Sans delai (non realise)"},{"$f":"Guidelines!M56","v":0},{"$f":"Guidelines!N53","v":"Actions/recommandations ICN"},{"$nulls":8},{"$f":"SUMIF($AS$6:$AS$373,$AS$5,$BI$6:$BI$373)","v":0},{"$nulls":20},0]
[{"$nulls":39},{"$f":"Guidelines!M57","v":0},{"$f":"Guidelines!N54","v":"Recommandations du PR vers les SR"},{"$nulls":29},0]
[{"$nulls":39},{"$f":"Guidelines!M58","v":0},{"$f":"Guidelines!N55","v":"Actions/recommandations d'audit interne"},{"$nulls":29},0]
[{"$nulls":39},{"$f":"Guidelines!M59","v":0},{"$f":"Guidelines!N56","v":"Actions/recommandations d'audit externe"},{"$nulls":29},0]
[{"$nulls":39},{"$f":"Guidelines!M60","v":0},{"$f":"Guidelines!N57","v":"Autres"},{"$nulls":29},0]
[{"$nulls":39},{"$f":"Guidelines!M61","v":0},{"$f":"Guidelines!N58","v":0}]
[{"$nulls":39},{"$f":"Guidelines!M62","v":0},{"$f":"Guidelines!N59","v":0}]
[{"$nulls":39},{"$f":"Guidelines!M63","v":0},{"$f":"Guidelines!N60","v":0}]
[{"$nulls":39},{"$f":"Guidelines!M64","v":0},{"$f":"Guidelines!N61","v":0}]
[{"$nulls":39},{"$f":"Guidelines!M65","v":0}]
[{"$nulls":39},{"$f":"Guidelines!M66","v":0}]
[{"$nulls":39},{"$f":"Guidelines!M67","v":0}]
[{"$nulls":39},{"$f":"Guidelines!M68","v":0}]
[{"$nulls":39},{"$f":"Guidelines!M69","v":0}]
[{"$nulls":39},{"$f":"Guidelines!M70","v":0}]
[{"$nulls":39},{"$f":"Guidelines!M71","v":0}]
[{"$nulls":39},{"$f":"Guidelines!M72","v":0}]

{"sheet":"Param","index":3,"n_rows":401,"n_cols":11,"rows_kept":401,"hidden":true}
[]
[null,{"$f":"IFERROR(INDEX(List,SMALL(IF(List<>\"\",ROW(INDIRECT(\"1:\"&ROWS(List)))),ROWS($1:1))),\"\")","v":1},{"$f":"IFERROR(VLOOKUP(B2,Inputs_Rec.!$DB$6:$DC$372,2,FALSE),\"\")","v":"fgyuhijok"},{"$f":"IFERROR(VLOOKUP(B2,Inputs_Rec.!$DD$6:$DE$372,2,FALSE),\"\")","v":"2018-11-20"},null,null,{"$f":"B2","v":1},{"$f":"IFERROR(VLOOKUP(G2,Inputs_Rec.!$DF$6:$DG$372,2,FALSE),\"\")","v":"CNLS"},null,{"$f":"G2","v":1},{"$f":"IFERROR(VLOOKUP(J2,Inputs_Rec.!$DH$6:$DI$372,2,FALSE),\"\")","v":"Condition de l'accord "}]
[null,{"$f":"IFERROR(INDEX(List,SMALL(IF(List<>\"\",ROW(INDIRECT(\"1:\"&ROWS(List)))),ROWS($1:2))),\"\")","v":""},{"$f":"IFERROR(VLOOKUP(B3,Inputs_Rec.!$DB$6:$DC$372,2,FALSE),\"\")","v":""},{"$f":"IFERROR(VLOOKUP(B3,Inputs_Rec.!$DD$6:$DE$372,2,FALSE),\"\")","v":""},null,null,"",{"$f":"IFERROR(VLOOKUP(G3,Inputs_Rec.!$DF$6:$DG$372,2,FALSE),\"\")","v":""},null,"",{"$f":"IFERROR(VLOOKUP(J3,Inputs_Rec.!$DH$6:$DI$372,2,FALSE),\"\")","v":""}]
[null,{"$f":"IFERROR(INDEX(List,SMALL(IF(List<>\"\",ROW(INDIRECT(\"1:\"&ROWS(List)))),ROWS($1:3))),\"\")","v":""},{"$f":"IFERROR(VLOOKUP(B4,Inputs_Rec.!$DB$6:$DC$372,2,FALSE),\"\")","v":""},{"$f":"IFERROR(VLOOKUP(B4,Inputs_Rec.!$DD$6:$DE$372,2,FALSE),\"\")","v":""},null,"fg",{"$f":"B4","v":""},{"$f":"IFERROR(VLOOKUP(G4,Inputs_Rec.!$DF$6:$DG$372,2,FALSE),\"\")","v":""},null,{"$f":"G4","v":""},{"$f":"IFERROR(VLOOKUP(J4,Inputs_Rec.!$DH$6:$DI$372,2,FALSE),\"\")","v":""}]
[null,{"$f":"IFERROR(INDEX(List,SMALL(IF(List<>\"\",ROW(INDIRECT(\"1:\"&ROWS(List)))),ROWS($1:4))),\"\")","v":""},{"$f":"IFERROR(VLOOKUP(B5,Inputs_Rec.!$DB$6:$DC$372,2,FALSE),\"\")","v":""},{"$f":"IFERROR(VLOOKUP(B5,Inputs_Rec.!$DD$6:$DE$372,2,FALSE),\"\")","v":""},null,null,{"$f":"B5","v":""},{"$f":"IFERROR(VLOOKUP(G5,Inputs_Rec.!$DF$6:$DG$372,2,FALSE),\"\")","v":""},null,{"$f":"G5","v":""},{"$f":"IFERROR(VLOOKUP(J5,Inputs_Rec.!$DH$6:$DI$372,2,FALSE),\"\")","v":""}]
[null,{"$f":"IFERROR(INDEX(List,SMALL(IF(List<>\"\",ROW(INDIRECT(\"1:\"&ROWS(List)))),ROWS($1:5))),\"\")","v":""},{"$f":"IFERROR(VLOOKUP(B6,Inputs_Rec.!$DB$6:$DC$372,2,FALSE),\"\")","v":""},{"$f":"IFERROR(VLOOKUP(B6,Inputs_Rec.!$DD$6:$DE$372,2,FALSE),\"\")","v":""},null,null,"",{"$f":"IFERROR(VLOOKUP(G6,Inputs_Rec.!$DF$6:$DG$372,2,FALSE),\"\")","v":""},null,"",{"$f":"IFERROR(VLOOKUP(J6,Inputs_Rec.!$DH$6:$DI$372,2,FALSE),\"\")","v":""}]
[null,{"$f":"IFERROR(INDEX(List,SMALL(IF(List<>\"\",ROW(INDIRECT(\"1:\"&ROWS(List)))),ROWS($1:6))),\"\")","v":""},{"$f":"IFERROR(VLOOKUP(B7,Inputs_Rec.!$DB$6:$DC$372,2,FALSE),\"\")","v":""},{"$f":"IFERROR(VLOOKUP(B7,Inputs_Rec.!$DD$6:$DE$372,2,FALSE),\"\")","v":""},null,null,"",{"$f":"IFERROR(VLOOKUP(G7,Inputs_Rec.!$DF$6:$DG$372,2,FALSE),\"\")","v":""},null,"",{"$f":"IFERROR(VLOOKUP(J7,Inputs_Rec.!$DH$6:$DI$372,2,FALSE),\"\")","v":""}]
[null,{"$f":"IFERROR(INDEX(List,SMALL(IF(List<>\"\",ROW(INDIRECT(\"1:\"&ROWS(List)))),ROWS($1:7))),\"\")","v":""},{"$f":"IFERROR(VLOOKUP(B8,Inputs_Rec.!$DB$6:$DC$372,2,FALSE),\"\")","v":""},{"$f":"IFERROR(VLOOKUP(B8,Inputs_Rec.!$DD$6:$DE$372,2,FALSE),\"\")","v":""},null,null,"",{"$f":"IFERROR(VLOOKUP(G8,Inputs_Rec.!$DF$6:$DG$372,2,FALSE),\"\")","v":""},null,"",{"$f":"IFERROR(VLOOKUP(J8,Inputs_Rec.!$DH$6:$DI$372,2,FALSE),\"\")","v":""}]
[null,{"$f":"IFERROR(INDEX(List,SMALL(IF(List<>\"\",ROW(INDIRECT(\"1:\"&ROWS(List)))),ROWS($1:8))),\"\")","v":""},{"$f":"IFERROR(VLOOKUP(B9,Inputs_Rec.!$DB$6:$DC$372,2,FALSE),\"\")","v":""},{"$f":"IFERROR(VLOOKUP(B9,Inputs_Rec.!$DD$6:$DE$372,2,FALSE),\"\")","v":""},null,null,"",{"$f":"IFERROR(VLOOKUP(G9,Inputs_Rec.!$DF$6:$DG$372,2,FALSE),\"\")","v":""},null,"",{"$f":"IFERROR(VLOOKUP(J9,Inputs_Rec.!$DH$6:$DI$372,2,FALSE),\"\")","v":""}]
[null,{"$f":"IFERROR(INDEX(List,SMALL(IF(List<>\"\",ROW(INDIRECT(\"1:\"&ROWS(List)))),ROWS($1:9))),\"\")","v":""},{"$f":"IFERROR(VLOOKUP(B10,Inputs_Rec.!$DB$6:$DC$372,2,FALSE),\"\")","v":""},{"$f":"IFERROR(VLOOKUP(B10,Inputs_Rec.!$DD$6:$DE$372,2,FALSE),\"\")","v":""},null,null,"",{"$f":"IFERROR(VLOOKUP(G10,Inputs_Rec.!$DF$6:$DG$372,2,FALSE),\"\")","v":""},null,"",{"$f":"IFERROR(VLOOKUP(J10,Inputs_Rec.!$DH$6:$DI$372,2,FALSE),\"\")","v":""}]
[null,{"$f":"IFERROR(INDEX(List,SMALL(IF(List<>\"\",ROW(INDIRECT(\"1:\"&ROWS(List)))),ROWS($1:10))),\"\")","v":""},{"$f":"IFERROR(VLOOKUP(B11,Inputs_Rec.!$DB$6:$DC$372,2,FALSE),\"\")","v":""},{"$f":"IFERROR(VLOOKUP(B11,Inputs_Rec.!$DD$6:$DE$372,2,FALSE),\"\")","v":""},null,null,"",{"$f":"IFERROR(VLOOKUP(G11,Inputs_Rec.!$DF$6:$DG$372,2,FALSE),\"\")","v":""},null,"",{"$f":"IFERROR(VLOOKUP(J11,Inputs_Rec.!$DH$6:$DI$372,2,FALSE),\"\")","v":""}]
[null,{"$f":"IFERROR(INDEX(List,SMALL(IF(List<>\"\",ROW(INDIRECT(\"1:\"&ROWS(List)))),ROWS($1:11))),\"\")","v":""},{"$f":"IFERROR(VLOOKUP(B12,Inputs_Rec.!$DB$6:$DC$372,2,FALSE),\"\")","v":""},{"$f":"IFERROR(VLOOKUP(B12,Inputs_Rec.!$DD$6:$DE$372,2,FALSE),\"\")","v":""},null,null,"",{"$f":"IFERROR(VLOOKUP(G12,Inputs_Rec.!$DF$6:$DG$372,2,FALSE),\"\")","v":""},null,"",{"$f":"IFERROR(VLOOKUP(J12,Inputs_Rec.!$DH$6:$DI$372,2,FALSE),\"\")","v":""}]
[null,{"$f":"IFERROR(INDEX(List,SMALL(IF(List<>\"\",ROW(INDIRECT(\"1:\"&ROWS(List)))),ROWS($1:12))),\"\")","v":""},{"$f":"IFERROR(VLOOKUP(B13,Inputs_Rec.!$DB$6:$DC$372,2,FALSE),\"\")","v":""},{"$f":"IFERROR(VLOOKUP(B13,Inputs_Rec.!$DD$6:$DE$372,2,FALSE),\"\")","v":""},null,null,"",{"$f":"IFERROR(VLOOKUP(G13,Inputs_Rec.!$DF$6:$DG$372,2,FALSE),\"\")","v":""},null,"",{"$f":"IFERROR(VLOOKUP(J13,Inputs_Rec.!$DH$6:$DI$372,2,FALSE),\"\")","v":""}]
[null,{"$f":"IFERROR(INDEX(List,SMALL(IF(List<>\"\",ROW(INDIRECT(\"1:\"&ROWS(List)))),ROWS($1:13))),\"\")","v":""},{"$f":"IFERROR(VLOOKUP(B14,Inputs_Rec.!$DB$6:$DC$372,2,FALSE),\"\")","v":""},{"$f":"IFERROR(VLOOKUP(B14,Inputs_Rec.!$DD$6:$DE$372,2,FALSE),\"\")","v":""},null,null,"",{"$f":"IFERROR(VLOOKUP(G14,Inputs_Rec.!$DF$6:$DG$372,2,FALSE),\"\")","v":""},null,"",{"$f":"IFERROR(VLOOKUP(J14,Inputs_Rec.!$DH$6:$DI$372,2,FALSE),\"\")","v":""}]
[null,{"$f":"IFERROR(INDEX(List,SMALL(IF(List<>\"\",ROW(INDIRECT(\"1:\"&ROWS(List)))),ROWS($1:14))),\"\")","v":""},{"$f":"IFERROR(VLOOKUP(B15,Inputs_Rec.!$DB$6:$DC$372,2,FALSE),\"\")","v":""},{"$f":"IFERROR(VLOOKUP(B15,Inputs_Rec.!$DD$6:$DE$372,2,FALSE),\"\")","v":""},null,null,"",{"$f":"IFERROR(VLOOKUP(G15,Inputs_Rec.!$DF$6:$DG$372,2,FALSE),\"\")","v":""},null,"",{"$f":"IFERROR(VLOOKUP(J15,Inputs_Rec.!$DH$6:$DI$372,2,FALSE),\"\")","v":""}]
[null,{"$f":"IFERROR(INDEX(List,SMALL(IF(List<>\"\",ROW(INDIRECT(\"1:\"&ROWS(List)))),ROWS($1:15))),\"\")","v":""},{"$f":"IFERROR(VLOOKUP(B16,Inputs_Rec.!$DB$6:$DC$372,2,FALSE),\"\")","v":""},{"$f":"IFERROR(VLOOKUP(B16,Inputs_Rec.!$DD$6:$DE$372,2,FALSE),\"\")","v":""},null,null,"",{"$f":"IFERROR(VLOOKUP(G16,Inputs_Rec.!$DF$6:$DG$372,2,FALSE),\"\")","v":""},null,"",{"$f":"IFERROR(VLOOKUP(J16,Inputs_Rec.!$DH$6:$DI$372,2,FALSE),\"\")","v":""}]
[null,{"$f":"IFERROR(INDEX(List,SMALL(IF(List<>\"\",ROW(INDIRECT(\"1:\"&ROWS(List)))),ROWS($1:16))),\"\")","v":""},{"$f":"IFERROR(VLOOKUP(B17,Inputs_Rec.!$DB$6:$DC$372,2,FALSE),\"\")","v":""},{"$f":"IFERROR(VLOOKUP(B17,Inputs_Rec.!$DD$6:$DE$372,2,FALSE),\"\")","v":""},null,null,"",{"$f":"IFERROR(VLOOKUP(G17,Inputs_Rec.!$DF$6:$DG$372,2,FALSE),\"\")","v":""},null,"",{"$f":"IFERROR(VLOOKUP(J17,Inputs_Rec.!$DH$6:$DI$372,2,FALSE),\"\")","v":""}]
[null,{"$f":"IFERROR(INDEX(List,SMALL(IF(List<>\"\",ROW(INDIRECT(\"1:\"&ROWS(List)))),ROWS($1:17))),\"\")","v":""},{"$f":"IFERROR(VLOOKUP(B18,Inputs_Rec.!$DB$6:$DC$372,2,FALSE),\"\")","v":""},{"$f":"IFERROR(VLOOKUP(B18,Inputs_Rec.!$DD$6:$DE$372,2,FALSE),\"\")","v":""},null,null,"",{"$f":"IFERROR(VLOOKUP(G18,Inputs_Rec.!$DF$6:$DG$372,2,FALSE),\"\")","v":""},null,"",{"$f":"IFERROR(VLOOKUP(J18,Inputs_Rec.!$DH$6:$DI$372,2,FALSE),\"\")","v":""}]
[null,{"$f":"IFERROR(INDEX(List,SMALL(IF(List<>\"\",ROW(INDIRECT(\"1:\"&ROWS(List)))),ROWS($1:18))),\"\")","v":""},{"$f":"IFERROR(VLOOKUP(B19,Inputs_Rec.!$DB$6:$DC$372,2,FALSE),\"\")","v":""},{"$f":"IFERROR(VLOOKUP(B19,Inputs_Rec.!$DD$6:$DE$372,2,FALSE),\"\")","v":""},null,null,"",{"$f":"IFERROR(VLOOKUP(G19,Inputs_Rec.!$DF$6:$DG$372,2,FALSE),\"\")","v":""},null,"",{"$f":"IFERROR(VLOOKUP(J19,Inputs_Rec.!$DH$6:$DI$372,2,FALSE),\"\")","v":""}]
[null,{"$f":"IFERROR(INDEX(List,SMALL(IF(List<>\"\",ROW(INDIRECT(\"1:\"&ROWS(List)))),ROWS($1:19))),\"\")","v":""},{"$f":"IFERROR(VLOOKUP(B20,Inputs_Rec.!$DB$6:$DC$372,2,FALSE),\"\")","v":""},{"$f":"IFERROR(VLOOKUP(B20,Inputs_Rec.!$DD$6:$DE$372,2,FALSE),\"\")","v":""},null,null,"",{"$f":"IFERROR(VLOOKUP(G20,Inputs_Rec.!$DF$6:$DG$372,2,FALSE),\"\")","v":""},null,"",{"$f":"IFERROR(VLOOKUP(J20,Inputs_Rec.!$DH$6:$DI$372,2,FALSE),\"\")","v":""}]
[null,{"$f":"IFERROR(INDEX(List,SMALL(IF(List<>\"\",ROW(INDIRECT(\"1:\"&ROWS(List)))),ROWS($1:20))),\"\")","v":""},{"$f":"IFERROR(VLOOKUP(B21,Inputs_Rec.!$DB$6:$DC$372,2,FALSE),\"\")","v":""},{"$f":"IFERROR(VLOOKUP(B21,Inputs_Rec.!$DD$6:$DE$372,2,FALSE),\"\")","v":""},null,null,"",{"$f":"IFERROR(VLOOKUP(G21,Inputs_Rec.!$DF$6:$DG$372,2,FALSE),\"\")","v":""},null,"",{"$f":"IFERROR(VLOOKUP(J21,Inputs_Rec.!$DH$6:$DI$372,2,FALSE),\"\")","v":""}]
[null,{"$f":"IFERROR(INDEX(List,SMALL(IF(List<>\"\",ROW(INDIRECT(\"1:\"&ROWS(List)))),ROWS($1:21))),\"\")","v":""},{"$f":"IFERROR(VLOOKUP(B22,Inputs_Rec.!$DB$6:$DC$372,2,FALSE),\"\")","v":""},{"$f":"IFERROR(VLOOKUP(B22,Inputs_Rec.!$DD$6:$DE$372,2,FALSE),\"\")","v":""},null,null,"",{"$f":"IFERROR(VLOOKUP(G22,Inputs_Rec.!$DF$6:$DG$372,2,FALSE),\"\")","v":""},null,"",{"$f":"IFERROR(VLOOKUP(J22,Inputs_Rec.!$DH$6:$DI$372,2,FALSE),\"\")","v":""}]
[null,{"$f":"IFERROR(INDEX(List,SMALL(IF(List<>\"\",ROW(INDIRECT(\"1:\"&ROWS(List)))),ROWS($1:22))),\"\")","v":""},{"$f":"IFERROR(VLOOKUP(B23,Inputs_Rec.!$DB$6:$DC$372,2,FALSE),\"\")","v":""},{"$f":"IFERROR(VLOOKUP(B23,Inputs_Rec.!$DD$6:$DE$372,2,FALSE),\"\")","v":""},null,null,"",{"$f":"IFERROR(VLOOKUP(G23,Inputs_Rec.!$DF$6:$DG$372,2,FALSE),\"\")","v":""},null,"",{"$f":"IFERROR(VLOOKUP(J23,Inputs_Rec.!$DH$6:$DI$372,2,FALSE),\"\")","v":""}]
[null,{"$f":"IFERROR(INDEX(List,SMALL(IF(List<>\"\",ROW(INDIRECT(\"1:\"&ROWS(List)))),ROWS($1:23))),\"\")","v":""},{"$f":"IFERROR(VLOOKUP(B24,Inputs_Rec.!$DB$6:$DC$372,2,FALSE),\"\")","v":""},{"$f":"IFERROR(VLOOKUP(B24,Inputs_Rec.!$DD$6:$DE$372,2,FALSE),\"\")","v":""},null,null,"",{"$f":"IFERROR(VLOOKUP(G24,Inputs_Rec.!$DF$6:$DG$372,2,FALSE),\"\")","v":""},null,"",{"$f":"IFERROR(VLOOKUP(J24,Inputs_Rec.!$DH$6:$DI$372,2,FALSE),\"\")","v":""}]
[null,{"$f":"IFERROR(INDEX(List,SMALL(IF(List<>\"\",ROW(INDIRECT(\"1:\"&ROWS(List)))),ROWS($1:24))),\"\")","v":""},{"$f":"IFERROR(VLOOKUP(B25,Inputs_Rec.!$DB$6:$DC$372,2,FALSE),\"\")","v":""},{"$f":"IFERROR(VLOOKUP(B25,Inputs_Rec.!$DD$6:$DE$372,2,FALSE),\"\")","v":""},null,null,"",{"$f":"IFERROR(VLOOKUP(G25,Inputs_Rec.!$DF$6:$DG$372,2,FALSE),\"\")","v":""},null,"",{"$f":"IFERROR(VLOOKUP(J25,Inputs_Rec.!$DH$6:$DI$372,2,FALSE),\"\")","v":""}]
[null,{"$f":"IFERROR(INDEX(List,SMALL(IF(List<>\"\",ROW(INDIRECT(\"1:\"&ROWS(List)))),ROWS($1:25))),\"\")","v":""},{"$f":"IFERROR(VLOOKUP(B26,Inputs_Rec.!$DB$6:$DC$372,2,FALSE),\"\")","v":""},{"$f":"IFERROR(VLOOKUP(B26,Inputs_Rec.!$DD$6:$DE$372,2,FALSE),\"\")","v":""},null,null,"",{"$f":"IFERROR(VLOOKUP(G26,Inputs_Rec.!$DF$6:$DG$372,2,FALSE),\"\")","v":""},null,"",{"$f":"IFERROR(VLOOKUP(J26,Inputs_Rec.!$DH$6:$DI$372,2,FALSE),\"\")","v":""}]
[null,{"$f":"IFERROR(INDEX(List,SMALL(IF(List<>\"\",ROW(INDIRECT(\"1:\"&ROWS(List)))),ROWS($1:26))),\"\")","v":""},{"$f":"IFERROR(VLOOKUP(B27,Inputs_Rec.!$DB$6:$DC$372,2,FALSE),\"\")","v":""},{"$f":"IFERROR(VLOOKUP(B27,Inputs_Rec.!$DD$6:$DE$372,2,FALSE),\"\")","v":""},null,null,"",{"$f":"IFERROR(VLOOKUP(G27,Inputs_Rec.!$DF$6:$DG$372,2,FALSE),\"\")","v":""},null,"",{"$f":"IFERROR(VLOOKUP(J27,Inputs_Rec.!$DH$6:$DI$372,2,FALSE),\"\")","v":""}]
[null,{"$f":"IFERROR(INDEX(List,SMALL(IF(List<>\"\",ROW(INDIRECT(\"1:\"&ROWS(List)))),ROWS($1:27))),\"\")","v":""},{"$f":"IFERROR(VLOOKUP(B28,Inputs_Rec.!$DB$6:$DC$372,2,FALSE),\"\")","v":""},{"$f":"IFERROR(VLOOKUP(B28,Inputs_Rec.!$DD$6:$DE$372,2,FALSE),\"\")","v":""},null,null,"",{"$f":"IFERROR(VLOOKUP(G28,Inputs_Rec.!$DF$6:$DG$372,2,FALSE),\"\")","v":""},null,"",{"$f":"IFERROR(VLOOKUP(J28,Inputs_Rec.!$DH$6:$DI$372,2,FALSE),\"\")","v":""}]
[null,{"$f":"IFERROR(INDEX(List,SMALL(IF(List<>\"\",ROW(INDIRECT(\"1:\"&ROWS(List)))),ROWS($1:28))),\"\")","v":""},{"$f":"IFERROR(VLOOKUP(B29,Inputs_Rec.!$DB$6:$DC$372,2,FALSE),\"\")","v":""},{"$f":"IFERROR(VLOOKUP(B29,Inputs_Rec.!$DD$6:$DE$372,2,FALSE),\"\")","v":""},null,null,"",{"$f":"IFERROR(VLOOKUP(G29,Inputs_Rec.!$DF$6:$DG$372,2,FALSE),\"\")","v":""},null,"",{"$f":"IFERROR(VLOOKUP(J29,Inputs_Rec.!$DH$6:$DI$372,2,FALSE),\"\")","v":""}]
[null,{"$f":"IFERROR(INDEX(List,SMALL(IF(List<>\"\",ROW(INDIRECT(\"1:\"&ROWS(List)))),ROWS($1:29))),\"\")","v":""},{"$f":"IFERROR(VLOOKUP(B30,Inputs_Rec.!$DB$6:$DC$372,2,FALSE),\"\")","v":""},{"$f":"IFERROR(VLOOKUP(B30,Inputs_Rec.!$DD$6:$DE$372,2,FALSE),\"\")","v":""},null,null,"",{"$f":"IFERROR(VLOOKUP(G30,Inputs_Rec.!$DF$6:$DG$372,2,FALSE),\"\")","v":""},null,"",{"$f":"IFERROR(VLOOKUP(J30,Inputs_Rec.!$DH$6:$DI$372,2,FALSE),\"\")","v":""}]
[null,{"$f":"IFERROR(INDEX(List,SMALL(IF(List<>\"\",ROW(INDIRECT(\"1:\"&ROWS(List)))),ROWS($1:30))),\"\")","v":""},{"$f":"IFERROR(VLOOKUP(B31,Inputs_Rec.!$DB$6:$DC$372,2,FALSE),\"\")","v":""},{"$f":"IFERROR(VLOOKUP(B31,Inputs_Rec.!$DD$6:$DE$372,2,FALSE),\"\")","v":""},null,null,"",{"$f":"IFERROR(VLOOKUP(G31,Inputs_Rec.!$DF$6:$DG$372,2,FALSE),\"\")","v":""},null,"",{"$f":"IFERROR(VLOOKUP(J31,Inputs_Rec.!$DH$6:$DI$372,2,FALSE),\"\")","v":""}]
[null,{"$f":"IFERROR(INDEX(List,SMALL(IF(List<>\"\",ROW(INDIRECT(\"1:\"&ROWS(List)))),ROWS($1:31))),\"\")","v":""},{"$f":"IFERROR(VLOOKUP(B32,Inputs_Rec.!$DB$6:$DC$372,2,FALSE),\"\")","v":""},{"$f":"IFERROR(VLOOKUP(B32,Inputs_Rec.!$DD$6:$DE$372,2,FALSE),\"\")","v":""},null,null,"",{"$f":"IFERROR(VLOOKUP(G32,Inputs_Rec.!$DF$6:$DG$372,2,FALSE),\"\")","v":""},null,"",{"$f":"IFERROR(VLOOKUP(J32,Inputs_Rec.!$DH$6:$DI$372,2,FALSE),\"\")","v":""}]
[null,{"$f":"IFERROR(INDEX(List,SMALL(IF(List<>\"\",ROW(INDIRECT(\"1:\"&ROWS(List)))),ROWS($1:32))),\"\")","v":""},{"$f":"IFERROR(VLOOKUP(B33,Inputs_Rec.!$DB$6:$DC$372,2,FALSE),\"\")","v":""},{"$f":"IFERROR(VLOOKUP(B33,Inputs_Rec.!$DD$6:$DE$372,2,FALSE),\"\")","v":""},null,null,"",{"$f":"IFERROR(VLOOKUP(G33,Inputs_Rec.!$DF$6:$DG$372,2,FALSE),\"\")","v":""},null,"",{"$f":"IFERROR(VLOOKUP(J33,Inputs_Rec.!$DH$6:$DI$372,2,FALSE),\"\")","v":""}]
[null,{"$f":"IFERROR(INDEX(List,SMALL(IF(List<>\"\",ROW(INDIRECT(\"1:\"&ROWS(List)))),ROWS($1:33))),\"\")","v":""},{"$f":"IFERROR(VLOOKUP(B34,Inputs_Rec.!$DB$6:$DC$372,2,FALSE),\"\")","v":""},{"$f":"IFERROR(VLOOKUP(B34,Inputs_Rec.!$DD$6:$DE$372,2,FALSE),\"\")","v":""},null,null,"",{"$f":"IFERROR(VLOOKUP(G34,Inputs_Rec.!$DF$6:$DG$372,2,FALSE),\"\")","v":""},null,"",{"$f":"IFERROR(VLOOKUP(J34,Inputs_Rec.!$DH$6:$DI$372,2,FALSE),\"\")","v":""}]
[null,{"$f":"IFERROR(INDEX(List,SMALL(IF(List<>\"\",ROW(INDIRECT(\"1:\"&ROWS(List)))),ROWS($1:34))),\"\")","v":""},{"$f":"IFERROR(VLOOKUP(B35,Inputs_Rec.!$DB$6:$DC$372,2,FALSE),\"\")","v":""},{"$f":"IFERROR(VLOOKUP(B35,Inputs_Rec.!$DD$6:$DE$372,2,FALSE),\"\")","v":""},null,null,"",{"$f":"IFERROR(VLOOKUP(G35,Inputs_Rec.!$DF$6:$DG$372,2,FALSE),\"\")","v":""},null,"",{"$f":"IFERROR(VLOOKUP(J35,Inputs_Rec.!$DH$6:$DI$372,2,FALSE),\"\")","v":""}]
[null,{"$f":"IFERROR(INDEX(List,SMALL(IF(List<>\"\",ROW(INDIRECT(\"1:\"&ROWS(List)))),ROWS($1:35))),\"\")","v":""},{"$f":"IFERROR(VLOOKUP(B36,Inputs_Rec.!$DB$6:$DC$372,2,FALSE),\"\")","v":""},{"$f":"IFERROR(VLOOKUP(B36,Inputs_Rec.!$DD$6:$DE$372,2,FALSE),\"\")","v":""},null,null,"",{"$f":"IFERROR(VLOOKUP(G36,Inputs_Rec.!$DF$6:$DG$372,2,FALSE),\"\")","v":""},null,"",{"$f":"IFERROR(VLOOKUP(J36,Inputs_Rec.!$DH$6:$DI$372,2,FALSE),\"\")","v":""}]
[null,{"$f":"IFERROR(INDEX(List,SMALL(IF(List<>\"\",ROW(INDIRECT(\"1:\"&ROWS(List)))),ROWS($1:36))),\"\")","v":""},{"$f":"IFERROR(VLOOKUP(B37,Inputs_Rec.!$DB$6:$DC$372,2,FALSE),\"\")","v":""},{"$f":"IFERROR(VLOOKUP(B37,Inputs_Rec.!$DD$6:$DE$372,2,FALSE),\"\")","v":""},null,null,"",{"$f":"IFERROR(VLOOKUP(G37,Inputs_Rec.!$DF$6:$DG$372,2,FALSE),\"\")","v":""},null,"",{"$f":"IFERROR(VLOOKUP(J37,Inputs_Rec.!$DH$6:$DI$372,2,FALSE),\"\")","v":""}]
[null,{"$f":"IFERROR(INDEX(List,SMALL(IF(List<>\"\",ROW(INDIRECT(\"1:\"&ROWS(List)))),ROWS($1:37))),\"\")","v":""},{"$f":"IFERROR(VLOOKUP(B38,Inputs_Rec.!$DB$6:$DC$372,2,FALSE),\"\")","v":""},{"$f":"IFERROR(VLOOKUP(B38,Inputs_Rec.!$DD$6:$DE$372,2,FALSE),\"\")","v":""},null,null,"",{"$f":"IFERROR(VLOOKUP(G38,Inputs_Rec.!$DF$6:$DG$372,2,FALSE),\"\")","v":""},null,"",{"$f":"IFERROR(VLOOKUP(J38,Inputs_Rec.!$DH$6:$DI$372,2,FALSE),\"\")","v":""}]
[null,{"$f":"IFERROR(INDEX(List,SMALL(IF(List<>\"\",ROW(INDIRECT(\"1:\"&ROWS(List)))),ROWS($1:38))),\"\")","v":""},{"$f":"IFERROR(VLOOKUP(B39,Inputs_Rec.!$DB$6:$DC$372,2,FALSE),\"\")","v":""},{"$f":"IFERROR(VLOOKUP(B39,Inputs_Rec.!$DD$6:$DE$372,2,FALSE),\"\")","v":""},null,null,"",{"$f":"IFERROR(VLOOKUP(G39,Inputs_Rec.!$DF$6:$DG$372,2,FALSE),\"\")","v":""},null,"",{"$f":"IFERROR(VLOOKUP(J39,Inputs_Rec.!$DH$6:$DI$372,2,FALSE),\"\")","v":""}]
[null,{"$f":"IFERROR(INDEX(List,SMALL(IF(List<>\"\",ROW(INDIRECT(\"1:\"&ROWS(List)))),ROWS($1:39))),\"\")","v":""},{"$f":"IFERROR(VLOOKUP(B40,Inputs_Rec.!$DB$6:$DC$372,2,FALSE),\"\")","v":""},{"$f":"IFERROR(VLOOKUP(B40,Inputs_Rec.!$DD$6:$DE$372,2,FALSE),\"\")","v":""},null,null,"",{"$f":"IFERROR(VLOOKUP(G40,Inputs_Rec.!$DF$6:$DG$372,2,FALSE),\"\")","v":""},null,"",{"$f":"IFERROR(VLOOKUP(J40,Inputs_Rec.!$DH$6:$DI$372,2,FALSE),\"\")","v":""}]
[null,{"$f":"IFERROR(INDEX(List,SMALL(IF(List<>\"\",ROW(INDIRECT(\"1:\"&ROWS(List)))),ROWS($1:40))),\"\")","v":""},{"$f":"IFERROR(VLOOKUP(B41,Inputs_Rec.!$DB$6:$DC$372,2,FALSE),\"\")","v":""},{"$f":"IFERROR(VLOOKUP(B41,Inputs_Rec.!$DD$6:$DE$372,2,FALSE),\"\")","v":""},null,null,"",{"$f":"IFERROR(VLOOKUP(G41,Inputs_Rec.!$DF$6:$DG$372,2,FALSE),\"\")","v":""},null,"",{"$f":"IFERROR(VLOOKUP(J41,Inputs_Rec.!$DH$6:$DI$372,2,FALSE),\"\")","v":""}]
[null,{"$f":"IFERROR(INDEX(List,SMALL(IF(List<>\"\",ROW(INDIRECT(\"1:\"&ROWS(List)))),ROWS($1:41))),\"\")","v":""},{"$f":"IFERROR(VLOOKUP(B42,Inputs_Rec.!$DB$6:$DC$372,2,FALSE),\"\")","v":""},{"$f":"IFERROR(VLOOKUP(B42,Inputs_Rec.!$DD$6:$DE$372,2,FALSE),\"\")","v":""},null,null,"",{"$f":"IFERROR(VLOOKUP(G42,Inputs_Rec.!$DF$6:$DG$372,2,FALSE),\"\")","v":""},null,"",{"$f":"IFERROR(VLOOKUP(J42,Inputs_Rec.!$DH$6:$DI$372,2,FALSE),\"\")","v":""}]
[null,{"$f":"IFERROR(INDEX(List,SMALL(IF(List<>\"\",ROW(INDIRECT(\"1:\"&ROWS(List)))),ROWS($1:42))),\"\")","v":""},{"$f":"IFERROR(VLOOKUP(B43,Inputs_Rec.!$DB$6:$DC$372,2,FALSE),\"\")","v":""},{"$f":"IFERROR(VLOOKUP(B43,Inputs_Rec.!$DD$6:$DE$372,2,FALSE),\"\")","v":""},null,null,"",{"$f":"IFERROR(VLOOKUP(G43,Inputs_Rec.!$DF$6:$DG$372,2,FALSE),\"\")","v":""},null,"",{"$f":"IFERROR(VLOOKUP(J43,Inputs_Rec.!$DH$6:$DI$372,2,FALSE),\"\")","v":""}]
[null,{"$f":"IFERROR(INDEX(List,SMALL(IF(List<>\"\",ROW(INDIRECT(\"1:\"&ROWS(List)))),ROWS($1:43))),\"\")","v":""},{"$f":"IFERROR(VLOOKUP(B44,Inputs_Rec.!$DB$6:$DC$372,2,FALSE),\"\")","v":""},{"$f":"IFERROR(VLOOKUP(B44,Inputs_Rec.!$DD$6:$DE$372,2,FALSE),\"\")","v":""},null,null,"",{"$f":"IFERROR(VLOOKUP(G44,Inputs_Rec.!$DF$6:$DG$372,2,FALSE),\"\")","v":""},null,"",{"$f":"IFERROR(VLOOKUP(J44,Inputs_Rec.!$DH$6:$DI$372,2,FALSE),\"\")","v":""}]
[null,{"$f":"IFERROR(INDEX(List,SMALL(IF(List<>\"\",ROW(INDIRECT(\"1:\"&ROWS(List)))),ROWS($1:44))),\"\")","v":""},{"$f":"IFERROR(VLOOKUP(B45,Inputs_Rec.!$DB$6:$DC$372,2,FALSE),\"\")","v":""},{"$f":"IFERROR(VLOOKUP(B45,Inputs_Rec.!$DD$6:$DE$372,2,FALSE),\"\")","v":""},null,null,"",{"$f":"IFERROR(VLOOKUP(G45,Inputs_Rec.!$DF$6:$DG$372,2,FALSE),\"\")","v":""},null,"",{"$f":"IFERROR(VLOOKUP(J45,Inputs_Rec.!$DH$6:$DI$372,2,FALSE),\"\")","v":""}]
[null,{"$f":"IFERROR(INDEX(List,SMALL(IF(List<>\"\",ROW(INDIRECT(\"1:\"&ROWS(List)))),ROWS($1:45))),\"\")","v":""},{"$f":"IFERROR(VLOOKUP(B46,Inputs_Rec.!$DB$6:$DC$372,2,FALSE),\"\")","v":""},{"$f":"IFERROR(VLOOKUP(B46,Inputs_Rec.!$DD$6:$DE$372,2,FALSE),\"\")","v":""},null,null,"",{"$f":"IFERROR(VLOOKUP(G46,Inputs_Rec.!$DF$6:$DG$372,2,FALSE),\"\")","v":""},null,"",{"$f":"IFERROR(VLOOKUP(J46,Inputs_Rec.!$DH$6:$DI$372,2,FALSE),\"\")","v":""}]
[null,{"$f":"IFERROR(INDEX(List,SMALL(IF(List<>\"\",ROW(INDIRECT(\"1:\"&ROWS(List)))),ROWS($1:46))),\"\")","v":""},{"$f":"IFERROR(VLOOKUP(B47,Inputs_Rec.!$DB$6:$DC$372,2,FALSE),\"\")","v":""},{"$f":"IFERROR(VLOOKUP(B47,Inputs_Rec.!$DD$6:$DE$372,2,FALSE),\"\")","v":""},null,null,"",{"$f":"IFERROR(VLOOKUP(G47,Inputs_Rec.!$DF$6:$DG$372,2,FALSE),\"\")","v":""},null,"",{"$f":"IFERROR(VLOOKUP(J47,Inputs_Rec.!$DH$6:$DI$372,2,FALSE),\"\")","v":""}]
[null,{"$f":"IFERROR(INDEX(List,SMALL(IF(List<>\"\",ROW(INDIRECT(\"1:\"&ROWS(List)))),ROWS($1:47))),\"\")","v":""},{"$f":"IFERROR(VLOOKUP(B48,Inputs_Rec.!$DB$6:$DC$372,2,FALSE),\"\")","v":""},{"$f":"IFERROR(VLOOKUP(B48,Inputs_Rec.!$DD$6:$DE$372,2,FALSE),\"\")","v":""},null,null,"",{"$f":"IFERROR(VLOOKUP(G48,Inputs_Rec.!$DF$6:$DG$372,2,FALSE),\"\")","v":""},null,"",{"$f":"IFERROR(VLOOKUP(J48,Inputs_Rec.!$DH$6:$DI$372,2,FALSE),\"\")","v":""}]
[null,{"$f":"IFERROR(INDEX(List,SMALL(IF(List<>\"\",ROW(INDIRECT(\"1:\"&ROWS(List)))),ROWS($1:48))),\"\")","v":""},{"$f":"IFERROR(VLOOKUP(B49,Inputs_Rec.!$DB$6:$DC$372,2,FALSE),\"\")","v":""},{"$f":"IFERROR(VLOOKUP(B49,Inputs_Rec.!$DD$6:$DE$372,2,FALSE),\"\")","v":""},null,null,"",{"$f":"IFERROR(VLOOKUP(G49,Inputs_Rec.!$DF$6:$DG$372,2,FALSE),\"\")","v":""},null,"",{"$f":"IFERROR(VLOOKUP(J49,Inputs_Rec.!$DH$6:$DI$372,2,FALSE),\"\")","v":""}]
[null,{"$f":"IFERROR(INDEX(List,SMALL(IF(List<>\"\",ROW(INDIRECT(\"1:\"&ROWS(List)))),ROWS($1:49))),\"\")","v":""},{"$f":"IFERROR(VLOOKUP(B50,Inputs_Rec.!$DB$6:$DC$372,2,FALSE),\"\")","v":""},{"$f":"IFERROR(VLOOKUP(B50,Inputs_Rec.!$DD$6:$DE$372,2,FALSE),\"\")","v":""},null,null,"",{"$f":"IFERROR(VLOOKUP(G50,Inputs_Rec.!$DF$6:$DG$372,2,FALSE),\"\")","v":""},null,"",{"$f":"IFERROR(VLOOKUP(J50,Inputs_Rec.!$DH$6:$DI$372,2,FALSE),\"\")","v":""}]
[null,{"$f":"IFERROR(INDEX(List,SMALL(IF(List<>\"\",ROW(INDIRECT(\"1:\"&ROWS(List)))),ROWS($1:50))),\"\")","v":""},{"$f":"IFERROR(VLOOKUP(B51,Inputs_Rec.!$DB$6:$DC$372,2,FALSE),\"\")","v":""},{"$f":"IFERROR(VLOOKUP(B51,Inputs_Rec.!$DD$6:$DE$372,2,FALSE),\"\")","v":""},null,null,"",{"$f":"IFERROR(VLOOKUP(G51,Inputs_Rec.!$DF$6:$DG$372,2,FALSE),\"\")","v":""},null,"",{"$f":"IFERROR(VLOOKUP(J51,Inputs_Rec.!$DH$6:$DI$372,2,FALSE),\"\")","v":""}]
[null,{"$f":"IFERROR(INDEX(List,SMALL(IF(List<>\"\",ROW(INDIRECT(\"1:\"&ROWS(List)))),ROWS($1:51))),\"\")","v":""},{"$f":"IFERROR(VLOOKUP(B52,Inputs_Rec.!$DB$6:$DC$372,2,FALSE),\"\")","v":""},{"$f":"IFERROR(VLOOKUP(B52,Inputs_Rec.!$DD$6:$DE$372,2,FALSE),\"\")","v":""},null,null,"",{"$f":"IFERROR(VLOOKUP(G52,Inputs_Rec.!$DF$6:$DG$372,2,FALSE),\"\")","v":""},null,"",{"$f":"IFERROR(VLOOKUP(J52,Inputs_Rec.!$DH$6:$DI$372,2,FALSE),\"\")","v":""}]
[null,{"$f":"IFERROR(INDEX(List,SMALL(IF(List<>\"\",ROW(INDIRECT(\"1:\"&ROWS(List)))),ROWS($1:52))),\"\")","v":""},{"$f":"IFERROR(VLOOKUP(B53,Inputs_Rec.!$DB$6:$DC$372,2,FALSE),\"\")","v":""},{"$f":"IFERROR(VLOOKUP(B53,Inputs_Rec.!$DD$6:$DE$372,2,FALSE),\"\")","v":""},null,null,"",{"$f":"IFERROR(VLOOKUP(G53,Inputs_Rec.!$DF$6:$DG$372,2,FALSE),\"\")","v":""},null,"",{"$f":"IFERROR(VLOOKUP(J53,Inputs_Rec.!$DH$6:$DI$372,2,FALSE),\"\")","v":""}]
[null,{"$f":"IFERROR(INDEX(List,SMALL(IF(List<>\"\",ROW(INDIRECT(\"1:\"&ROWS(List)))),ROWS($1:53))),\"\")","v":""},{"$f":"IFERROR(VLOOKUP(B54,Inputs_Rec.!$DB$6:$DC$372,2,FALSE),\"\")","v":""},{"$f":"IFERROR(VLOOKUP(B54,Inputs_Rec.!$DD$6:$DE$372,2,FALSE),\"\")","v":""},null,null,"",{"$f":"IFERROR(VLOOKUP(G54,Inputs_Rec.!$DF$6:$DG$372,2,FALSE),\"\")","v":""},null,"",{"$f":"IFERROR(VLOOKUP(J54,Inputs_Rec.!$DH$6:$DI$372,2,FALSE),\"\")","v":""}]
[null,{"$f":"IFERROR(INDEX(List,SMALL(IF(List<>\"\",ROW(INDIRECT(\"1:\"&ROWS(List)))),ROWS($1:54))),\"\")","v":""},{"$f":"IFERROR(VLOOKUP(B55,Inputs_Rec.!$DB$6:$DC$372,2,FALSE),\"\")","v":""},{"$f":"IFERROR(VLOOKUP(B55,Inputs_Rec.!$DD$6:$DE$372,2,FALSE),\"\")","v":""},null,null,"",{"$f":"IFERROR(VLOOKUP(G55,Inputs_Rec.!$DF$6:$DG$372,2,FALSE),\"\")","v":""},null,"",{"$f":"IFERROR(VLOOKUP(J55,Inputs_Rec.!$DH$6:$DI$372,2,FALSE),\"\")","v":""}]
[null,{"$f":"IFERROR(INDEX(List,SMALL(IF(List<>\"\",ROW(INDIRECT(\"1:\"&ROWS(List)))),ROWS($1:55))),\"\")","v":""},{"$f":"IFERROR(VLOOKUP(B56,Inputs_Rec.!$DB$6:$DC$372,2,FALSE),\"\")","v":""},{"$f":"IFERROR(VLOOKUP(B56,Inputs_Rec.!$DD$6:$DE$372,2,FALSE),\"\")","v":""},null,null,"",{"$f":"IFERROR(VLOOKUP(G56,Inputs_Rec.!$DF$6:$DG$372,2,FALSE),\"\")","v":""},null,"",{"$f":"IFERROR(VLOOKUP(J56,Inputs_Rec.!$DH$6:$DI$372,2,FALSE),\"\")","v":""}]
[null,{"$f":"IFERROR(INDEX(List,SMALL(IF(List<>\"\",ROW(INDIRECT(\"1:\"&ROWS(List)))),ROWS($1:56))),\"\")","v":""},{"$f":"IFERROR(VLOOKUP(B57,Inputs_Rec.!$DB$6:$DC$372,2,FALSE),\"\")","v":""},{"$f":"IFERROR(VLOOKUP(B57,Inputs_Rec.!$DD$6:$DE$372,2,FALSE),\"\")","v":""},null,null,"",{"$f":"IFERROR(VLOOKUP(G57,Inputs_Rec.!$DF$6:$DG$372,2,FALSE),\"\")","v":""},null,"",{"$f":"IFERROR(VLOOKUP(J57,Inputs_Rec.!$DH$6:$DI$372,2,FALSE),\"\")","v":""}]
[null,{"$f":"IFERROR(INDEX(List,SMALL(IF(List<>\"\",ROW(INDIRECT(\"1:\"&ROWS(List)))),ROWS($1:57))),\"\")","v":""},{"$f":"IFERROR(VLOOKUP(B58,Inputs_Rec.!$DB$6:$DC$372,2,FALSE),\"\")","v":""},{"$f":"IFERROR(VLOOKUP(B58,Inputs_Rec.!$DD$6:$DE$372,2,FALSE),\"\")","v":""},null,null,"",{"$f":"IFERROR(VLOOKUP(G58,Inputs_Rec.!$DF$6:$DG$372,2,FALSE),\"\")","v":""},null,"",{"$f":"IFERROR(VLOOKUP(J58,Inputs_Rec.!$DH$6:$DI$372,2,FALSE),\"\")","v":""}]
[null,{"$f":"IFERROR(INDEX(List,SMALL(IF(List<>\"\",ROW(INDIRECT(\"1:\"&ROWS(List)))),ROWS($1:58))),\"\")","v":""},{"$f":"IFERROR(VLOOKUP(B59,Inputs_Rec.!$DB$6:$DC$372,2,FALSE),\"\")","v":""},{"$f":"IFERROR(VLOOKUP(B59,Inputs_Rec.!$DD$6:$DE$372,2,FALSE),\"\")","v":""},null,null,"",{"$f":"IFERROR(VLOOKUP(G59,Inputs_Rec.!$DF$6:$DG$372,2,FALSE),\"\")","v":""},null,"",{"$f":"IFERROR(VLOOKUP(J59,Inputs_Rec.!$DH$6:$DI$372,2,FALSE),\"\")","v":""}]
[null,{"$f":"IFERROR(INDEX(List,SMALL(IF(List<>\"\",ROW(INDIRECT(\"1:\"&ROWS(List)))),ROWS($1:59))),\"\")","v":""},{"$f":"IFERROR(VLOOKUP(B60,Inputs_Rec.!$DB$6:$DC$372,2,FALSE),\"\")","v":""},{"$f":"IFERROR(VLOOKUP(B60,Inputs_Rec.!$DD$6:$DE$372,2,FALSE),\"\")","v":""},null,null,"",{"$f":"IFERROR(VLOOKUP(G60,Inputs_Rec.!$DF$6:$DG$372,2,FALSE),\"\")","v":""},null,"",{"$f":"IFERROR(VLOOKUP(J60,Inputs_Rec.!$DH$6:$DI$372,2,FALSE),\"\")","v":""}]
[null,{"$f":"IFERROR(INDEX(List,SMALL(IF(List<>\"\",ROW(INDIRECT(\"1:\"&ROWS(List)))),ROWS($1:60))),\"\")","v":""},{"$f":"IFERROR(VLOOKUP(B61,Inputs_Rec.!$DB$6:$DC$372,2,FALSE),\"\")","v":""},{"$f":"IFERROR(VLOOKUP(B61,Inputs_Rec.!$DD$6:$DE$372,2,FALSE),\"\")","v":""},null,null,"",{"$f":"IFERROR(VLOOKUP(G61,Inputs_Rec.!$DF$6:$DG$372,2,FALSE),\"\")","v":""},null,"",{"$f":"IFERROR(VLOOKUP(J61,Inputs_Rec.!$DH$6:$DI$372,2,FALSE),\"\")","v":""}]
[null,{"$f":"IFERROR(INDEX(List,SMALL(IF(List<>\"\",ROW(INDIRECT(\"1:\"&ROWS(List)))),ROWS($1:61))),\"\")","v":""},{"$f":"IFERROR(VLOOKUP(B62,Inputs_Rec.!$DB$6:$DC$372,2,FALSE),\"\")","v":""},{"$f":"IFERROR(VLOOKUP(B62,Inputs_Rec.!$DD$6:$DE$372,2,FALSE),\"\")","v":""},null,null,"",{"$f":"IFERROR(VLOOKUP(G62,Inputs_Rec.!$DF$6:$DG$372,2,FALSE),\"\")","v":""},null,"",{"$f":"IFERROR(VLOOKUP(J62,Inputs_Rec.!$DH$6:$DI$372,2,FALSE),\"\")","v":""}]
[null,{"$f":"IFERROR(INDEX(List,SMALL(IF(List<>\"\",ROW(INDIRECT(\"1:\"&ROWS(List)))),ROWS($1:62))),\"\")","v":""},{"$f":"IFERROR(VLOOKUP(B63,Inputs_Rec.!$DB$6:$DC$372,2,FALSE),\"\")","v":""},{"$f":"IFERROR(VLOOKUP(B63,Inputs_Rec.!$DD$6:$DE$372,2,FALSE),\"\")","v":""},null,null,"",{"$f":"IFERROR(VLOOKUP(G63,Inputs_Rec.!$DF$6:$DG$372,2,FALSE),\"\")","v":""},null,"",{"$f":"IFERROR(VLOOKUP(J63,Inputs_Rec.!$DH$6:$DI$372,2,FALSE),\"\")","v":""}]
[null,{"$f":"IFERROR(INDEX(List,SMALL(IF(List<>\"\",ROW(INDIRECT(\"1:\"&ROWS(List)))),ROWS($1:63))),\"\")","v":""},{"$f":"IFERROR(VLOOKUP(B64,Inputs_Rec.!$DB$6:$DC$372,2,FALSE),\"\")","v":""},{"$f":"IFERROR(VLOOKUP(B64,Inputs_Rec.!$DD$6:$DE$372,2,FALSE),\"\")","v":""},null,null,"",{"$f":"IFERROR(VLOOKUP(G64,Inputs_Rec.!$DF$6:$DG$372,2,FALSE),\"\")","v":""},null,"",{"$f":"IFERROR(VLOOKUP(J64,Inputs_Rec.!$DH$6:$DI$372,2,FALSE),\"\")","v":""}]
[null,{"$f":"IFERROR(INDEX(List,SMALL(IF(List<>\"\",ROW(INDIRECT(\"1:\"&ROWS(List)))),ROWS($1:64))),\"\")","v":""},{"$f":"IFERROR(VLOOKUP(B65,Inputs_Rec.!$DB$6:$DC$372,2,FALSE),\"\")","v":""},{"$f":"IFERROR(VLOOKUP(B65,Inputs_Rec.!$DD$6:$DE$372,2,FALSE),\"\")","v":""},null,null,"",{"$f":"IFERROR(VLOOKUP(G65,Inputs_Rec.!$DF$6:$DG$372,2,FALSE),\"\")","v":""},null,"",{"$f":"IFERROR(VLOOKUP(J65,Inputs_Rec.!$DH$6:$DI$372,2,FALSE),\"\")","v":""}]
[null,{"$f":"IFERROR(INDEX(List,SMALL(IF(List<>\"\",ROW(INDIRECT(\"1:\"&ROWS(List)))),ROWS($1:65))),\"\")","v":""},{"$f":"IFERROR(VLOOKUP(B66,Inputs_Rec.!$DB$6:$DC$372,2,FALSE),\"\")","v":""},{"$f":"IFERROR(VLOOKUP(B66,Inputs_Rec.!$DD$6:$DE$372,2,FALSE),\"\")","v":""},null,null,"",{"$f":"IFERROR(VLOOKUP(G66,Inputs_Rec.!$DF$6:$DG$372,2,FALSE),\"\")","v":""},null,"",{"$f":"IFERROR(VLOOKUP(J66,Inputs_Rec.!$DH$6:$DI$372,2,FALSE),\"\")","v":""}]
[null,{"$f":"IFERROR(INDEX(List,SMALL(IF(List<>\"\",ROW(INDIRECT(\"1:\"&ROWS(List)))),ROWS($1:66))),\"\")","v":""},{"$f":"IFERROR(VLOOKUP(B67,Inputs_Rec.!$DB$6:$DC$372,2,FALSE),\"\")","v":""},{"$f":"IFERROR(VLOOKUP(B67,Inputs_Rec.!$DD$6:$DE$372,2,FALSE),\"\")","v":""},null,null,"",{"$f":"IFERROR(VLOOKUP(G67,Inputs_Rec.!$DF$6:$DG$372,2,FALSE),\"\")","v":""},null,"",{"$f":"IFERROR(VLOOKUP(J67,Inputs_Rec.!$DH$6:$DI$372,2,FALSE),\"\")","v":""}]
[null,{"$f":"IFERROR(INDEX(List,SMALL(IF(List<>\"\",ROW(INDIRECT(\"1:\"&ROWS(List)))),ROWS($1:67))),\"\")","v":""},{"$f":"IFERROR(VLOOKUP(B68,Inputs_Rec.!$DB$6:$DC$372,2,FALSE),\"\")","v":""},{"$f":"IFERROR(VLOOKUP(B68,Inputs_Rec.!$DD$6:$DE$372,2,FALSE),\"\")","v":""},null,null,"",{"$f":"IFERROR(VLOOKUP(G68,Inputs_Rec.!$DF$6:$DG$372,2,FALSE),\"\")","v":""},null,"",{"$f":"IFERROR(VLOOKUP(J68,Inputs_Rec.!$DH$6:$DI$372,2,FALSE),\"\")","v":""}]
[null,{"$f":"IFERROR(INDEX(List,SMALL(IF(List<>\"\",ROW(INDIRECT(\"1:\"&ROWS(List)))),ROWS($1:68))),\"\")","v":""},{"$f":"IFERROR(VLOOKUP(B69,Inputs_Rec.!$DB$6:$DC$372,2,FALSE),\"\")","v":""},{"$f":"IFERROR(VLOOKUP(B69,Inputs_Rec.!$DD$6:$DE$372,2,FALSE),\"\")","v":""},null,null,{"$f":"B69","v":""},{"$f":"IFERROR(VLOOKUP(G69,Inputs_Rec.!$DF$6:$DG$372,2,FALSE),\"\")","v":""},null,{"$f":"G69","v":""},{"$f":"IFERROR(VLOOKUP(J69,Inputs_Rec.!$DH$6:$DI$372,2,FALSE),\"\")","v":""}]
[null,{"$f":"IFERROR(INDEX(List,SMALL(IF(List<>\"\",ROW(INDIRECT(\"1:\"&ROWS(List)))),ROWS($1:69))),\"\")","v":""},{"$f":"IFERROR(VLOOKUP(B70,Inputs_Rec.!$DB$6:$DC$372,2,FALSE),\"\")","v":""},{"$f":"IFERROR(VLOOKUP(B70,Inputs_Rec.!$DD$6:$DE$372,2,FALSE),\"\")","v":""},null,null,"",{"$f":"IFERROR(VLOOKUP(G70,Inputs_Rec.!$DF$6:$DG$372,2,FALSE),\"\")","v":""},null,"",{"$f":"IFERROR(VLOOKUP(J70,Inputs_Rec.!$DH$6:$DI$372,2,FALSE),\"\")","v":""}]
[null,{"$f":"IFERROR(INDEX(List,SMALL(IF(List<>\"\",ROW(INDIRECT(\"1:\"&ROWS(List)))),ROWS($1:70))),\"\")","v":""},{"$f":"IFERROR(VLOOKUP(B71,Inputs_Rec.!$DB$6:$DC$372,2,FALSE),\"\")","v":""},{"$f":"IFERROR(VLOOKUP(B71,Inputs_Rec.!$DD$6:$DE$372,2,FALSE),\"\")","v":""},null,null,"",{"$f":"IFERROR(VLOOKUP(G71,Inputs_Rec.!$DF$6:$DG$372,2,FALSE),\"\")","v":""},null,"",{"$f":"IFERROR(VLOOKUP(J71,Inputs_Rec.!$DH$6:$DI$372,2,FALSE),\"\")","v":""}]
[null,{"$f":"IFERROR(INDEX(List,SMALL(IF(List<>\"\",ROW(INDIRECT(\"1:\"&ROWS(List)))),ROWS($1:71))),\"\")","v":""},{"$f":"IFERROR(VLOOKUP(B72,Inputs_Rec.!$DB$6:$DC$372,2,FALSE),\"\")","v":""},{"$f":"IFERROR(VLOOKUP(B72,Inputs_Rec.!$DD$6:$DE$372,2,FALSE),\"\")","v":""},null,null,"",{"$f":"IFERROR(VLOOKUP(G72,Inputs_Rec.!$DF$6:$DG$372,2,FALSE),\"\")","v":""},null,"",{"$f":"IFERROR(VLOOKUP(J72,Inputs_Rec.!$DH$6:$DI$372,2,FALSE),\"\")","v":""}]
[null,{"$f":"IFERROR(INDEX(List,SMALL(IF(List<>\"\",ROW(INDIRECT(\"1:\"&ROWS(List)))),ROWS($1:72))),\"\")","v":""},{"$f":"IFERROR(VLOOKUP(B73,Inputs_Rec.!$DB$6:$DC$372,2,FALSE),\"\")","v":""},{"$f":"IFERROR(VLOOKUP(B73,Inputs_Rec.!$DD$6:$DE$372,2,FALSE),\"\")","v":""},null,null,"",{"$f":"IFERROR(VLOOKUP(G73,Inputs_Rec.!$DF$6:$DG$372,2,FALSE),\"\")","v":""},null,"",{"$f":"IFERROR(VLOOKUP(J73,Inputs_Rec.!$DH$6:$DI$372,2,FALSE),\"\")","v":""}]
[null,{"$f":"IFERROR(INDEX(List,SMALL(IF(List<>\"\",ROW(INDIRECT(\"1:\"&ROWS(List)))),ROWS($1:73))),\"\")","v":""},{"$f":"IFERROR(VLOOKUP(B74,Inputs_Rec.!$DB$6:$DC$372,2,FALSE),\"\")","v":""},{"$f":"IFERROR(VLOOKUP(B74,Inputs_Rec.!$DD$6:$DE$372,2,FALSE),\"\")","v":""},null,null,"",{"$f":"IFERROR(VLOOKUP(G74,Inputs_Rec.!$DF$6:$DG$372,2,FALSE),\"\")","v":""},null,"",{"$f":"IFERROR(VLOOKUP(J74,Inputs_Rec.!$DH$6:$DI$372,2,FALSE),\"\")","v":""}]
[null,{"$f":"IFERROR(INDEX(List,SMALL(IF(List<>\"\",ROW(INDIRECT(\"1:\"&ROWS(List)))),ROWS($1:74))),\"\")","v":""},{"$f":"IFERROR(VLOOKUP(B75,Inputs_Rec.!$DB$6:$DC$372,2,FALSE),\"\")","v":""},{"$f":"IFERROR(VLOOKUP(B75,Inputs_Rec.!$DD$6:$DE$372,2,FALSE),\"\")","v":""},null,null,"",{"$f":"IFERROR(VLOOKUP(G75,Inputs_Rec.!$DF$6:$DG$372,2,FALSE),\"\")","v":""},null,"",{"$f":"IFERROR(VLOOKUP(J75,Inputs_Rec.!$DH$6:$DI$372,2,FALSE),\"\")","v":""}]
[null,{"$f":"IFERROR(INDEX(List,SMALL(IF(List<>\"\",ROW(INDIRECT(\"1:\"&ROWS(List)))),ROWS($1:75))),\"\")","v":""},{"$f":"IFERROR(VLOOKUP(B76,Inputs_Rec.!$DB$6:$DC$372,2,FALSE),\"\")","v":""},{"$f":"IFERROR(VLOOKUP(B76,Inputs_Rec.!$DD$6:$DE$372,2,FALSE),\"\")","v":""},null,null,"",{"$f":"IFERROR(VLOOKUP(G76,Inputs_Rec.!$DF$6:$DG$372,2,FALSE),\"\")","v":""},null,"",{"$f":"IFERROR(VLOOKUP(J76,Inputs_Rec.!$DH$6:$DI$372,2,FALSE),\"\")","v":""}]
[null,{"$f":"IFERROR(INDEX(List,SMALL(IF(List<>\"\",ROW(INDIRECT(\"1:\"&ROWS(List)))),ROWS($1:76))),\"\")","v":""},{"$f":"IFERROR(VLOOKUP(B77,Inputs_Rec.!$DB$6:$DC$372,2,FALSE),\"\")","v":""},{"$f":"IFERROR(VLOOKUP(B77,Inputs_Rec.!$DD$6:$DE$372,2,FALSE),\"\")","v":""},null,null,"",{"$f":"IFERROR(VLOOKUP(G77,Inputs_Rec.!$DF$6:$DG$372,2,FALSE),\"\")","v":""},null,"",{"$f":"IFERROR(VLOOKUP(J77,Inputs_Rec.!$DH$6:$DI$372,2,FALSE),\"\")","v":""}]
[null,{"$f":"IFERROR(INDEX(List,SMALL(IF(List<>\"\",ROW(INDIRECT(\"1:\"&ROWS(List)))),ROWS($1:77))),\"\")","v":""},{"$f":"IFERROR(VLOOKUP(B78,Inputs_Rec.!$DB$6:$DC$372,2,FALSE),\"\")","v":""},{"$f":"IFERROR(VLOOKUP(B78,Inputs_Rec.!$DD$6:$DE$372,2,FALSE),\"\")","v":""},null,null,"",{"$f":"IFERROR(VLOOKUP(G78,Inputs_Rec.!$DF$6:$DG$372,2,FALSE),\"\")","v":""},null,"",{"$f":"IFERROR(VLOOKUP(J78,Inputs_Rec.!$DH$6:$DI$372,2,FALSE),\"\")","v":""}]
[null,{"$f":"IFERROR(INDEX(List,SMALL(IF(List<>\"\",ROW(INDIRECT(\"1:\"&ROWS(List)))),ROWS($1:78))),\"\")","v":""},{"$f":"IFERROR(VLOOKUP(B79,Inputs_Rec.!$DB$6:$DC$372,2,FALSE),\"\")","v":""},{"$f":"IFERROR(VLOOKUP(B79,Inputs_Rec.!$DD$6:$DE$372,2,FALSE),\"\")","v":""},null,null,"",{"$f":"IFERROR(VLOOKUP(G79,Inputs_Rec.!$DF$6:$DG$372,2,FALSE),\"\")","v":""},null,"",{"$f":"IFERROR(VLOOKUP(J79,Inputs_Rec.!$DH$6:$DI$372,2,FALSE),\"\")","v":""}]
[null,{"$f":"IFERROR(INDEX(List,SMALL(IF(List<>\"\",ROW(INDIRECT(\"1:\"&ROWS(List)))),ROWS($1:79))),\"\")","v":""},{"$f":"IFERROR(VLOOKUP(B80,Inputs_Rec.!$DB$6:$DC$372,2,FALSE),\"\")","v":""},{"$f":"IFERROR(VLOOKUP(B80,Inputs_Rec.!$DD$6:$DE$372,2,FALSE),\"\")","v":""},null,null,"",{"$f":"IFERROR(VLOOKUP(G80,Inputs_Rec.!$DF$6:$DG$372,2,FALSE),\"\")","v":""},null,"",{"$f":"IFERROR(VLOOKUP(J80,Inputs_Rec.!$DH$6:$DI$372,2,FALSE),\"\")","v":""}]
[null,{"$f":"IFERROR(INDEX(List,SMALL(IF(List<>\"\",ROW(INDIRECT(\"1:\"&ROWS(List)))),ROWS($1:80))),\"\")","v":""},{"$f":"IFERROR(VLOOKUP(B81,Inputs_Rec.!$DB$6:$DC$372,2,FALSE),\"\")","v":""},{"$f":"IFERROR(VLOOKUP(B81,Inputs_Rec.!$DD$6:$DE$372,2,FALSE),\"\")","v":""},null,null,"",{"$f":"IFERROR(VLOOKUP(G81,Inputs_Rec.!$DF$6:$DG$372,2,FALSE),\"\")","v":""},null,"",{"$f":"IFERROR(VLOOKUP(J81,Inputs_Rec.!$DH$6:$DI$372,2,FALSE),\"\")","v":""}]
[null,{"$f":"IFERROR(INDEX(List,SMALL(IF(List<>\"\",ROW(INDIRECT(\"1:\"&ROWS(List)))),ROWS($1:81))),\"\")","v":""},{"$f":"IFERROR(VLOOKUP(B82,Inputs_Rec.!$DB$6:$DC$372,2,FALSE),\"\")","v":""},{"$f":"IFERROR(VLOOKUP(B82,Inputs_Rec.!$DD$6:$DE$372,2,FALSE),\"\")","v":""},null,null,"",{"$f":"IFERROR(VLOOKUP(G82,Inputs_Rec.!$DF$6:$DG$372,2,FALSE),\"\")","v":""},null,"",{"$f":"IFERROR(VLOOKUP(J82,Inputs_Rec.!$DH$6:$DI$372,2,FALSE),\"\")","v":""}]
[null,{"$f":"IFERROR(INDEX(List,SMALL(IF(List<>\"\",ROW(INDIRECT(\"1:\"&ROWS(List)))),ROWS($1:82))),\"\")","v":""},{"$f":"IFERROR(VLOOKUP(B83,Inputs_Rec.!$DB$6:$DC$372,2,FALSE),\"\")","v":""},{"$f":"IFERROR(VLOOKUP(B83,Inputs_Rec.!$DD$6:$DE$372,2,FALSE),\"\")","v":""},null,null,"",{"$f":"IFERROR(VLOOKUP(G83,Inputs_Rec.!$DF$6:$DG$372,2,FALSE),\"\")","v":""},null,"",{"$f":"IFERROR(VLOOKUP(J83,Inputs_Rec.!$DH$6:$DI$372,2,FALSE),\"\")","v":""}]
[null,{"$f":"IFERROR(INDEX(List,SMALL(IF(List<>\"\",ROW(INDIRECT(\"1:\"&ROWS(List)))),ROWS($1:83))),\"\")","v":""},{"$f":"IFERROR(VLOOKUP(B84,Inputs_Rec.!$DB$6:$DC$372,2,FALSE),\"\")","v":""},{"$f":"IFERROR(VLOOKUP(B84,Inputs_Rec.!$DD$6:$DE$372,2,FALSE),\"\")","v":""},null,null,"",{"$f":"IFERROR(VLOOKUP(G84,Inputs_Rec.!$DF$6:$DG$372,2,FALSE),\"\")","v":""},null,"",{"$f":"IFERROR(VLOOKUP(J84,Inputs_Rec.!$DH$6:$DI$372,2,FALSE),\"\")","v":""}]
[null,{"$f":"IFERROR(INDEX(List,SMALL(IF(List<>\"\",ROW(INDIRECT(\"1:\"&ROWS(List)))),ROWS($1:84))),\"\")","v":""},{"$f":"IFERROR(VLOOKUP(B85,Inputs_Rec.!$DB$6:$DC$372,2,FALSE),\"\")","v":""},{"$f":"IFERROR(VLOOKUP(B85,Inputs_Rec.!$DD$6:$DE$372,2,FALSE),\"\")","v":""},null,null,"",{"$f":"IFERROR(VLOOKUP(G85,Inputs_Rec.!$DF$6:$DG$372,2,FALSE),\"\")","v":""},null,"",{"$f":"IFERROR(VLOOKUP(J85,Inputs_Rec.!$DH$6:$DI$372,2,FALSE),\"\")","v":""}]
[null,{"$f":"IFERROR(INDEX(List,SMALL(IF(List<>\"\",ROW(INDIRECT(\"1:\"&ROWS(List)))),ROWS($1:85))),\"\")","v":""},{"$f":"IFERROR(VLOOKUP(B86,Inputs_Rec.!$DB$6:$DC$372,2,FALSE),\"\")","v":""},{"$f":"IFERROR(VLOOKUP(B86,Inputs_Rec.!$DD$6:$DE$372,2,FALSE),\"\")","v":""},null,null,"",{"$f":"IFERROR(VLOOKUP(G86,Inputs_Rec.!$DF$6:$DG$372,2,FALSE),\"\")","v":""},null,"",{"$f":"IFERROR(VLOOKUP(J86,Inputs_Rec.!$DH$6:$DI$372,2,FALSE),\"\")","v":""}]
[null,{"$f":"IFERROR(INDEX(List,SMALL(IF(List<>\"\",ROW(INDIRECT(\"1:\"&ROWS(List)))),ROWS($1:86))),\"\")","v":""},{"$f":"IFERROR(VLOOKUP(B87,Inputs_Rec.!$DB$6:$DC$372,2,FALSE),\"\")","v":""},{"$f":"IFERROR(VLOOKUP(B87,Inputs_Rec.!$DD$6:$DE$372,2,FALSE),\"\")","v":""},null,null,"",{"$f":"IFERROR(VLOOKUP(G87,Inputs_Rec.!$DF$6:$DG$372,2,FALSE),\"\")","v":""},null,"",{"$f":"IFERROR(VLOOKUP(J87,Inputs_Rec.!$DH$6:$DI$372,2,FALSE),\"\")","v":""}]
[null,{"$f":"IFERROR(INDEX(List,SMALL(IF(List<>\"\",ROW(INDIRECT(\"1:\"&ROWS(List)))),ROWS($1:87))),\"\")","v":""},{"$f":"IFERROR(VLOOKUP(B88,Inputs_Rec.!$DB$6:$DC$372,2,FALSE),\"\")","v":""},{"$f":"IFERROR(VLOOKUP(B88,Inputs_Rec.!$DD$6:$DE$372,2,FALSE),\"\")","v":""},null,null,"",{"$f":"IFERROR(VLOOKUP(G88,Inputs_Rec.!$DF$6:$DG$372,2,FALSE),\"\")","v":""},null,"",{"$f":"IFERROR(VLOOKUP(J88,Inputs_Rec.!$DH$6:$DI$372,2,FALSE),\"\")","v":""}]
[null,{"$f":"IFERROR(INDEX(List,SMALL(IF(List<>\"\",ROW(INDIRECT(\"1:\"&ROWS(List)))),ROWS($1:88))),\"\")","v":""},{"$f":"IFERROR(VLOOKUP(B89,Inputs_Rec.!$DB$6:$DC$372,2,FALSE),\"\")","v":""},{"$f":"IFERROR(VLOOKUP(B89,Inputs_Rec.!$DD$6:$DE$372,2,FALSE),\"\")","v":""},null,null,"",{"$f":"IFERROR(VLOOKUP(G89,Inputs_Rec.!$DF$6:$DG$372,2,FALSE),\"\")","v":""},null,"",{"$f":"IFERROR(VLOOKUP(J89,Inputs_Rec.!$DH$6:$DI$372,2,FALSE),\"\")","v":""}]
[null,{"$f":"IFERROR(INDEX(List,SMALL(IF(List<>\"\",ROW(INDIRECT(\"1:\"&ROWS(List)))),ROWS($1:89))),\"\")","v":""},{"$f":"IFERROR(VLOOKUP(B90,Inputs_Rec.!$DB$6:$DC$372,2,FALSE),\"\")","v":""},{"$f":"IFERROR(VLOOKUP(B90,Inputs_Rec.!$DD$6:$DE$372,2,FALSE),\"\")","v":""},null,null,"",{"$f":"IFERROR(VLOOKUP(G90,Inputs_Rec.!$DF$6:$DG$372,2,FALSE),\"\")","v":""},null,"",{"$f":"IFERROR(VLOOKUP(J90,Inputs_Rec.!$DH$6:$DI$372,2,FALSE),\"\")","v":""}]
[null,{"$f":"IFERROR(INDEX(List,SMALL(IF(List<>\"\",ROW(INDIRECT(\"1:\"&ROWS(List)))),ROWS($1:90))),\"\")","v":""},{"$f":"IFERROR(VLOOKUP(B91,Inputs_Rec.!$DB$6:$DC$372,2,FALSE),\"\")","v":""},{"$f":"IFERROR(VLOOKUP(B91,Inputs_Rec.!$DD$6:$DE$372,2,FALSE),\"\")","v":""},null,null,"",{"$f":"IFERROR(VLOOKUP(G91,Inputs_Rec.!$DF$6:$DG$372,2,FALSE),\"\")","v":""},null,"",{"$f":"IFERROR(VLOOKUP(J91,Inputs_Rec.!$DH$6:$DI$372,2,FALSE),\"\")","v":""}]
[null,{"$f":"IFERROR(INDEX(List,SMALL(IF(List<>\"\",ROW(INDIRECT(\"1:\"&ROWS(List)))),ROWS($1:91))),\"\")","v":""},{"$f":"IFERROR(VLOOKUP(B92,Inputs_Rec.!$DB$6:$DC$372,2,FALSE),\"\")","v":""},{"$f":"IFERROR(VLOOKUP(B92,Inputs_Rec.!$DD$6:$DE$372,2,FALSE),\"\")","v":""},null,null,"",{"$f":"IFERROR(VLOOKUP(G92,Inputs_Rec.!$DF$6:$DG$372,2,FALSE),\"\")","v":""},null,"",{"$f":"IFERROR(VLOOKUP(J92,Inputs_Rec.!$DH$6:$DI$372,2,FALSE),\"\")","v":""}]
[null,{"$f":"IFERROR(INDEX(List,SMALL(IF(List<>\"\",ROW(INDIRECT(\"1:\"&ROWS(List)))),ROWS($1:92))),\"\")","v":""},{"$f":"IFERROR(VLOOKUP(B93,Inputs_Rec.!$DB$6:$DC$372,2,FALSE),\"\")","v":""},{"$f":"IFERROR(VLOOKUP(B93,Inputs_Rec.!$DD$6:$DE$372,2,FALSE),\"\")","v":""},null,null,"",{"$f":"IFERROR(VLOOKUP(G93,Inputs_Rec.!$DF$6:$DG$372,2,FALSE),\"\")","v":""},null,"",{"$f":"IFERROR(VLOOKUP(J93,Inputs_Rec.!$DH$6:$DI$372,2,FALSE),\"\")","v":""}]
[null,{"$f":"IFERROR(INDEX(List,SMALL(IF(List<>\"\",ROW(INDIRECT(\"1:\"&ROWS(List)))),ROWS($1:93))),\"\")","v":""},{"$f":"IFERROR(VLOOKUP(B94,Inputs_Rec.!$DB$6:$DC$372,2,FALSE),\"\")","v":""},{"$f":"IFERROR(VLOOKUP(B94,Inputs_Rec.!$DD$6:$DE$372,2,FALSE),\"\")","v":""},null,null,"",{"$f":"IFERROR(VLOOKUP(G94,Inputs_Rec.!$DF$6:$DG$372,2,FALSE),\"\")","v":""},null,"",{"$f":"IFERROR(VLOOKUP(J94,Inputs_Rec.!$DH$6:$DI$372,2,FALSE),\"\")","v":""}]
[null,{"$f":"IFERROR(INDEX(List,SMALL(IF(List<>\"\",ROW(INDIRECT(\"1:\"&ROWS(List)))),ROWS($1:94))),\"\")","v":""},{"$f":"IFERROR(VLOOKUP(B95,Inputs_Rec.!$DB$6:$DC$372,2,FALSE),\"\")","v":""},{"$f":"IFERROR(VLOOKUP(B95,Inputs_Rec.!$DD$6:$DE$372,2,FALSE),\"\")","v":""},null,null,"",{"$f":"IFERROR(VLOOKUP(G95,Inputs_Rec.!$DF$6:$DG$372,2,FALSE),\"\")","v":""},null,"",{"$f":"IFERROR(VLOOKUP(J95,Inputs_Rec.!$DH$6:$DI$372,2,FALSE),\"\")","v":""}]
[null,{"$f":"IFERROR(INDEX(List,SMALL(IF(List<>\"\",ROW(INDIRECT(\"1:\"&ROWS(List)))),ROWS($1:95))),\"\")","v":""},{"$f":"IFERROR(VLOOKUP(B96,Inputs_Rec.!$DB$6:$DC$372,2,FALSE),\"\")","v":""},{"$f":"IFERROR(VLOOKUP(B96,Inputs_Rec.!$DD$6:$DE$372,2,FALSE),\"\")","v":""},null,null,"",{"$f":"IFERROR(VLOOKUP(G96,Inputs_Rec.!$DF$6:$DG$372,2,FALSE),\"\")","v":""},null,"",{"$f":"IFERROR(VLOOKUP(J96,Inputs_Rec.!$DH$6:$DI$372,2,FALSE),\"\")","v":""}]
[null,{"$f":"IFERROR(INDEX(List,SMALL(IF(List<>\"\",ROW(INDIRECT(\"1:\"&ROWS(List)))),ROWS($1:96))),\"\")","v":""},{"$f":"IFERROR(VLOOKUP(B97,Inputs_Rec.!$DB$6:$DC$372,2,FALSE),\"\")","v":""},{"$f":"IFERROR(VLOOKUP(B97,Inputs_Rec.!$DD$6:$DE$372,2,FALSE),\"\")","v":""},null,null,"",{"$f":"IFERROR(VLOOKUP(G97,Inputs_Rec.!$DF$6:$DG$372,2,FALSE),\"\")","v":""},null,"",{"$f":"IFERROR(VLOOKUP(J97,Inputs_Rec.!$DH$6:$DI$372,2,FALSE),\"\")","v":""}]
[null,{"$f":"IFERROR(INDEX(List,SMALL(IF(List<>\"\",ROW(INDIRECT(\"1:\"&ROWS(List)))),ROWS($1:97))),\"\")","v":""},{"$f":"IFERROR(VLOOKUP(B98,Inputs_Rec.!$DB$6:$DC$372,2,FALSE),\"\")","v":""},{"$f":"IFERROR(VLOOKUP(B98,Inputs_Rec.!$DD$6:$DE$372,2,FALSE),\"\")","v":""},null,null,"",{"$f":"IFERROR(VLOOKUP(G98,Inputs_Rec.!$DF$6:$DG$372,2,FALSE),\"\")","v":""},null,"",{"$f":"IFERROR(VLOOKUP(J98,Inputs_Rec.!$DH$6:$DI$372,2,FALSE),\"\")","v":""}]
[null,{"$f":"IFERROR(INDEX(List,SMALL(IF(List<>\"\",ROW(INDIRECT(\"1:\"&ROWS(List)))),ROWS($1:98))),\"\")","v":""},{"$f":"IFERROR(VLOOKUP(B99,Inputs_Rec.!$DB$6:$DC$372,2,FALSE),\"\")","v":""},{"$f":"IFERROR(VLOOKUP(B99,Inputs_Rec.!$DD$6:$DE$372,2,FALSE),\"\")","v":""},null,null,"",{"$f":"IFERROR(VLOOKUP(G99,Inputs_Rec.!$DF$6:$DG$372,2,FALSE),\"\")","v":""},null,"",{"$f":"IFERROR(VLOOKUP(J99,Inputs_Rec.!$DH$6:$DI$372,2,FALSE),\"\")","v":""}]
[null,{"$f":"IFERROR(INDEX(List,SMALL(IF(List<>\"\",ROW(INDIRECT(\"1:\"&ROWS(List)))),ROWS($1:99))),\"\")","v":""},{"$f":"IFERROR(VLOOKUP(B100,Inputs_Rec.!$DB$6:$DC$372,2,FALSE),\"\")","v":""},{"$f":"IFERROR(VLOOKUP(B100,Inputs_Rec.!$DD$6:$DE$372,2,FALSE),\"\")","v":""},null,null,"",{"$f":"IFERROR(VLOOKUP(G100,Inputs_Rec.!$DF$6:$DG$372,2,FALSE),\"\")","v":""},null,"",{"$f":"IFERROR(VLOOKUP(J100,Inputs_Rec.!$DH$6:$DI$372,2,FALSE),\"\")","v":""}]
[null,{"$f":"IFERROR(INDEX(List,SMALL(IF(List<>\"\",ROW(INDIRECT(\"1:\"&ROWS(List)))),ROWS($1:100))),\"\")","v":""},{"$f":"IFERROR(VLOOKUP(B101,Inputs_Rec.!$DB$6:$DC$372,2,FALSE),\"\")","v":""},{"$f":"IFERROR(VLOOKUP(B101,Inputs_Rec.!$DD$6:$DE$372,2,FALSE),\"\")","v":""},null,null,"",{"$f":"IFERROR(VLOOKUP(G101,Inputs_Rec.!$DF$6:$DG$372,2,FALSE),\"\")","v":""},null,"",{"$f":"IFERROR(VLOOKUP(J101,Inputs_Rec.!$DH$6:$DI$372,2,FALSE),\"\")","v":""}]
[null,{"$f":"IFERROR(INDEX(List,SMALL(IF(List<>\"\",ROW(INDIRECT(\"1:\"&ROWS(List)))),ROWS($1:101))),\"\")","v":""},{"$f":"IFERROR(VLOOKUP(B102,Inputs_Rec.!$DB$6:$DC$372,2,FALSE),\"\")","v":""},{"$f":"IFERROR(VLOOKUP(B102,Inputs_Rec.!$DD$6:$DE$372,2,FALSE),\"\")","v":""},null,null,"",{"$f":"IFERROR(VLOOKUP(G102,Inputs_Rec.!$DF$6:$DG$372,2,FALSE),\"\")","v":""},null,"",{"$f":"IFERROR(VLOOKUP(J102,Inputs_Rec.!$DH$6:$DI$372,2,FALSE),\"\")","v":""}]
[null,{"$f":"IFERROR(INDEX(List,SMALL(IF(List<>\"\",ROW(INDIRECT(\"1:\"&ROWS(List)))),ROWS($1:102))),\"\")","v":""},{"$f":"IFERROR(VLOOKUP(B103,Inputs_Rec.!$DB$6:$DC$372,2,FALSE),\"\")","v":""},{"$f":"IFERROR(VLOOKUP(B103,Inputs_Rec.!$DD$6:$DE$372,2,FALSE),\"\")","v":""},null,null,"",{"$f":"IFERROR(VLOOKUP(G103,Inputs_Rec.!$DF$6:$DG$372,2,FALSE),\"\")","v":""},null,"",{"$f":"IFERROR(VLOOKUP(J103,Inputs_Rec.!$DH$6:$DI$372,2,FALSE),\"\")","v":""}]
[null,{"$f":"IFERROR(INDEX(List,SMALL(IF(List<>\"\",ROW(INDIRECT(\"1:\"&ROWS(List)))),ROWS($1:103))),\"\")","v":""},{"$f":"IFERROR(VLOOKUP(B104,Inputs_Rec.!$DB$6:$DC$372,2,FALSE),\"\")","v":""},{"$f":"IFERROR(VLOOKUP(B104,Inputs_Rec.!$DD$6:$DE$372,2,FALSE),\"\")","v":""},null,null,"",{"$f":"IFERROR(VLOOKUP(G104,Inputs_Rec.!$DF$6:$DG$372,2,FALSE),\"\")","v":""},null,"",{"$f":"IFERROR(VLOOKUP(J104,Inputs_Rec.!$DH$6:$DI$372,2,FALSE),\"\")","v":""}]
[null,{"$f":"IFERROR(INDEX(List,SMALL(IF(List<>\"\",ROW(INDIRECT(\"1:\"&ROWS(List)))),ROWS($1:104))),\"\")","v":""},{"$f":"IFERROR(VLOOKUP(B105,Inputs_Rec.!$DB$6:$DC$372,2,FALSE),\"\")","v":""},{"$f":"IFERROR(VLOOKUP(B105,Inputs_Rec.!$DD$6:$DE$372,2,FALSE),\"\")","v":""},null,null,"",{"$f":"IFERROR(VLOOKUP(G105,Inputs_Rec.!$DF$6:$DG$372,2,FALSE),\"\")","v":""},null,"",{"$f":"IFERROR(VLOOKUP(J105,Inputs_Rec.!$DH$6:$DI$372,2,FALSE),\"\")","v":""}]
[null,{"$f":"IFERROR(INDEX(List,SMALL(IF(List<>\"\",ROW(INDIRECT(\"1:\"&ROWS(List)))),ROWS($1:105))),\"\")","v":""},{"$f":"IFERROR(VLOOKUP(B106,Inputs_Rec.!$DB$6:$DC$372,2,FALSE),\"\")","v":""},{"$f":"IFERROR(VLOOKUP(B106,Inputs_Rec.!$DD$6:$DE$372,2,FALSE),\"\")","v":""},null,null,"",{"$f":"IFERROR(VLOOKUP(G106,Inputs_Rec.!$DF$6:$DG$372,2,FALSE),\"\")","v":""},null,"",{"$f":"IFERROR(VLOOKUP(J106,Inputs_Rec.!$DH$6:$DI$372,2,FALSE),\"\")","v":""}]
[null,{"$f":"IFERROR(INDEX(List,SMALL(IF(List<>\"\",ROW(INDIRECT(\"1:\"&ROWS(List)))),ROWS($1:106))),\"\")","v":""},{"$f":"IFERROR(VLOOKUP(B107,Inputs_Rec.!$DB$6:$DC$372,2,FALSE),\"\")","v":""},{"$f":"IFERROR(VLOOKUP(B107,Inputs_Rec.!$DD$6:$DE$372,2,FALSE),\"\")","v":""},null,null,"",{"$f":"IFERROR(VLOOKUP(G107,Inputs_Rec.!$DF$6:$DG$372,2,FALSE),\"\")","v":""},null,"",{"$f":"IFERROR(VLOOKUP(J107,Inputs_Rec.!$DH$6:$DI$372,2,FALSE),\"\")","v":""}]
[null,{"$f":"IFERROR(INDEX(List,SMALL(IF(List<>\"\",ROW(INDIRECT(\"1:\"&ROWS(List)))),ROWS($1:107))),\"\")","v":""},{"$f":"IFERROR(VLOOKUP(B108,Inputs_Rec.!$DB$6:$DC$372,2,FALSE),\"\")","v":""},{"$f":"IFERROR(VLOOKUP(B108,Inputs_Rec.!$DD$6:$DE$372,2,FALSE),\"\")","v":""},null,null,"",{"$f":"IFERROR(VLOOKUP(G108,Inputs_Rec.!$DF$6:$DG$372,2,FALSE),\"\")","v":""},null,"",{"$f":"IFERROR(VLOOKUP(J108,Inputs_Rec.!$DH$6:$DI$372,2,FALSE),\"\")","v":""}]
[null,{"$f":"IFERROR(INDEX(List,SMALL(IF(List<>\"\",ROW(INDIRECT(\"1:\"&ROWS(List)))),ROWS($1:108))),\"\")","v":""},{"$f":"IFERROR(VLOOKUP(B109,Inputs_Rec.!$DB$6:$DC$372,2,FALSE),\"\")","v":""},{"$f":"IFERROR(VLOOKUP(B109,Inputs_Rec.!$DD$6:$DE$372,2,FALSE),\"\")","v":""},null,null,"",{"$f":"IFERROR(VLOOKUP(G109,Inputs_Rec.!$DF$6:$DG$372,2,FALSE),\"\")","v":""},null,"",{"$f":"IFERROR(VLOOKUP(J109,Inputs_Rec.!$DH$6:$DI$372,2,FALSE),\"\")","v":""}]
[null,{"$f":"IFERROR(INDEX(List,SMALL(IF(List<>\"\",ROW(INDIRECT(\"1:\"&ROWS(List)))),ROWS($1:109))),\"\")","v":""},{"$f":"IFERROR(VLOOKUP(B110,Inputs_Rec.!$DB$6:$DC$372,2,FALSE),\"\")","v":""},{"$f":"IFERROR(VLOOKUP(B110,Inputs_Rec.!$DD$6:$DE$372,2,FALSE),\"\")","v":""},null,null,"",{"$f":"IFERROR(VLOOKUP(G110,Inputs_Rec.!$DF$6:$DG$372,2,FALSE),\"\")","v":""},null,"",{"$f":"IFERROR(VLOOKUP(J110,Inputs_Rec.!$DH$6:$DI$372,2,FALSE),\"\")","v":""}]
[null,{"$f":"IFERROR(INDEX(List,SMALL(IF(List<>\"\",ROW(INDIRECT(\"1:\"&ROWS(List)))),ROWS($1:110))),\"\")","v":""},{"$f":"IFERROR(VLOOKUP(B111,Inputs_Rec.!$DB$6:$DC$372,2,FALSE),\"\")","v":""},{"$f":"IFERROR(VLOOKUP(B111,Inputs_Rec.!$DD$6:$DE$372,2,FALSE),\"\")","v":""},null,null,"",{"$f":"IFERROR(VLOOKUP(G111,Inputs_Rec.!$DF$6:$DG$372,2,FALSE),\"\")","v":""},null,"",{"$f":"IFERROR(VLOOKUP(J111,Inputs_Rec.!$DH$6:$DI$372,2,FALSE),\"\")","v":""}]
[null,{"$f":"IFERROR(INDEX(List,SMALL(IF(List<>\"\",ROW(INDIRECT(\"1:\"&ROWS(List)))),ROWS($1:111))),\"\")","v":""},{"$f":"IFERROR(VLOOKUP(B112,Inputs_Rec.!$DB$6:$DC$372,2,FALSE),\"\")","v":""},{"$f":"IFERROR(VLOOKUP(B112,Inputs_Rec.!$DD$6:$DE$372,2,FALSE),\"\")","v":""},null,null,"",{"$f":"IFERROR(VLOOKUP(G112,Inputs_Rec.!$DF$6:$DG$372,2,FALSE),\"\")","v":""},null,"",{"$f":"IFERROR(VLOOKUP(J112,Inputs_Rec.!$DH$6:$DI$372,2,FALSE),\"\")","v":""}]
[null,{"$f":"IFERROR(INDEX(List,SMALL(IF(List<>\"\",ROW(INDIRECT(\"1:\"&ROWS(List)))),ROWS($1:112))),\"\")","v":""},{"$f":"IFERROR(VLOOKUP(B113,Inputs_Rec.!$DB$6:$DC$372,2,FALSE),\"\")","v":""},{"$f":"IFERROR(VLOOKUP(B113,Inputs_Rec.!$DD$6:$DE$372,2,FALSE),\"\")","v":""},null,null,"",{"$f":"IFERROR(VLOOKUP(G113,Inputs_Rec.!$DF$6:$DG$372,2,FALSE),\"\")","v":""},null,"",{"$f":"IFERROR(VLOOKUP(J113,Inputs_Rec.!$DH$6:$DI$372,2,FALSE),\"\")","v":""}]
[null,{"$f":"IFERROR(INDEX(List,SMALL(IF(List<>\"\",ROW(INDIRECT(\"1:\"&ROWS(List)))),ROWS($1:113))),\"\")","v":""},{"$f":"IFERROR(VLOOKUP(B114,Inputs_Rec.!$DB$6:$DC$372,2,FALSE),\"\")","v":""},{"$f":"IFERROR(VLOOKUP(B114,Inputs_Rec.!$DD$6:$DE$372,2,FALSE),\"\")","v":""},null,null,"",{"$f":"IFERROR(VLOOKUP(G114,Inputs_Rec.!$DF$6:$DG$372,2,FALSE),\"\")","v":""},null,"",{"$f":"IFERROR(VLOOKUP(J114,Inputs_Rec.!$DH$6:$DI$372,2,FALSE),\"\")","v":""}]
[null,{"$f":"IFERROR(INDEX(List,SMALL(IF(List<>\"\",ROW(INDIRECT(\"1:\"&ROWS(List)))),ROWS($1:114))),\"\")","v":""},{"$f":"IFERROR(VLOOKUP(B115,Inputs_Rec.!$DB$6:$DC$372,2,FALSE),\"\")","v":""},{"$f":"IFERROR(VLOOKUP(B115,Inputs_Rec.!$DD$6:$DE$372,2,FALSE),\"\")","v":""},null,null,"",{"$f":"IFERROR(VLOOKUP(G115,Inputs_Rec.!$DF$6:$DG$372,2,FALSE),\"\")","v":""},null,"",{"$f":"IFERROR(VLOOKUP(J115,Inputs_Rec.!$DH$6:$DI$372,2,FALSE),\"\")","v":""}]
[null,{"$f":"IFERROR(INDEX(List,SMALL(IF(List<>\"\",ROW(INDIRECT(\"1:\"&ROWS(List)))),ROWS($1:115))),\"\")","v":""},{"$f":"IFERROR(VLOOKUP(B116,Inputs_Rec.!$DB$6:$DC$372,2,FALSE),\"\")","v":""},{"$f":"IFERROR(VLOOKUP(B116,Inputs_Rec.!$DD$6:$DE$372,2,FALSE),\"\")","v":""},null,null,"",{"$f":"IFERROR(VLOOKUP(G116,Inputs_Rec.!$DF$6:$DG$372,2,FALSE),\"\")","v":""},null,"",{"$f":"IFERROR(VLOOKUP(J116,Inputs_Rec.!$DH$6:$DI$372,2,FALSE),\"\")","v":""}]
[null,{"$f":"IFERROR(INDEX(List,SMALL(IF(List<>\"\",ROW(INDIRECT(\"1:\"&ROWS(List)))),ROWS($1:116))),\"\")","v":""},{"$f":"IFERROR(VLOOKUP(B117,Inputs_Rec.!$DB$6:$DC$372,2,FALSE),\"\")","v":""},{"$f":"IFERROR(VLOOKUP(B117,Inputs_Rec.!$DD$6:$DE$372,2,FALSE),\"\")","v":""},null,null,"",{"$f":"IFERROR(VLOOKUP(G117,Inputs_Rec.!$DF$6:$DG$372,2,FALSE),\"\")","v":""},null,"",{"$f":"IFERROR(VLOOKUP(J117,Inputs_Rec.!$DH$6:$DI$372,2,FALSE),\"\")","v":""}]
[null,{"$f":"IFERROR(INDEX(List,SMALL(IF(List<>\"\",ROW(INDIRECT(\"1:\"&ROWS(List)))),ROWS($1:117))),\"\")","v":""},{"$f":"IFERROR(VLOOKUP(B118,Inputs_Rec.!$DB$6:$DC$372,2,FALSE),\"\")","v":""},{"$f":"IFERROR(VLOOKUP(B118,Inputs_Rec.!$DD$6:$DE$372,2,FALSE),\"\")","v":""},null,null,"",{"$f":"IFERROR(VLOOKUP(G118,Inputs_Rec.!$DF$6:$DG$372,2,FALSE),\"\")","v":""},null,"",{"$f":"IFERROR(VLOOKUP(J118,Inputs_Rec.!$DH$6:$DI$372,2,FALSE),\"\")","v":""}]
[null,{"$f":"IFERROR(INDEX(List,SMALL(IF(List<>\"\",ROW(INDIRECT(\"1:\"&ROWS(List)))),ROWS($1:118))),\"\")","v":""},{"$f":"IFERROR(VLOOKUP(B119,Inputs_Rec.!$DB$6:$DC$372,2,FALSE),\"\")","v":""},{"$f":"IFERROR(VLOOKUP(B119,Inputs_Rec.!$DD$6:$DE$372,2,FALSE),\"\")","v":""},null,null,"",{"$f":"IFERROR(VLOOKUP(G119,Inputs_Rec.!$DF$6:$DG$372,2,FALSE),\"\")","v":""},null,"",{"$f":"IFERROR(VLOOKUP(J119,Inputs_Rec.!$DH$6:$DI$372,2,FALSE),\"\")","v":""}]
[null,{"$f":"IFERROR(INDEX(List,SMALL(IF(List<>\"\",ROW(INDIRECT(\"1:\"&ROWS(List)))),ROWS($1:119))),\"\")","v":""},{"$f":"IFERROR(VLOOKUP(B120,Inputs_Rec.!$DB$6:$DC$372,2,FALSE),\"\")","v":""},{"$f":"IFERROR(VLOOKUP(B120,Inputs_Rec.!$DD$6:$DE$372,2,FALSE),\"\")","v":""},null,null,"",{"$f":"IFERROR(VLOOKUP(G120,Inputs_Rec.!$DF$6:$DG$372,2,FALSE),\"\")","v":""},null,"",{"$f":"IFERROR(VLOOKUP(J120,Inputs_Rec.!$DH$6:$DI$372,2,FALSE),\"\")","v":""}]
[null,{"$f":"IFERROR(INDEX(List,SMALL(IF(List<>\"\",ROW(INDIRECT(\"1:\"&ROWS(List)))),ROWS($1:120))),\"\")","v":""},{"$f":"IFERROR(VLOOKUP(B121,Inputs_Rec.!$DB$6:$DC$372,2,FALSE),\"\")","v":""},{"$f":"IFERROR(VLOOKUP(B121,Inputs_Rec.!$DD$6:$DE$372,2,FALSE),\"\")","v":""},null,null,"",{"$f":"IFERROR(VLOOKUP(G121,Inputs_Rec.!$DF$6:$DG$372,2,FALSE),\"\")","v":""},null,"",{"$f":"IFERROR(VLOOKUP(J121,Inputs_Rec.!$DH$6:$DI$372,2,FALSE),\"\")","v":""}]
[null,{"$f":"IFERROR(INDEX(List,SMALL(IF(List<>\"\",ROW(INDIRECT(\"1:\"&ROWS(List)))),ROWS($1:121))),\"\")","v":""},{"$f":"IFERROR(VLOOKUP(B122,Inputs_Rec.!$DB$6:$DC$372,2,FALSE),\"\")","v":""},{"$f":"IFERROR(VLOOKUP(B122,Inputs_Rec.!$DD$6:$DE$372,2,FALSE),\"\")","v":""},null,null,"",{"$f":"IFERROR(VLOOKUP(G122,Inputs_Rec.!$DF$6:$DG$372,2,FALSE),\"\")","v":""},null,"",{"$f":"IFERROR(VLOOKUP(J122,Inputs_Rec.!$DH$6:$DI$372,2,FALSE),\"\")","v":""}]
[null,{"$f":"IFERROR(INDEX(List,SMALL(IF(List<>\"\",ROW(INDIRECT(\"1:\"&ROWS(List)))),ROWS($1:122))),\"\")","v":""},{"$f":"IFERROR(VLOOKUP(B123,Inputs_Rec.!$DB$6:$DC$372,2,FALSE),\"\")","v":""},{"$f":"IFERROR(VLOOKUP(B123,Inputs_Rec.!$DD$6:$DE$372,2,FALSE),\"\")","v":""},null,null,"",{"$f":"IFERROR(VLOOKUP(G123,Inputs_Rec.!$DF$6:$DG$372,2,FALSE),\"\")","v":""},null,"",{"$f":"IFERROR(VLOOKUP(J123,Inputs_Rec.!$DH$6:$DI$372,2,FALSE),\"\")","v":""}]
[null,{"$f":"IFERROR(INDEX(List,SMALL(IF(List<>\"\",ROW(INDIRECT(\"1:\"&ROWS(List)))),ROWS($1:123))),\"\")","v":""},{"$f":"IFERROR(VLOOKUP(B124,Inputs_Rec.!$DB$6:$DC$372,2,FALSE),\"\")","v":""},{"$f":"IFERROR(VLOOKUP(B124,Inputs_Rec.!$DD$6:$DE$372,2,FALSE),\"\")","v":""},null,null,"",{"$f":"IFERROR(VLOOKUP(G124,Inputs_Rec.!$DF$6:$DG$372,2,FALSE),\"\")","v":""},null,"",{"$f":"IFERROR(VLOOKUP(J124,Inputs_Rec.!$DH$6:$DI$372,2,FALSE),\"\")","v":""}]
[null,{"$f":"IFERROR(INDEX(List,SMALL(IF(List<>\"\",ROW(INDIRECT(\"1:\"&ROWS(List)))),ROWS($1:124))),\"\")","v":""},{"$f":"IFERROR(VLOOKUP(B125,Inputs_Rec.!$DB$6:$DC$372,2,FALSE),\"\")","v":""},{"$f":"IFERROR(VLOOKUP(B125,Inputs_Rec.!$DD$6:$DE$372,2,FALSE),\"\")","v":""},null,null,"",{"$f":"IFERROR(VLOOKUP(G125,Inputs_Rec.!$DF$6:$DG$372,2,FALSE),\"\")","v":""},null,"",{"$f":"IFERROR(VLOOKUP(J125,Inputs_Rec.!$DH$6:$DI$372,2,FALSE),\"\")","v":""}]
[null,{"$f":"IFERROR(INDEX(List,SMALL(IF(List<>\"\",ROW(INDIRECT(\"1:\"&ROWS(List)))),ROWS($1:125))),\"\")","v":""},{"$f":"IFERROR(VLOOKUP(B126,Inputs_Rec.!$DB$6:$DC$372,2,FALSE),\"\")","v":""},{"$f":"IFERROR(VLOOKUP(B126,Inputs_Rec.!$DD$6:$DE$372,2,FALSE),\"\")","v":""},null,null,"",{"$f":"IFERROR(VLOOKUP(G126,Inputs_Rec.!$DF$6:$DG$372,2,FALSE),\"\")","v":""},null,"",{"$f":"IFERROR(VLOOKUP(J126,Inputs_Rec.!$DH$6:$DI$372,2,FALSE),\"\")","v":""}]
[null,{"$f":"IFERROR(INDEX(List,SMALL(IF(List<>\"\",ROW(INDIRECT(\"1:\"&ROWS(List)))),ROWS($1:126))),\"\")","v":""},{"$f":"IFERROR(VLOOKUP(B127,Inputs_Rec.!$DB$6:$DC$372,2,FALSE),\"\")","v":""},{"$f":"IFERROR(VLOOKUP(B127,Inputs_Rec.!$DD$6:$DE$372,2,FALSE),\"\")","v":""},null,null,"",{"$f":"IFERROR(VLOOKUP(G127,Inputs_Rec.!$DF$6:$DG$372,2,FALSE),\"\")","v":""},null,"",{"$f":"IFERROR(VLOOKUP(J127,Inputs_Rec.!$DH$6:$DI$372,2,FALSE),\"\")","v":""}]
[null,{"$f":"IFERROR(INDEX(List,SMALL(IF(List<>\"\",ROW(INDIRECT(\"1:\"&ROWS(List)))),ROWS($1:127))),\"\")","v":""},{"$f":"IFERROR(VLOOKUP(B128,Inputs_Rec.!$DB$6:$DC$372,2,FALSE),\"\")","v":""},{"$f":"IFERROR(VLOOKUP(B128,Inputs_Rec.!$DD$6:$DE$372,2,FALSE),\"\")","v":""},null,null,"",{"$f":"IFERROR(VLOOKUP(G128,Inputs_Rec.!$DF$6:$DG$372,2,FALSE),\"\")","v":""},null,"",{"$f":"IFERROR(VLOOKUP(J128,Inputs_Rec.!$DH$6:$DI$372,2,FALSE),\"\")","v":""}]
[null,{"$f":"IFERROR(INDEX(List,SMALL(IF(List<>\"\",ROW(INDIRECT(\"1:\"&ROWS(List)))),ROWS($1:128))),\"\")","v":""},{"$f":"IFERROR(VLOOKUP(B129,Inputs_Rec.!$DB$6:$DC$372,2,FALSE),\"\")","v":""},{"$f":"IFERROR(VLOOKUP(B129,Inputs_Rec.!$DD$6:$DE$372,2,FALSE),\"\")","v":""},null,null,"",{"$f":"IFERROR(VLOOKUP(G129,Inputs_Rec.!$DF$6:$DG$372,2,FALSE),\"\")","v":""},null,"",{"$f":"IFERROR(VLOOKUP(J129,Inputs_Rec.!$DH$6:$DI$372,2,FALSE),\"\")","v":""}]
[null,{"$f":"IFERROR(INDEX(List,SMALL(IF(List<>\"\",ROW(INDIRECT(\"1:\"&ROWS(List)))),ROWS($1:129))),\"\")","v":""},{"$f":"IFERROR(VLOOKUP(B130,Inputs_Rec.!$DB$6:$DC$372,2,FALSE),\"\")","v":""},{"$f":"IFERROR(VLOOKUP(B130,Inputs_Rec.!$DD$6:$DE$372,2,FALSE),\"\")","v":""},null,null,"",{"$f":"IFERROR(VLOOKUP(G130,Inputs_Rec.!$DF$6:$DG$372,2,FALSE),\"\")","v":""},null,"",{"$f":"IFERROR(VLOOKUP(J130,Inputs_Rec.!$DH$6:$DI$372,2,FALSE),\"\")","v":""}]
[null,{"$f":"IFERROR(INDEX(List,SMALL(IF(List<>\"\",ROW(INDIRECT(\"1:\"&ROWS(List)))),ROWS($1:130))),\"\")","v":""},{"$f":"IFERROR(VLOOKUP(B131,Inputs_Rec.!$DB$6:$DC$372,2,FALSE),\"\")","v":""},{"$f":"IFERROR(VLOOKUP(B131,Inputs_Rec.!$DD$6:$DE$372,2,FALSE),\"\")","v":""},null,null,"",{"$f":"IFERROR(VLOOKUP(G131,Inputs_Rec.!$DF$6:$DG$372,2,FALSE),\"\")","v":""},null,"",{"$f":"IFERROR(VLOOKUP(J131,Inputs_Rec.!$DH$6:$DI$372,2,FALSE),\"\")","v":""}]
[null,{"$f":"IFERROR(INDEX(List,SMALL(IF(List<>\"\",ROW(INDIRECT(\"1:\"&ROWS(List)))),ROWS($1:131))),\"\")","v":""},{"$f":"IFERROR(VLOOKUP(B132,Inputs_Rec.!$DB$6:$DC$372,2,FALSE),\"\")","v":""},{"$f":"IFERROR(VLOOKUP(B132,Inputs_Rec.!$DD$6:$DE$372,2,FALSE),\"\")","v":""},null,null,"",{"$f":"IFERROR(VLOOKUP(G132,Inputs_Rec.!$DF$6:$DG$372,2,FALSE),\"\")","v":""},null,"",{"$f":"IFERROR(VLOOKUP(J132,Inputs_Rec.!$DH$6:$DI$372,2,FALSE),\"\")","v":""}]
[null,{"$f":"IFERROR(INDEX(List,SMALL(IF(List<>\"\",ROW(INDIRECT(\"1:\"&ROWS(List)))),ROWS($1:132))),\"\")","v":""},{"$f":"IFERROR(VLOOKUP(B133,Inputs_Rec.!$DB$6:$DC$372,2,FALSE),\"\")","v":""},{"$f":"IFERROR(VLOOKUP(B133,Inputs_Rec.!$DD$6:$DE$372,2,FALSE),\"\")","v":""},null,null,{"$f":"B133","v":""},{"$f":"IFERROR(VLOOKUP(G133,Inputs_Rec.!$DF$6:$DG$372,2,FALSE),\"\")","v":""},null,{"$f":"G133","v":""},{"$f":"IFERROR(VLOOKUP(J133,Inputs_Rec.!$DH$6:$DI$372,2,FALSE),\"\")","v":""}]
[null,{"$f":"IFERROR(INDEX(List,SMALL(IF(List<>\"\",ROW(INDIRECT(\"1:\"&ROWS(List)))),ROWS($1:133))),\"\")","v":""},{"$f":"IFERROR(VLOOKUP(B134,Inputs_Rec.!$DB$6:$DC$372,2,FALSE),\"\")","v":""},{"$f":"IFERROR(VLOOKUP(B134,Inputs_Rec.!$DD$6:$DE$372,2,FALSE),\"\")","v":""},null,null,"",{"$f":"IFERROR(VLOOKUP(G134,Inputs_Rec.!$DF$6:$DG$372,2,FALSE),\"\")","v":""},null,"",{"$f":"IFERROR(VLOOKUP(J134,Inputs_Rec.!$DH$6:$DI$372,2,FALSE),\"\")","v":""}]
[null,{"$f":"IFERROR(INDEX(List,SMALL(IF(List<>\"\",ROW(INDIRECT(\"1:\"&ROWS(List)))),ROWS($1:134))),\"\")","v":""},{"$f":"IFERROR(VLOOKUP(B135,Inputs_Rec.!$DB$6:$DC$372,2,FALSE),\"\")","v":""},{"$f":"IFERROR(VLOOKUP(B135,Inputs_Rec.!$DD$6:$DE$372,2,FALSE),\"\")","v":""},null,null,"",{"$f":"IFERROR(VLOOKUP(G135,Inputs_Rec.!$DF$6:$DG$372,2,FALSE),\"\")","v":""},null,"",{"$f":"IFERROR(VLOOKUP(J135,Inputs_Rec.!$DH$6:$DI$372,2,FALSE),\"\")","v":""}]
[null,{"$f":"IFERROR(INDEX(List,SMALL(IF(List<>\"\",ROW(INDIRECT(\"1:\"&ROWS(List)))),ROWS($1:135))),\"\")","v":""},{"$f":"IFERROR(VLOOKUP(B136,Inputs_Rec.!$DB$6:$DC$372,2,FALSE),\"\")","v":""},{"$f":"IFERROR(VLOOKUP(B136,Inputs_Rec.!$DD$6:$DE$372,2,FALSE),\"\")","v":""},null,null,"",{"$f":"IFERROR(VLOOKUP(G136,Inputs_Rec.!$DF$6:$DG$372,2,FALSE),\"\")","v":""},null,"",{"$f":"IFERROR(VLOOKUP(J136,Inputs_Rec.!$DH$6:$DI$372,2,FALSE),\"\")","v":""}]
[null,{"$f":"IFERROR(INDEX(List,SMALL(IF(List<>\"\",ROW(INDIRECT(\"1:\"&ROWS(List)))),ROWS($1:136))),\"\")","v":""},{"$f":"IFERROR(VLOOKUP(B137,Inputs_Rec.!$DB$6:$DC$372,2,FALSE),\"\")","v":""},{"$f":"IFERROR(VLOOKUP(B137,Inputs_Rec.!$DD$6:$DE$372,2,FALSE),\"\")","v":""},null,null,"",{"$f":"IFERROR(VLOOKUP(G137,Inputs_Rec.!$DF$6:$DG$372,2,FALSE),\"\")","v":""},null,"",{"$f":"IFERROR(VLOOKUP(J137,Inputs_Rec.!$DH$6:$DI$372,2,FALSE),\"\")","v":""}]
[null,{"$f":"IFERROR(INDEX(List,SMALL(IF(List<>\"\",ROW(INDIRECT(\"1:\"&ROWS(List)))),ROWS($1:137))),\"\")","v":""},{"$f":"IFERROR(VLOOKUP(B138,Inputs_Rec.!$DB$6:$DC$372,2,FALSE),\"\")","v":""},{"$f":"IFERROR(VLOOKUP(B138,Inputs_Rec.!$DD$6:$DE$372,2,FALSE),\"\")","v":""},null,null,"",{"$f":"IFERROR(VLOOKUP(G138,Inputs_Rec.!$DF$6:$DG$372,2,FALSE),\"\")","v":""},null,"",{"$f":"IFERROR(VLOOKUP(J138,Inputs_Rec.!$DH$6:$DI$372,2,FALSE),\"\")","v":""}]
[null,{"$f":"IFERROR(INDEX(List,SMALL(IF(List<>\"\",ROW(INDIRECT(\"1:\"&ROWS(List)))),ROWS($1:138))),\"\")","v":""},{"$f":"IFERROR(VLOOKUP(B139,Inputs_Rec.!$DB$6:$DC$372,2,FALSE),\"\")","v":""},{"$f":"IFERROR(VLOOKUP(B139,Inputs_Rec.!$DD$6:$DE$372,2,FALSE),\"\")","v":""},null,null,"",{"$f":"IFERROR(VLOOKUP(G139,Inputs_Rec.!$DF$6:$DG$372,2,FALSE),\"\")","v":""},null,"",{"$f":"IFERROR(VLOOKUP(J139,Inputs_Rec.!$DH$6:$DI$372,2,FALSE),\"\")","v":""}]
[null,{"$f":"IFERROR(INDEX(List,SMALL(IF(List<>\"\",ROW(INDIRECT(\"1:\"&ROWS(List)))),ROWS($1:139))),\"\")","v":""},{"$f":"IFERROR(VLOOKUP(B140,Inputs_Rec.!$DB$6:$DC$372,2,FALSE),\"\")","v":""},{"$f":"IFERROR(VLOOKUP(B140,Inputs_Rec.!$DD$6:$DE$372,2,FALSE),\"\")","v":""},null,null,"",{"$f":"IFERROR(VLOOKUP(G140,Inputs_Rec.!$DF$6:$DG$372,2,FALSE),\"\")","v":""},null,"",{"$f":"IFERROR(VLOOKUP(J140,Inputs_Rec.!$DH$6:$DI$372,2,FALSE),\"\")","v":""}]
[null,{"$f":"IFERROR(INDEX(List,SMALL(IF(List<>\"\",ROW(INDIRECT(\"1:\"&ROWS(List)))),ROWS($1:140))),\"\")","v":""},{"$f":"IFERROR(VLOOKUP(B141,Inputs_Rec.!$DB$6:$DC$372,2,FALSE),\"\")","v":""},{"$f":"IFERROR(VLOOKUP(B141,Inputs_Rec.!$DD$6:$DE$372,2,FALSE),\"\")","v":""},null,null,"",{"$f":"IFERROR(VLOOKUP(G141,Inputs_Rec.!$DF$6:$DG$372,2,FALSE),\"\")","v":""},null,"",{"$f":"IFERROR(VLOOKUP(J141,Inputs_Rec.!$DH$6:$DI$372,2,FALSE),\"\")","v":""}]
[null,{"$f":"IFERROR(INDEX(List,SMALL(IF(List<>\"\",ROW(INDIRECT(\"1:\"&ROWS(List)))),ROWS($1:141))),\"\")","v":""},{"$f":"IFERROR(VLOOKUP(B142,Inputs_Rec.!$DB$6:$DC$372,2,FALSE),\"\")","v":""},{"$f":"IFERROR(VLOOKUP(B142,Inputs_Rec.!$DD$6:$DE$372,2,FALSE),\"\")","v":""},null,null,"",{"$f":"IFERROR(VLOOKUP(G142,Inputs_Rec.!$DF$6:$DG$372,2,FALSE),\"\")","v":""},null,"",{"$f":"IFERROR(VLOOKUP(J142,Inputs_Rec.!$DH$6:$DI$372,2,FALSE),\"\")","v":""}]
[null,{"$f":"IFERROR(INDEX(List,SMALL(IF(List<>\"\",ROW(INDIRECT(\"1:\"&ROWS(List)))),ROWS($1:142))),\"\")","v":""},{"$f":"IFERROR(VLOOKUP(B143,Inputs_Rec.!$DB$6:$DC$372,2,FALSE),\"\")","v":""},{"$f":"IFERROR(VLOOKUP(B143,Inputs_Rec.!$DD$6:$DE$372,2,FALSE),\"\")","v":""},null,null,"",{"$f":"IFERROR(VLOOKUP(G143,Inputs_Rec.!$DF$6:$DG$372,2,FALSE),\"\")","v":""},null,"",{"$f":"IFERROR(VLOOKUP(J143,Inputs_Rec.!$DH$6:$DI$372,2,FALSE),\"\")","v":""}]
[null,{"$f":"IFERROR(INDEX(List,SMALL(IF(List<>\"\",ROW(INDIRECT(\"1:\"&ROWS(List)))),ROWS($1:143))),\"\")","v":""},{"$f":"IFERROR(VLOOKUP(B144,Inputs_Rec.!$DB$6:$DC$372,2,FALSE),\"\")","v":""},{"$f":"IFERROR(VLOOKUP(B144,Inputs_Rec.!$DD$6:$DE$372,2,FALSE),\"\")","v":""},null,null,"",{"$f":"IFERROR(VLOOKUP(G144,Inputs_Rec.!$DF$6:$DG$372,2,FALSE),\"\")","v":""},null,"",{"$f":"IFERROR(VLOOKUP(J144,Inputs_Rec.!$DH$6:$DI$372,2,FALSE),\"\")","v":""}]
[null,{"$f":"IFERROR(INDEX(List,SMALL(IF(List<>\"\",ROW(INDIRECT(\"1:\"&ROWS(List)))),ROWS($1:144))),\"\")","v":""},{"$f":"IFERROR(VLOOKUP(B145,Inputs_Rec.!$DB$6:$DC$372,2,FALSE),\"\")","v":""},{"$f":"IFERROR(VLOOKUP(B145,Inputs_Rec.!$DD$6:$DE$372,2,FALSE),\"\")","v":""},null,null,"",{"$f":"IFERROR(VLOOKUP(G145,Inputs_Rec.!$DF$6:$DG$372,2,FALSE),\"\")","v":""},null,"",{"$f":"IFERROR(VLOOKUP(J145,Inputs_Rec.!$DH$6:$DI$372,2,FALSE),\"\")","v":""}]
[null,{"$f":"IFERROR(INDEX(List,SMALL(IF(List<>\"\",ROW(INDIRECT(\"1:\"&ROWS(List)))),ROWS($1:145))),\"\")","v":""},{"$f":"IFERROR(VLOOKUP(B146,Inputs_Rec.!$DB$6:$DC$372,2,FALSE),\"\")","v":""},{"$f":"IFERROR(VLOOKUP(B146,Inputs_Rec.!$DD$6:$DE$372,2,FALSE),\"\")","v":""},null,null,"",{"$f":"IFERROR(VLOOKUP(G146,Inputs_Rec.!$DF$6:$DG$372,2,FALSE),\"\")","v":""},null,"",{"$f":"IFERROR(VLOOKUP(J146,Inputs_Rec.!$DH$6:$DI$372,2,FALSE),\"\")","v":""}]
[null,{"$f":"IFERROR(INDEX(List,SMALL(IF(List<>\"\",ROW(INDIRECT(\"1:\"&ROWS(List)))),ROWS($1:146))),\"\")","v":""},{"$f":"IFERROR(VLOOKUP(B147,Inputs_Rec.!$DB$6:$DC$372,2,FALSE),\"\")","v":""},{"$f":"IFERROR(VLOOKUP(B147,Inputs_Rec.!$DD$6:$DE$372,2,FALSE),\"\")","v":""},null,null,"",{"$f":"IFERROR(VLOOKUP(G147,Inputs_Rec.!$DF$6:$DG$372,2,FALSE),\"\")","v":""},null,"",{"$f":"IFERROR(VLOOKUP(J147,Inputs_Rec.!$DH$6:$DI$372,2,FALSE),\"\")","v":""}]
[null,{"$f":"IFERROR(INDEX(List,SMALL(IF(List<>\"\",ROW(INDIRECT(\"1:\"&ROWS(List)))),ROWS($1:147))),\"\")","v":""},{"$f":"IFERROR(VLOOKUP(B148,Inputs_Rec.!$DB$6:$DC$372,2,FALSE),\"\")","v":""},{"$f":"IFERROR(VLOOKUP(B148,Inputs_Rec.!$DD$6:$DE$372,2,FALSE),\"\")","v":""},null,null,"",{"$f":"IFERROR(VLOOKUP(G148,Inputs_Rec.!$DF$6:$DG$372,2,FALSE),\"\")","v":""},null,"",{"$f":"IFERROR(VLOOKUP(J148,Inputs_Rec.!$DH$6:$DI$372,2,FALSE),\"\")","v":""}]
[null,{"$f":"IFERROR(INDEX(List,SMALL(IF(List<>\"\",ROW(INDIRECT(\"1:\"&ROWS(List)))),ROWS($1:148))),\"\")","v":""},{"$f":"IFERROR(VLOOKUP(B149,Inputs_Rec.!$DB$6:$DC$372,2,FALSE),\"\")","v":""},{"$f":"IFERROR(VLOOKUP(B149,Inputs_Rec.!$DD$6:$DE$372,2,FALSE),\"\")","v":""},null,null,"",{"$f":"IFERROR(VLOOKUP(G149,Inputs_Rec.!$DF$6:$DG$372,2,FALSE),\"\")","v":""},null,"",{"$f":"IFERROR(VLOOKUP(J149,Inputs_Rec.!$DH$6:$DI$372,2,FALSE),\"\")","v":""}]
[null,{"$f":"IFERROR(INDEX(List,SMALL(IF(List<>\"\",ROW(INDIRECT(\"1:\"&ROWS(List)))),ROWS($1:149))),\"\")","v":""},{"$f":"IFERROR(VLOOKUP(B150,Inputs_Rec.!$DB$6:$DC$372,2,FALSE),\"\")","v":""},{"$f":"IFERROR(VLOOKUP(B150,Inputs_Rec.!$DD$6:$DE$372,2,FALSE),\"\")","v":""},null,null,"",{"$f":"IFERROR(VLOOKUP(G150,Inputs_Rec.!$DF$6:$DG$372,2,FALSE),\"\")","v":""},null,"",{"$f":"IFERROR(VLOOKUP(J150,Inputs_Rec.!$DH$6:$DI$372,2,FALSE),\"\")","v":""}]
[null,{"$f":"IFERROR(INDEX(List,SMALL(IF(List<>\"\",ROW(INDIRECT(\"1:\"&ROWS(List)))),ROWS($1:150))),\"\")","v":""},{"$f":"IFERROR(VLOOKUP(B151,Inputs_Rec.!$DB$6:$DC$372,2,FALSE),\"\")","v":""},{"$f":"IFERROR(VLOOKUP(B151,Inputs_Rec.!$DD$6:$DE$372,2,FALSE),\"\")","v":""},null,null,"",{"$f":"IFERROR(VLOOKUP(G151,Inputs_Rec.!$DF$6:$DG$372,2,FALSE),\"\")","v":""},null,"",{"$f":"IFERROR(VLOOKUP(J151,Inputs_Rec.!$DH$6:$DI$372,2,FALSE),\"\")","v":""}]
[null,{"$f":"IFERROR(INDEX(List,SMALL(IF(List<>\"\",ROW(INDIRECT(\"1:\"&ROWS(List)))),ROWS($1:151))),\"\")","v":""},{"$f":"IFERROR(VLOOKUP(B152,Inputs_Rec.!$DB$6:$DC$372,2,FALSE),\"\")","v":""},{"$f":"IFERROR(VLOOKUP(B152,Inputs_Rec.!$DD$6:$DE$372,2,FALSE),\"\")","v":""},null,null,"",{"$f":"IFERROR(VLOOKUP(G152,Inputs_Rec.!$DF$6:$DG$372,2,FALSE),\"\")","v":""},null,"",{"$f":"IFERROR(VLOOKUP(J152,Inputs_Rec.!$DH$6:$DI$372,2,FALSE),\"\")","v":""}]
[null,{"$f":"IFERROR(INDEX(List,SMALL(IF(List<>\"\",ROW(INDIRECT(\"1:\"&ROWS(List)))),ROWS($1:152))),\"\")","v":""},{"$f":"IFERROR(VLOOKUP(B153,Inputs_Rec.!$DB$6:$DC$372,2,FALSE),\"\")","v":""},{"$f":"IFERROR(VLOOKUP(B153,Inputs_Rec.!$DD$6:$DE$372,2,FALSE),\"\")","v":""},null,null,"",{"$f":"IFERROR(VLOOKUP(G153,Inputs_Rec.!$DF$6:$DG$372,2,FALSE),\"\")","v":""},null,"",{"$f":"IFERROR(VLOOKUP(J153,Inputs_Rec.!$DH$6:$DI$372,2,FALSE),\"\")","v":""}]
[null,{"$f":"IFERROR(INDEX(List,SMALL(IF(List<>\"\",ROW(INDIRECT(\"1:\"&ROWS(List)))),ROWS($1:153))),\"\")","v":""},{"$f":"IFERROR(VLOOKUP(B154,Inputs_Rec.!$DB$6:$DC$372,2,FALSE),\"\")","v":""},{"$f":"IFERROR(VLOOKUP(B154,Inputs_Rec.!$DD$6:$DE$372,2,FALSE),\"\")","v":""},null,null,"",{"$f":"IFERROR(VLOOKUP(G154,Inputs_Rec.!$DF$6:$DG$372,2,FALSE),\"\")","v":""},null,"",{"$f":"IFERROR(VLOOKUP(J154,Inputs_Rec.!$DH$6:$DI$372,2,FALSE),\"\")","v":""}]
[null,{"$f":"IFERROR(INDEX(List,SMALL(IF(List<>\"\",ROW(INDIRECT(\"1:\"&ROWS(List)))),ROWS($1:154))),\"\")","v":""},{"$f":"IFERROR(VLOOKUP(B155,Inputs_Rec.!$DB$6:$DC$372,2,FALSE),\"\")","v":""},{"$f":"IFERROR(VLOOKUP(B155,Inputs_Rec.!$DD$6:$DE$372,2,FALSE),\"\")","v":""},null,null,"",{"$f":"IFERROR(VLOOKUP(G155,Inputs_Rec.!$DF$6:$DG$372,2,FALSE),\"\")","v":""},null,"",{"$f":"IFERROR(VLOOKUP(J155,Inputs_Rec.!$DH$6:$DI$372,2,FALSE),\"\")","v":""}]
[null,{"$f":"IFERROR(INDEX(List,SMALL(IF(List<>\"\",ROW(INDIRECT(\"1:\"&ROWS(List)))),ROWS($1:155))),\"\")","v":""},{"$f":"IFERROR(VLOOKUP(B156,Inputs_Rec.!$DB$6:$DC$372,2,FALSE),\"\")","v":""},{"$f":"IFERROR(VLOOKUP(B156,Inputs_Rec.!$DD$6:$DE$372,2,FALSE),\"\")","v":""},null,null,"",{"$f":"IFERROR(VLOOKUP(G156,Inputs_Rec.!$DF$6:$DG$372,2,FALSE),\"\")","v":""},null,"",{"$f":"IFERROR(VLOOKUP(J156,Inputs_Rec.!$DH$6:$DI$372,2,FALSE),\"\")","v":""}]
[null,{"$f":"IFERROR(INDEX(List,SMALL(IF(List<>\"\",ROW(INDIRECT(\"1:\"&ROWS(List)))),ROWS($1:156))),\"\")","v":""},{"$f":"IFERROR(VLOOKUP(B157,Inputs_Rec.!$DB$6:$DC$372,2,FALSE),\"\")","v":""},{"$f":"IFERROR(VLOOKUP(B157,Inputs_Rec.!$DD$6:$DE$372,2,FALSE),\"\")","v":""},null,null,"",{"$f":"IFERROR(VLOOKUP(G157,Inputs_Rec.!$DF$6:$DG$372,2,FALSE),\"\")","v":""},null,"",{"$f":"IFERROR(VLOOKUP(J157,Inputs_Rec.!$DH$6:$DI$372,2,FALSE),\"\")","v":""}]
[null,{"$f":"IFERROR(INDEX(List,SMALL(IF(List<>\"\",ROW(INDIRECT(\"1:\"&ROWS(List)))),ROWS($1:157))),\"\")","v":""},{"$f":"IFERROR(VLOOKUP(B158,Inputs_Rec.!$DB$6:$DC$372,2,FALSE),\"\")","v":""},{"$f":"IFERROR(VLOOKUP(B158,Inputs_Rec.!$DD$6:$DE$372,2,FALSE),\"\")","v":""},null,null,"",{"$f":"IFERROR(VLOOKUP(G158,Inputs_Rec.!$DF$6:$DG$372,2,FALSE),\"\")","v":""},null,"",{"$f":"IFERROR(VLOOKUP(J158,Inputs_Rec.!$DH$6:$DI$372,2,FALSE),\"\")","v":""}]
[null,{"$f":"IFERROR(INDEX(List,SMALL(IF(List<>\"\",ROW(INDIRECT(\"1:\"&ROWS(List)))),ROWS($1:158))),\"\")","v":""},{"$f":"IFERROR(VLOOKUP(B159,Inputs_Rec.!$DB$6:$DC$372,2,FALSE),\"\")","v":""},{"$f":"IFERROR(VLOOKUP(B159,Inputs_Rec.!$DD$6:$DE$372,2,FALSE),\"\")","v":""},null,null,"",{"$f":"IFERROR(VLOOKUP(G159,Inputs_Rec.!$DF$6:$DG$372,2,FALSE),\"\")","v":""},null,"",{"$f":"IFERROR(VLOOKUP(J159,Inputs_Rec.!$DH$6:$DI$372,2,FALSE),\"\")","v":""}]
[null,{"$f":"IFERROR(INDEX(List,SMALL(IF(List<>\"\",ROW(INDIRECT(\"1:\"&ROWS(List)))),ROWS($1:159))),\"\")","v":""},{"$f":"IFERROR(VLOOKUP(B160,Inputs_Rec.!$DB$6:$DC$372,2,FALSE),\"\")","v":""},{"$f":"IFERROR(VLOOKUP(B160,Inputs_Rec.!$DD$6:$DE$372,2,FALSE),\"\")","v":""},null,null,"",{"$f":"IFERROR(VLOOKUP(G160,Inputs_Rec.!$DF$6:$DG$372,2,FALSE),\"\")","v":""},null,"",{"$f":"IFERROR(VLOOKUP(J160,Inputs_Rec.!$DH$6:$DI$372,2,FALSE),\"\")","v":""}]
[null,{"$f":"IFERROR(INDEX(List,SMALL(IF(List<>\"\",ROW(INDIRECT(\"1:\"&ROWS(List)))),ROWS($1:160))),\"\")","v":""},{"$f":"IFERROR(VLOOKUP(B161,Inputs_Rec.!$DB$6:$DC$372,2,FALSE),\"\")","v":""},{"$f":"IFERROR(VLOOKUP(B161,Inputs_Rec.!$DD$6:$DE$372,2,FALSE),\"\")","v":""},null,null,"",{"$f":"IFERROR(VLOOKUP(G161,Inputs_Rec.!$DF$6:$DG$372,2,FALSE),\"\")","v":""},null,"",{"$f":"IFERROR(VLOOKUP(J161,Inputs_Rec.!$DH$6:$DI$372,2,FALSE),\"\")","v":""}]
[null,{"$f":"IFERROR(INDEX(List,SMALL(IF(List<>\"\",ROW(INDIRECT(\"1:\"&ROWS(List)))),ROWS($1:161))),\"\")","v":""},{"$f":"IFERROR(VLOOKUP(B162,Inputs_Rec.!$DB$6:$DC$372,2,FALSE),\"\")","v":""},{"$f":"IFERROR(VLOOKUP(B162,Inputs_Rec.!$DD$6:$DE$372,2,FALSE),\"\")","v":""},null,null,"",{"$f":"IFERROR(VLOOKUP(G162,Inputs_Rec.!$DF$6:$DG$372,2,FALSE),\"\")","v":""},null,"",{"$f":"IFERROR(VLOOKUP(J162,Inputs_Rec.!$DH$6:$DI$372,2,FALSE),\"\")","v":""}]
[null,{"$f":"IFERROR(INDEX(List,SMALL(IF(List<>\"\",ROW(INDIRECT(\"1:\"&ROWS(List)))),ROWS($1:162))),\"\")","v":""},{"$f":"IFERROR(VLOOKUP(B163,Inputs_Rec.!$DB$6:$DC$372,2,FALSE),\"\")","v":""},{"$f":"IFERROR(VLOOKUP(B163,Inputs_Rec.!$DD$6:$DE$372,2,FALSE),\"\")","v":""},null,null,"",{"$f":"IFERROR(VLOOKUP(G163,Inputs_Rec.!$DF$6:$DG$372,2,FALSE),\"\")","v":""},null,"",{"$f":"IFERROR(VLOOKUP(J163,Inputs_Rec.!$DH$6:$DI$372,2,FALSE),\"\")","v":""}]
[null,{"$f":"IFERROR(INDEX(List,SMALL(IF(List<>\"\",ROW(INDIRECT(\"1:\"&ROWS(List)))),ROWS($1:163))),\"\")","v":""},{"$f":"IFERROR(VLOOKUP(B164,Inputs_Rec.!$DB$6:$DC$372,2,FALSE),\"\")","v":""},{"$f":"IFERROR(VLOOKUP(B164,Inputs_Rec.!$DD$6:$DE$372,2,FALSE),\"\")","v":""},null,null,"",{"$f":"IFERROR(VLOOKUP(G164,Inputs_Rec.!$DF$6:$DG$372,2,FALSE),\"\")","v":""},null,"",{"$f":"IFERROR(VLOOKUP(J164,Inputs_Rec.!$DH$6:$DI$372,2,FALSE),\"\")","v":""}]
[null,{"$f":"IFERROR(INDEX(List,SMALL(IF(List<>\"\",ROW(INDIRECT(\"1:\"&ROWS(List)))),ROWS($1:164))),\"\")","v":""},{"$f":"IFERROR(VLOOKUP(B165,Inputs_Rec.!$DB$6:$DC$372,2,FALSE),\"\")","v":""},{"$f":"IFERROR(VLOOKUP(B165,Inputs_Rec.!$DD$6:$DE$372,2,FALSE),\"\")","v":""},null,null,"",{"$f":"IFERROR(VLOOKUP(G165,Inputs_Rec.!$DF$6:$DG$372,2,FALSE),\"\")","v":""},null,"",{"$f":"IFERROR(VLOOKUP(J165,Inputs_Rec.!$DH$6:$DI$372,2,FALSE),\"\")","v":""}]
[null,{"$f":"IFERROR(INDEX(List,SMALL(IF(List<>\"\",ROW(INDIRECT(\"1:\"&ROWS(List)))),ROWS($1:165))),\"\")","v":""},{"$f":"IFERROR(VLOOKUP(B166,Inputs_Rec.!$DB$6:$DC$372,2,FALSE),\"\")","v":""},{"$f":"IFERROR(VLOOKUP(B166,Inputs_Rec.!$DD$6:$DE$372,2,FALSE),\"\")","v":""},null,null,"",{"$f":"IFERROR(VLOOKUP(G166,Inputs_Rec.!$DF$6:$DG$372,2,FALSE),\"\")","v":""},null,"",{"$f":"IFERROR(VLOOKUP(J166,Inputs_Rec.!$DH$6:$DI$372,2,FALSE),\"\")","v":""}]
[null,{"$f":"IFERROR(INDEX(List,SMALL(IF(List<>\"\",ROW(INDIRECT(\"1:\"&ROWS(List)))),ROWS($1:166))),\"\")","v":""},{"$f":"IFERROR(VLOOKUP(B167,Inputs_Rec.!$DB$6:$DC$372,2,FALSE),\"\")","v":""},{"$f":"IFERROR(VLOOKUP(B167,Inputs_Rec.!$DD$6:$DE$372,2,FALSE),\"\")","v":""},null,null,"",{"$f":"IFERROR(VLOOKUP(G167,Inputs_Rec.!$DF$6:$DG$372,2,FALSE),\"\")","v":""},null,"",{"$f":"IFERROR(VLOOKUP(J167,Inputs_Rec.!$DH$6:$DI$372,2,FALSE),\"\")","v":""}]
[null,{"$f":"IFERROR(INDEX(List,SMALL(IF(List<>\"\",ROW(INDIRECT(\"1:\"&ROWS(List)))),ROWS($1:167))),\"\")","v":""},{"$f":"IFERROR(VLOOKUP(B168,Inputs_Rec.!$DB$6:$DC$372,2,FALSE),\"\")","v":""},{"$f":"IFERROR(VLOOKUP(B168,Inputs_Rec.!$DD$6:$DE$372,2,FALSE),\"\")","v":""},null,null,"",{"$f":"IFERROR(VLOOKUP(G168,Inputs_Rec.!$DF$6:$DG$372,2,FALSE),\"\")","v":""},null,"",{"$f":"IFERROR(VLOOKUP(J168,Inputs_Rec.!$DH$6:$DI$372,2,FALSE),\"\")","v":""}]
[null,{"$f":"IFERROR(INDEX(List,SMALL(IF(List<>\"\",ROW(INDIRECT(\"1:\"&ROWS(List)))),ROWS($1:168))),\"\")","v":""},{"$f":"IFERROR(VLOOKUP(B169,Inputs_Rec.!$DB$6:$DC$372,2,FALSE),\"\")","v":""},{"$f":"IFERROR(VLOOKUP(B169,Inputs_Rec.!$DD$6:$DE$372,2,FALSE),\"\")","v":""},null,null,"",{"$f":"IFERROR(VLOOKUP(G169,Inputs_Rec.!$DF$6:$DG$372,2,FALSE),\"\")","v":""},null,"",{"$f":"IFERROR(VLOOKUP(J169,Inputs_Rec.!$DH$6:$DI$372,2,FALSE),\"\")","v":""}]
[null,{"$f":"IFERROR(INDEX(List,SMALL(IF(List<>\"\",ROW(INDIRECT(\"1:\"&ROWS(List)))),ROWS($1:169))),\"\")","v":""},{"$f":"IFERROR(VLOOKUP(B170,Inputs_Rec.!$DB$6:$DC$372,2,FALSE),\"\")","v":""},{"$f":"IFERROR(VLOOKUP(B170,Inputs_Rec.!$DD$6:$DE$372,2,FALSE),\"\")","v":""},null,null,"",{"$f":"IFERROR(VLOOKUP(G170,Inputs_Rec.!$DF$6:$DG$372,2,FALSE),\"\")","v":""},null,"",{"$f":"IFERROR(VLOOKUP(J170,Inputs_Rec.!$DH$6:$DI$372,2,FALSE),\"\")","v":""}]
[null,{"$f":"IFERROR(INDEX(List,SMALL(IF(List<>\"\",ROW(INDIRECT(\"1:\"&ROWS(List)))),ROWS($1:170))),\"\")","v":""},{"$f":"IFERROR(VLOOKUP(B171,Inputs_Rec.!$DB$6:$DC$372,2,FALSE),\"\")","v":""},{"$f":"IFERROR(VLOOKUP(B171,Inputs_Rec.!$DD$6:$DE$372,2,FALSE),\"\")","v":""},null,null,"",{"$f":"IFERROR(VLOOKUP(G171,Inputs_Rec.!$DF$6:$DG$372,2,FALSE),\"\")","v":""},null,"",{"$f":"IFERROR(VLOOKUP(J171,Inputs_Rec.!$DH$6:$DI$372,2,FALSE),\"\")","v":""}]
[null,{"$f":"IFERROR(INDEX(List,SMALL(IF(List<>\"\",ROW(INDIRECT(\"1:\"&ROWS(List)))),ROWS($1:171))),\"\")","v":""},{"$f":"IFERROR(VLOOKUP(B172,Inputs_Rec.!$DB$6:$DC$372,2,FALSE),\"\")","v":""},{"$f":"IFERROR(VLOOKUP(B172,Inputs_Rec.!$DD$6:$DE$372,2,FALSE),\"\")","v":""},null,null,"",{"$f":"IFERROR(VLOOKUP(G172,Inputs_Rec.!$DF$6:$DG$372,2,FALSE),\"\")","v":""},null,"",{"$f":"IFERROR(VLOOKUP(J172,Inputs_Rec.!$DH$6:$DI$372,2,FALSE),\"\")","v":""}]
[null,{"$f":"IFERROR(INDEX(List,SMALL(IF(List<>\"\",ROW(INDIRECT(\"1:\"&ROWS(List)))),ROWS($1:172))),\"\")","v":""},{"$f":"IFERROR(VLOOKUP(B173,Inputs_Rec.!$DB$6:$DC$372,2,FALSE),\"\")","v":""},{"$f":"IFERROR(VLOOKUP(B173,Inputs_Rec.!$DD$6:$DE$372,2,FALSE),\"\")","v":""},null,null,"",{"$f":"IFERROR(VLOOKUP(G173,Inputs_Rec.!$DF$6:$DG$372,2,FALSE),\"\")","v":""},null,"",{"$f":"IFERROR(VLOOKUP(J173,Inputs_Rec.!$DH$6:$DI$372,2,FALSE),\"\")","v":""}]
[null,{"$f":"IFERROR(INDEX(List,SMALL(IF(List<>\"\",ROW(INDIRECT(\"1:\"&ROWS(List)))),ROWS($1:173))),\"\")","v":""},{"$f":"IFERROR(VLOOKUP(B174,Inputs_Rec.!$DB$6:$DC$372,2,FALSE),\"\")","v":""},{"$f":"IFERROR(VLOOKUP(B174,Inputs_Rec.!$DD$6:$DE$372,2,FALSE),\"\")","v":""},null,null,"",{"$f":"IFERROR(VLOOKUP(G174,Inputs_Rec.!$DF$6:$DG$372,2,FALSE),\"\")","v":""},null,"",{"$f":"IFERROR(VLOOKUP(J174,Inputs_Rec.!$DH$6:$DI$372,2,FALSE),\"\")","v":""}]
[null,{"$f":"IFERROR(INDEX(List,SMALL(IF(List<>\"\",ROW(INDIRECT(\"1:\"&ROWS(List)))),ROWS($1:174))),\"\")","v":""},{"$f":"IFERROR(VLOOKUP(B175,Inputs_Rec.!$DB$6:$DC$372,2,FALSE),\"\")","v":""},{"$f":"IFERROR(VLOOKUP(B175,Inputs_Rec.!$DD$6:$DE$372,2,FALSE),\"\")","v":""},null,null,"",{"$f":"IFERROR(VLOOKUP(G175,Inputs_Rec.!$DF$6:$DG$372,2,FALSE),\"\")","v":""},null,"",{"$f":"IFERROR(VLOOKUP(J175,Inputs_Rec.!$DH$6:$DI$372,2,FALSE),\"\")","v":""}]
[null,{"$f":"IFERROR(INDEX(List,SMALL(IF(List<>\"\",ROW(INDIRECT(\"1:\"&ROWS(List)))),ROWS($1:175))),\"\")","v":""},{"$f":"IFERROR(VLOOKUP(B176,Inputs_Rec.!$DB$6:$DC$372,2,FALSE),\"\")","v":""},{"$f":"IFERROR(VLOOKUP(B176,Inputs_Rec.!$DD$6:$DE$372,2,FALSE),\"\")","v":""},null,null,"",{"$f":"IFERROR(VLOOKUP(G176,Inputs_Rec.!$DF$6:$DG$372,2,FALSE),\"\")","v":""},null,"",{"$f":"IFERROR(VLOOKUP(J176,Inputs_Rec.!$DH$6:$DI$372,2,FALSE),\"\")","v":""}]
[null,{"$f":"IFERROR(INDEX(List,SMALL(IF(List<>\"\",ROW(INDIRECT(\"1:\"&ROWS(List)))),ROWS($1:176))),\"\")","v":""},{"$f":"IFERROR(VLOOKUP(B177,Inputs_Rec.!$DB$6:$DC$372,2,FALSE),\"\")","v":""},{"$f":"IFERROR(VLOOKUP(B177,Inputs_Rec.!$DD$6:$DE$372,2,FALSE),\"\")","v":""},null,null,"",{"$f":"IFERROR(VLOOKUP(G177,Inputs_Rec.!$DF$6:$DG$372,2,FALSE),\"\")","v":""},null,"",{"$f":"IFERROR(VLOOKUP(J177,Inputs_Rec.!$DH$6:$DI$372,2,FALSE),\"\")","v":""}]
[null,{"$f":"IFERROR(INDEX(List,SMALL(IF(List<>\"\",ROW(INDIRECT(\"1:\"&ROWS(List)))),ROWS($1:177))),\"\")","v":""},{"$f":"IFERROR(VLOOKUP(B178,Inputs_Rec.!$DB$6:$DC$372,2,FALSE),\"\")","v":""},{"$f":"IFERROR(VLOOKUP(B178,Inputs_Rec.!$DD$6:$DE$372,2,FALSE),\"\")","v":""},null,null,"",{"$f":"IFERROR(VLOOKUP(G178,Inputs_Rec.!$DF$6:$DG$372,2,FALSE),\"\")","v":""},null,"",{"$f":"IFERROR(VLOOKUP(J178,Inputs_Rec.!$DH$6:$DI$372,2,FALSE),\"\")","v":""}]
[null,{"$f":"IFERROR(INDEX(List,SMALL(IF(List<>\"\",ROW(INDIRECT(\"1:\"&ROWS(List)))),ROWS($1:178))),\"\")","v":""},{"$f":"IFERROR(VLOOKUP(B179,Inputs_Rec.!$DB$6:$DC$372,2,FALSE),\"\")","v":""},{"$f":"IFERROR(VLOOKUP(B179,Inputs_Rec.!$DD$6:$DE$372,2,FALSE),\"\")","v":""},null,null,"",{"$f":"IFERROR(VLOOKUP(G179,Inputs_Rec.!$DF$6:$DG$372,2,FALSE),\"\")","v":""},null,"",{"$f":"IFERROR(VLOOKUP(J179,Inputs_Rec.!$DH$6:$DI$372,2,FALSE),\"\")","v":""}]
[null,{"$f":"IFERROR(INDEX(List,SMALL(IF(List<>\"\",ROW(INDIRECT(\"1:\"&ROWS(List)))),ROWS($1:179))),\"\")","v":""},{"$f":"IFERROR(VLOOKUP(B180,Inputs_Rec.!$DB$6:$DC$372,2,FALSE),\"\")","v":""},{"$f":"IFERROR(VLOOKUP(B180,Inputs_Rec.!$DD$6:$DE$372,2,FALSE),\"\")","v":""},null,null,"",{"$f":"IFERROR(VLOOKUP(G180,Inputs_Rec.!$DF$6:$DG$372,2,FALSE),\"\")","v":""},null,"",{"$f":"IFERROR(VLOOKUP(J180,Inputs_Rec.!$DH$6:$DI$372,2,FALSE),\"\")","v":""}]
[null,{"$f":"IFERROR(INDEX(List,SMALL(IF(List<>\"\",ROW(INDIRECT(\"1:\"&ROWS(List)))),ROWS($1:180))),\"\")","v":""},{"$f":"IFERROR(VLOOKUP(B181,Inputs_Rec.!$DB$6:$DC$372,2,FALSE),\"\")","v":""},{"$f":"IFERROR(VLOOKUP(B181,Inputs_Rec.!$DD$6:$DE$372,2,FALSE),\"\")","v":""},null,null,"",{"$f":"IFERROR(VLOOKUP(G181,Inputs_Rec.!$DF$6:$DG$372,2,FALSE),\"\")","v":""},null,"",{"$f":"IFERROR(VLOOKUP(J181,Inputs_Rec.!$DH$6:$DI$372,2,FALSE),\"\")","v":""}]
[null,{"$f":"IFERROR(INDEX(List,SMALL(IF(List<>\"\",ROW(INDIRECT(\"1:\"&ROWS(List)))),ROWS($1:181))),\"\")","v":""},{"$f":"IFERROR(VLOOKUP(B182,Inputs_Rec.!$DB$6:$DC$372,2,FALSE),\"\")","v":""},{"$f":"IFERROR(VLOOKUP(B182,Inputs_Rec.!$DD$6:$DE$372,2,FALSE),\"\")","v":""},null,null,"",{"$f":"IFERROR(VLOOKUP(G182,Inputs_Rec.!$DF$6:$DG$372,2,FALSE),\"\")","v":""},null,"",{"$f":"IFERROR(VLOOKUP(J182,Inputs_Rec.!$DH$6:$DI$372,2,FALSE),\"\")","v":""}]
[null,{"$f":"IFERROR(INDEX(List,SMALL(IF(List<>\"\",ROW(INDIRECT(\"1:\"&ROWS(List)))),ROWS($1:182))),\"\")","v":""},{"$f":"IFERROR(VLOOKUP(B183,Inputs_Rec.!$DB$6:$DC$372,2,FALSE),\"\")","v":""},{"$f":"IFERROR(VLOOKUP(B183,Inputs_Rec.!$DD$6:$DE$372,2,FALSE),\"\")","v":""},null,null,"",{"$f":"IFERROR(VLOOKUP(G183,Inputs_Rec.!$DF$6:$DG$372,2,FALSE),\"\")","v":""},null,"",{"$f":"IFERROR(VLOOKUP(J183,Inputs_Rec.!$DH$6:$DI$372,2,FALSE),\"\")","v":""}]
[null,{"$f":"IFERROR(INDEX(List,SMALL(IF(List<>\"\",ROW(INDIRECT(\"1:\"&ROWS(List)))),ROWS($1:183))),\"\")","v":""},{"$f":"IFERROR(VLOOKUP(B184,Inputs_Rec.!$DB$6:$DC$372,2,FALSE),\"\")","v":""},{"$f":"IFERROR(VLOOKUP(B184,Inputs_Rec.!$DD$6:$DE$372,2,FALSE),\"\")","v":""},null,null,"",{"$f":"IFERROR(VLOOKUP(G184,Inputs_Rec.!$DF$6:$DG$372,2,FALSE),\"\")","v":""},null,"",{"$f":"IFERROR(VLOOKUP(J184,Inputs_Rec.!$DH$6:$DI$372,2,FALSE),\"\")","v":""}]
[null,{"$f":"IFERROR(INDEX(List,SMALL(IF(List<>\"\",ROW(INDIRECT(\"1:\"&ROWS(List)))),ROWS($1:184))),\"\")","v":""},{"$f":"IFERROR(VLOOKUP(B185,Inputs_Rec.!$DB$6:$DC$372,2,FALSE),\"\")","v":""},{"$f":"IFERROR(VLOOKUP(B185,Inputs_Rec.!$DD$6:$DE$372,2,FALSE),\"\")","v":""},null,null,"",{"$f":"IFERROR(VLOOKUP(G185,Inputs_Rec.!$DF$6:$DG$372,2,FALSE),\"\")","v":""},null,"",{"$f":"IFERROR(VLOOKUP(J185,Inputs_Rec.!$DH$6:$DI$372,2,FALSE),\"\")","v":""}]
[null,{"$f":"IFERROR(INDEX(List,SMALL(IF(List<>\"\",ROW(INDIRECT(\"1:\"&ROWS(List)))),ROWS($1:185))),\"\")","v":""},{"$f":"IFERROR(VLOOKUP(B186,Inputs_Rec.!$DB$6:$DC$372,2,FALSE),\"\")","v":""},{"$f":"IFERROR(VLOOKUP(B186,Inputs_Rec.!$DD$6:$DE$372,2,FALSE),\"\")","v":""},null,null,"",{"$f":"IFERROR(VLOOKUP(G186,Inputs_Rec.!$DF$6:$DG$372,2,FALSE),\"\")","v":""},null,"",{"$f":"IFERROR(VLOOKUP(J186,Inputs_Rec.!$DH$6:$DI$372,2,FALSE),\"\")","v":""}]
[null,{"$f":"IFERROR(INDEX(List,SMALL(IF(List<>\"\",ROW(INDIRECT(\"1:\"&ROWS(List)))),ROWS($1:186))),\"\")","v":""},{"$f":"IFERROR(VLOOKUP(B187,Inputs_Rec.!$DB$6:$DC$372,2,FALSE),\"\")","v":""},{"$f":"IFERROR(VLOOKUP(B187,Inputs_Rec.!$DD$6:$DE$372,2,FALSE),\"\")","v":""},null,null,"",{"$f":"IFERROR(VLOOKUP(G187,Inputs_Rec.!$DF$6:$DG$372,2,FALSE),\"\")","v":""},null,"",{"$f":"IFERROR(VLOOKUP(J187,Inputs_Rec.!$DH$6:$DI$372,2,FALSE),\"\")","v":""}]
[null,{"$f":"IFERROR(INDEX(List,SMALL(IF(List<>\"\",ROW(INDIRECT(\"1:\"&ROWS(List)))),ROWS($1:187))),\"\")","v":""},{"$f":"IFERROR(VLOOKUP(B188,Inputs_Rec.!$DB$6:$DC$372,2,FALSE),\"\")","v":""},{"$f":"IFERROR(VLOOKUP(B188,Inputs_Rec.!$DD$6:$DE$372,2,FALSE),\"\")","v":""},null,null,"",{"$f":"IFERROR(VLOOKUP(G188,Inputs_Rec.!$DF$6:$DG$372,2,FALSE),\"\")","v":""},null,"",{"$f":"IFERROR(VLOOKUP(J188,Inputs_Rec.!$DH$6:$DI$372,2,FALSE),\"\")","v":""}]
[null,{"$f":"IFERROR(INDEX(List,SMALL(IF(List<>\"\",ROW(INDIRECT(\"1:\"&ROWS(List)))),ROWS($1:188))),\"\")","v":""},{"$f":"IFERROR(VLOOKUP(B189,Inputs_Rec.!$DB$6:$DC$372,2,FALSE),\"\")","v":""},{"$f":"IFERROR(VLOOKUP(B189,Inputs_Rec.!$DD$6:$DE$372,2,FALSE),\"\")","v":""},null,null,"",{"$f":"IFERROR(VLOOKUP(G189,Inputs_Rec.!$DF$6:$DG$372,2,FALSE),\"\")","v":""},null,"",{"$f":"IFERROR(VLOOKUP(J189,Inputs_Rec.!$DH$6:$DI$372,2,FALSE),\"\")","v":""}]
[null,{"$f":"IFERROR(INDEX(List,SMALL(IF(List<>\"\",ROW(INDIRECT(\"1:\"&ROWS(List)))),ROWS($1:189))),\"\")","v":""},{"$f":"IFERROR(VLOOKUP(B190,Inputs_Rec.!$DB$6:$DC$372,2,FALSE),\"\")","v":""},{"$f":"IFERROR(VLOOKUP(B190,Inputs_Rec.!$DD$6:$DE$372,2,FALSE),\"\")","v":""},null,null,"",{"$f":"IFERROR(VLOOKUP(G190,Inputs_Rec.!$DF$6:$DG$372,2,FALSE),\"\")","v":""},null,"",{"$f":"IFERROR(VLOOKUP(J190,Inputs_Rec.!$DH$6:$DI$372,2,FALSE),\"\")","v":""}]
[null,{"$f":"IFERROR(INDEX(List,SMALL(IF(List<>\"\",ROW(INDIRECT(\"1:\"&ROWS(List)))),ROWS($1:190))),\"\")","v":""},{"$f":"IFERROR(VLOOKUP(B191,Inputs_Rec.!$DB$6:$DC$372,2,FALSE),\"\")","v":""},{"$f":"IFERROR(VLOOKUP(B191,Inputs_Rec.!$DD$6:$DE$372,2,FALSE),\"\")","v":""},null,null,"",{"$f":"IFERROR(VLOOKUP(G191,Inputs_Rec.!$DF$6:$DG$372,2,FALSE),\"\")","v":""},null,"",{"$f":"IFERROR(VLOOKUP(J191,Inputs_Rec.!$DH$6:$DI$372,2,FALSE),\"\")","v":""}]
[null,{"$f":"IFERROR(INDEX(List,SMALL(IF(List<>\"\",ROW(INDIRECT(\"1:\"&ROWS(List)))),ROWS($1:191))),\"\")","v":""},{"$f":"IFERROR(VLOOKUP(B192,Inputs_Rec.!$DB$6:$DC$372,2,FALSE),\"\")","v":""},{"$f":"IFERROR(VLOOKUP(B192,Inputs_Rec.!$DD$6:$DE$372,2,FALSE),\"\")","v":""},null,null,"",{"$f":"IFERROR(VLOOKUP(G192,Inputs_Rec.!$DF$6:$DG$372,2,FALSE),\"\")","v":""},null,"",{"$f":"IFERROR(VLOOKUP(J192,Inputs_Rec.!$DH$6:$DI$372,2,FALSE),\"\")","v":""}]
[null,{"$f":"IFERROR(INDEX(List,SMALL(IF(List<>\"\",ROW(INDIRECT(\"1:\"&ROWS(List)))),ROWS($1:192))),\"\")","v":""},{"$f":"IFERROR(VLOOKUP(B193,Inputs_Rec.!$DB$6:$DC$372,2,FALSE),\"\")","v":""},{"$f":"IFERROR(VLOOKUP(B193,Inputs_Rec.!$DD$6:$DE$372,2,FALSE),\"\")","v":""},null,null,"",{"$f":"IFERROR(VLOOKUP(G193,Inputs_Rec.!$DF$6:$DG$372,2,FALSE),\"\")","v":""},null,"",{"$f":"IFERROR(VLOOKUP(J193,Inputs_Rec.!$DH$6:$DI$372,2,FALSE),\"\")","v":""}]
[null,{"$f":"IFERROR(INDEX(List,SMALL(IF(List<>\"\",ROW(INDIRECT(\"1:\"&ROWS(List)))),ROWS($1:193))),\"\")","v":""},{"$f":"IFERROR(VLOOKUP(B194,Inputs_Rec.!$DB$6:$DC$372,2,FALSE),\"\")","v":""},{"$f":"IFERROR(VLOOKUP(B194,Inputs_Rec.!$DD$6:$DE$372,2,FALSE),\"\")","v":""},null,null,"",{"$f":"IFERROR(VLOOKUP(G194,Inputs_Rec.!$DF$6:$DG$372,2,FALSE),\"\")","v":""},null,"",{"$f":"IFERROR(VLOOKUP(J194,Inputs_Rec.!$DH$6:$DI$372,2,FALSE),\"\")","v":""}]
[null,{"$f":"IFERROR(INDEX(List,SMALL(IF(List<>\"\",ROW(INDIRECT(\"1:\"&ROWS(List)))),ROWS($1:194))),\"\")","v":""},{"$f":"IFERROR(VLOOKUP(B195,Inputs_Rec.!$DB$6:$DC$372,2,FALSE),\"\")","v":""},{"$f":"IFERROR(VLOOKUP(B195,Inputs_Rec.!$DD$6:$DE$372,2,FALSE),\"\")","v":""},null,null,"",{"$f":"IFERROR(VLOOKUP(G195,Inputs_Rec.!$DF$6:$DG$372,2,FALSE),\"\")","v":""},null,"",{"$f":"IFERROR(VLOOKUP(J195,Inputs_Rec.!$DH$6:$DI$372,2,FALSE),\"\")","v":""}]
[null,{"$f":"IFERROR(INDEX(List,SMALL(IF(List<>\"\",ROW(INDIRECT(\"1:\"&ROWS(List)))),ROWS($1:195))),\"\")","v":""},{"$f":"IFERROR(VLOOKUP(B196,Inputs_Rec.!$DB$6:$DC$372,2,FALSE),\"\")","v":""},{"$f":"IFERROR(VLOOKUP(B196,Inputs_Rec.!$DD$6:$DE$372,2,FALSE),\"\")","v":""},null,null,"",{"$f":"IFERROR(VLOOKUP(G196,Inputs_Rec.!$DF$6:$DG$372,2,FALSE),\"\")","v":""},null,"",{"$f":"IFERROR(VLOOKUP(J196,Inputs_Rec.!$DH$6:$DI$372,2,FALSE),\"\")","v":""}]
[null,{"$f":"IFERROR(INDEX(List,SMALL(IF(List<>\"\",ROW(INDIRECT(\"1:\"&ROWS(List)))),ROWS($1:196))),\"\")","v":""},{"$f":"IFERROR(VLOOKUP(B197,Inputs_Rec.!$DB$6:$DC$372,2,FALSE),\"\")","v":""},{"$f":"IFERROR(VLOOKUP(B197,Inputs_Rec.!$DD$6:$DE$372,2,FALSE),\"\")","v":""},null,null,{"$f":"B197","v":""},{"$f":"IFERROR(VLOOKUP(G197,Inputs_Rec.!$DF$6:$DG$372,2,FALSE),\"\")","v":""},null,{"$f":"G197","v":""},{"$f":"IFERROR(VLOOKUP(J197,Inputs_Rec.!$DH$6:$DI$372,2,FALSE),\"\")","v":""}]
[null,{"$f":"IFERROR(INDEX(List,SMALL(IF(List<>\"\",ROW(INDIRECT(\"1:\"&ROWS(List)))),ROWS($1:197))),\"\")","v":""},{"$f":"IFERROR(VLOOKUP(B198,Inputs_Rec.!$DB$6:$DC$372,2,FALSE),\"\")","v":""},{"$f":"IFERROR(VLOOKUP(B198,Inputs_Rec.!$DD$6:$DE$372,2,FALSE),\"\")","v":""},null,null,"",{"$f":"IFERROR(VLOOKUP(G198,Inputs_Rec.!$DF$6:$DG$372,2,FALSE),\"\")","v":""},null,"",{"$f":"IFERROR(VLOOKUP(J198,Inputs_Rec.!$DH$6:$DI$372,2,FALSE),\"\")","v":""}]
[null,{"$f":"IFERROR(INDEX(List,SMALL(IF(List<>\"\",ROW(INDIRECT(\"1:\"&ROWS(List)))),ROWS($1:198))),\"\")","v":""},{"$f":"IFERROR(VLOOKUP(B199,Inputs_Rec.!$DB$6:$DC$372,2,FALSE),\"\")","v":""},{"$f":"IFERROR(VLOOKUP(B199,Inputs_Rec.!$DD$6:$DE$372,2,FALSE),\"\")","v":""},null,null,"",{"$f":"IFERROR(VLOOKUP(G199,Inputs_Rec.!$DF$6:$DG$372,2,FALSE),\"\")","v":""},null,"",{"$f":"IFERROR(VLOOKUP(J199,Inputs_Rec.!$DH$6:$DI$372,2,FALSE),\"\")","v":""}]
[null,{"$f":"IFERROR(INDEX(List,SMALL(IF(List<>\"\",ROW(INDIRECT(\"1:\"&ROWS(List)))),ROWS($1:199))),\"\")","v":""},{"$f":"IFERROR(VLOOKUP(B200,Inputs_Rec.!$DB$6:$DC$372,2,FALSE),\"\")","v":""},{"$f":"IFERROR(VLOOKUP(B200,Inputs_Rec.!$DD$6:$DE$372,2,FALSE),\"\")","v":""},null,null,"",{"$f":"IFERROR(VLOOKUP(G200,Inputs_Rec.!$DF$6:$DG$372,2,FALSE),\"\")","v":""},null,"",{"$f":"IFERROR(VLOOKUP(J200,Inputs_Rec.!$DH$6:$DI$372,2,FALSE),\"\")","v":""}]
[null,{"$f":"IFERROR(INDEX(List,SMALL(IF(List<>\"\",ROW(INDIRECT(\"1:\"&ROWS(List)))),ROWS($1:200))),\"\")","v":""},{"$f":"IFERROR(VLOOKUP(B201,Inputs_Rec.!$DB$6:$DC$372,2,FALSE),\"\")","v":""},{"$f":"IFERROR(VLOOKUP(B201,Inputs_Rec.!$DD$6:$DE$372,2,FALSE),\"\")","v":""},null,null,"",{"$f":"IFERROR(VLOOKUP(G201,Inputs_Rec.!$DF$6:$DG$372,2,FALSE),\"\")","v":""},null,"",{"$f":"IFERROR(VLOOKUP(J201,Inputs_Rec.!$DH$6:$DI$372,2,FALSE),\"\")","v":""}]
[null,{"$f":"IFERROR(INDEX(List,SMALL(IF(List<>\"\",ROW(INDIRECT(\"1:\"&ROWS(List)))),ROWS($1:201))),\"\")","v":""},{"$f":"IFERROR(VLOOKUP(B202,Inputs_Rec.!$DB$6:$DC$372,2,FALSE),\"\")","v":""},{"$f":"IFERROR(VLOOKUP(B202,Inputs_Rec.!$DD$6:$DE$372,2,FALSE),\"\")","v":""},null,null,"",{"$f":"IFERROR(VLOOKUP(G202,Inputs_Rec.!$DF$6:$DG$372,2,FALSE),\"\")","v":""},null,"",{"$f":"IFERROR(VLOOKUP(J202,Inputs_Rec.!$DH$6:$DI$372,2,FALSE),\"\")","v":""}]
[null,{"$f":"IFERROR(INDEX(List,SMALL(IF(List<>\"\",ROW(INDIRECT(\"1:\"&ROWS(List)))),ROWS($1:202))),\"\")","v":""},{"$f":"IFERROR(VLOOKUP(B203,Inputs_Rec.!$DB$6:$DC$372,2,FALSE),\"\")","v":""},{"$f":"IFERROR(VLOOKUP(B203,Inputs_Rec.!$DD$6:$DE$372,2,FALSE),\"\")","v":""},null,null,"",{"$f":"IFERROR(VLOOKUP(G203,Inputs_Rec.!$DF$6:$DG$372,2,FALSE),\"\")","v":""},null,"",{"$f":"IFERROR(VLOOKUP(J203,Inputs_Rec.!$DH$6:$DI$372,2,FALSE),\"\")","v":""}]
[null,{"$f":"IFERROR(INDEX(List,SMALL(IF(List<>\"\",ROW(INDIRECT(\"1:\"&ROWS(List)))),ROWS($1:203))),\"\")","v":""},{"$f":"IFERROR(VLOOKUP(B204,Inputs_Rec.!$DB$6:$DC$372,2,FALSE),\"\")","v":""},{"$f":"IFERROR(VLOOKUP(B204,Inputs_Rec.!$DD$6:$DE$372,2,FALSE),\"\")","v":""},null,null,"",{"$f":"IFERROR(VLOOKUP(G204,Inputs_Rec.!$DF$6:$DG$372,2,FALSE),\"\")","v":""},null,"",{"$f":"IFERROR(VLOOKUP(J204,Inputs_Rec.!$DH$6:$DI$372,2,FALSE),\"\")","v":""}]
[null,{"$f":"IFERROR(INDEX(List,SMALL(IF(List<>\"\",ROW(INDIRECT(\"1:\"&ROWS(List)))),ROWS($1:204))),\"\")","v":""},{"$f":"IFERROR(VLOOKUP(B205,Inputs_Rec.!$DB$6:$DC$372,2,FALSE),\"\")","v":""},{"$f":"IFERROR(VLOOKUP(B205,Inputs_Rec.!$DD$6:$DE$372,2,FALSE),\"\")","v":""},null,null,"",{"$f":"IFERROR(VLOOKUP(G205,Inputs_Rec.!$DF$6:$DG$372,2,FALSE),\"\")","v":""},null,"",{"$f":"IFERROR(VLOOKUP(J205,Inputs_Rec.!$DH$6:$DI$372,2,FALSE),\"\")","v":""}]
[null,{"$f":"IFERROR(INDEX(List,SMALL(IF(List<>\"\",ROW(INDIRECT(\"1:\"&ROWS(List)))),ROWS($1:205))),\"\")","v":""},{"$f":"IFERROR(VLOOKUP(B206,Inputs_Rec.!$DB$6:$DC$372,2,FALSE),\"\")","v":""},{"$f":"IFERROR(VLOOKUP(B206,Inputs_Rec.!$DD$6:$DE$372,2,FALSE),\"\")","v":""},null,null,"",{"$f":"IFERROR(VLOOKUP(G206,Inputs_Rec.!$DF$6:$DG$372,2,FALSE),\"\")","v":""},null,"",{"$f":"IFERROR(VLOOKUP(J206,Inputs_Rec.!$DH$6:$DI$372,2,FALSE),\"\")","v":""}]
[null,{"$f":"IFERROR(INDEX(List,SMALL(IF(List<>\"\",ROW(INDIRECT(\"1:\"&ROWS(List)))),ROWS($1:206))),\"\")","v":""},{"$f":"IFERROR(VLOOKUP(B207,Inputs_Rec.!$DB$6:$DC$372,2,FALSE),\"\")","v":""},{"$f":"IFERROR(VLOOKUP(B207,Inputs_Rec.!$DD$6:$DE$372,2,FALSE),\"\")","v":""},null,null,"",{"$f":"IFERROR(VLOOKUP(G207,Inputs_Rec.!$DF$6:$DG$372,2,FALSE),\"\")","v":""},null,"",{"$f":"IFERROR(VLOOKUP(J207,Inputs_Rec.!$DH$6:$DI$372,2,FALSE),\"\")","v":""}]
[null,{"$f":"IFERROR(INDEX(List,SMALL(IF(List<>\"\",ROW(INDIRECT(\"1:\"&ROWS(List)))),ROWS($1:207))),\"\")","v":""},{"$f":"IFERROR(VLOOKUP(B208,Inputs_Rec.!$DB$6:$DC$372,2,FALSE),\"\")","v":""},{"$f":"IFERROR(VLOOKUP(B208,Inputs_Rec.!$DD$6:$DE$372,2,FALSE),\"\")","v":""},null,null,"",{"$f":"IFERROR(VLOOKUP(G208,Inputs_Rec.!$DF$6:$DG$372,2,FALSE),\"\")","v":""},null,"",{"$f":"IFERROR(VLOOKUP(J208,Inputs_Rec.!$DH$6:$DI$372,2,FALSE),\"\")","v":""}]
[null,{"$f":"IFERROR(INDEX(List,SMALL(IF(List<>\"\",ROW(INDIRECT(\"1:\"&ROWS(List)))),ROWS($1:208))),\"\")","v":""},{"$f":"IFERROR(VLOOKUP(B209,Inputs_Rec.!$DB$6:$DC$372,2,FALSE),\"\")","v":""},{"$f":"IFERROR(VLOOKUP(B209,Inputs_Rec.!$DD$6:$DE$372,2,FALSE),\"\")","v":""},null,null,"",{"$f":"IFERROR(VLOOKUP(G209,Inputs_Rec.!$DF$6:$DG$372,2,FALSE),\"\")","v":""},null,"",{"$f":"IFERROR(VLOOKUP(J209,Inputs_Rec.!$DH$6:$DI$372,2,FALSE),\"\")","v":""}]
[null,{"$f":"IFERROR(INDEX(List,SMALL(IF(List<>\"\",ROW(INDIRECT(\"1:\"&ROWS(List)))),ROWS($1:209))),\"\")","v":""},{"$f":"IFERROR(VLOOKUP(B210,Inputs_Rec.!$DB$6:$DC$372,2,FALSE),\"\")","v":""},{"$f":"IFERROR(VLOOKUP(B210,Inputs_Rec.!$DD$6:$DE$372,2,FALSE),\"\")","v":""},null,null,"",{"$f":"IFERROR(VLOOKUP(G210,Inputs_Rec.!$DF$6:$DG$372,2,FALSE),\"\")","v":""},null,"",{"$f":"IFERROR(VLOOKUP(J210,Inputs_Rec.!$DH$6:$DI$372,2,FALSE),\"\")","v":""}]
[null,{"$f":"IFERROR(INDEX(List,SMALL(IF(List<>\"\",ROW(INDIRECT(\"1:\"&ROWS(List)))),ROWS($1:210))),\"\")","v":""},{"$f":"IFERROR(VLOOKUP(B211,Inputs_Rec.!$DB$6:$DC$372,2,FALSE),\"\")","v":""},{"$f":"IFERROR(VLOOKUP(B211,Inputs_Rec.!$DD$6:$DE$372,2,FALSE),\"\")","v":""},null,null,"",{"$f":"IFERROR(VLOOKUP(G211,Inputs_Rec.!$DF$6:$DG$372,2,FALSE),\"\")","v":""},null,"",{"$f":"IFERROR(VLOOKUP(J211,Inputs_Rec.!$DH$6:$DI$372,2,FALSE),\"\")","v":""}]
[null,{"$f":"IFERROR(INDEX(List,SMALL(IF(List<>\"\",ROW(INDIRECT(\"1:\"&ROWS(List)))),ROWS($1:211))),\"\")","v":""},{"$f":"IFERROR(VLOOKUP(B212,Inputs_Rec.!$DB$6:$DC$372,2,FALSE),\"\")","v":""},{"$f":"IFERROR(VLOOKUP(B212,Inputs_Rec.!$DD$6:$DE$372,2,FALSE),\"\")","v":""},null,null,"",{"$f":"IFERROR(VLOOKUP(G212,Inputs_Rec.!$DF$6:$DG$372,2,FALSE),\"\")","v":""},null,"",{"$f":"IFERROR(VLOOKUP(J212,Inputs_Rec.!$DH$6:$DI$372,2,FALSE),\"\")","v":""}]
[null,{"$f":"IFERROR(INDEX(List,SMALL(IF(List<>\"\",ROW(INDIRECT(\"1:\"&ROWS(List)))),ROWS($1:212))),\"\")","v":""},{"$f":"IFERROR(VLOOKUP(B213,Inputs_Rec.!$DB$6:$DC$372,2,FALSE),\"\")","v":""},{"$f":"IFERROR(VLOOKUP(B213,Inputs_Rec.!$DD$6:$DE$372,2,FALSE),\"\")","v":""},null,null,"",{"$f":"IFERROR(VLOOKUP(G213,Inputs_Rec.!$DF$6:$DG$372,2,FALSE),\"\")","v":""},null,"",{"$f":"IFERROR(VLOOKUP(J213,Inputs_Rec.!$DH$6:$DI$372,2,FALSE),\"\")","v":""}]
[null,{"$f":"IFERROR(INDEX(List,SMALL(IF(List<>\"\",ROW(INDIRECT(\"1:\"&ROWS(List)))),ROWS($1:213))),\"\")","v":""},{"$f":"IFERROR(VLOOKUP(B214,Inputs_Rec.!$DB$6:$DC$372,2,FALSE),\"\")","v":""},{"$f":"IFERROR(VLOOKUP(B214,Inputs_Rec.!$DD$6:$DE$372,2,FALSE),\"\")","v":""},null,null,"",{"$f":"IFERROR(VLOOKUP(G214,Inputs_Rec.!$DF$6:$DG$372,2,FALSE),\"\")","v":""},null,"",{"$f":"IFERROR(VLOOKUP(J214,Inputs_Rec.!$DH$6:$DI$372,2,FALSE),\"\")","v":""}]
[null,{"$f":"IFERROR(INDEX(List,SMALL(IF(List<>\"\",ROW(INDIRECT(\"1:\"&ROWS(List)))),ROWS($1:214))),\"\")","v":""},{"$f":"IFERROR(VLOOKUP(B215,Inputs_Rec.!$DB$6:$DC$372,2,FALSE),\"\")","v":""},{"$f":"IFERROR(VLOOKUP(B215,Inputs_Rec.!$DD$6:$DE$372,2,FALSE),\"\")","v":""},null,null,"",{"$f":"IFERROR(VLOOKUP(G215,Inputs_Rec.!$DF$6:$DG$372,2,FALSE),\"\")","v":""},null,"",{"$f":"IFERROR(VLOOKUP(J215,Inputs_Rec.!$DH$6:$DI$372,2,FALSE),\"\")","v":""}]
[null,{"$f":"IFERROR(INDEX(List,SMALL(IF(List<>\"\",ROW(INDIRECT(\"1:\"&ROWS(List)))),ROWS($1:215))),\"\")","v":""},{"$f":"IFERROR(VLOOKUP(B216,Inputs_Rec.!$DB$6:$DC$372,2,FALSE),\"\")","v":""},{"$f":"IFERROR(VLOOKUP(B216,Inputs_Rec.!$DD$6:$DE$372,2,FALSE),\"\")","v":""},null,null,"",{"$f":"IFERROR(VLOOKUP(G216,Inputs_Rec.!$DF$6:$DG$372,2,FALSE),\"\")","v":""},null,"",{"$f":"IFERROR(VLOOKUP(J216,Inputs_Rec.!$DH$6:$DI$372,2,FALSE),\"\")","v":""}]
[null,{"$f":"IFERROR(INDEX(List,SMALL(IF(List<>\"\",ROW(INDIRECT(\"1:\"&ROWS(List)))),ROWS($1:216))),\"\")","v":""},{"$f":"IFERROR(VLOOKUP(B217,Inputs_Rec.!$DB$6:$DC$372,2,FALSE),\"\")","v":""},{"$f":"IFERROR(VLOOKUP(B217,Inputs_Rec.!$DD$6:$DE$372,2,FALSE),\"\")","v":""},null,null,"",{"$f":"IFERROR(VLOOKUP(G217,Inputs_Rec.!$DF$6:$DG$372,2,FALSE),\"\")","v":""},null,"",{"$f":"IFERROR(VLOOKUP(J217,Inputs_Rec.!$DH$6:$DI$372,2,FALSE),\"\")","v":""}]
[null,{"$f":"IFERROR(INDEX(List,SMALL(IF(List<>\"\",ROW(INDIRECT(\"1:\"&ROWS(List)))),ROWS($1:217))),\"\")","v":""},{"$f":"IFERROR(VLOOKUP(B218,Inputs_Rec.!$DB$6:$DC$372,2,FALSE),\"\")","v":""},{"$f":"IFERROR(VLOOKUP(B218,Inputs_Rec.!$DD$6:$DE$372,2,FALSE),\"\")","v":""},null,null,"",{"$f":"IFERROR(VLOOKUP(G218,Inputs_Rec.!$DF$6:$DG$372,2,FALSE),\"\")","v":""},null,"",{"$f":"IFERROR(VLOOKUP(J218,Inputs_Rec.!$DH$6:$DI$372,2,FALSE),\"\")","v":""}]
[null,{"$f":"IFERROR(INDEX(List,SMALL(IF(List<>\"\",ROW(INDIRECT(\"1:\"&ROWS(List)))),ROWS($1:218))),\"\")","v":""},{"$f":"IFERROR(VLOOKUP(B219,Inputs_Rec.!$DB$6:$DC$372,2,FALSE),\"\")","v":""},{"$f":"IFERROR(VLOOKUP(B219,Inputs_Rec.!$DD$6:$DE$372,2,FALSE),\"\")","v":""},null,null,"",{"$f":"IFERROR(VLOOKUP(G219,Inputs_Rec.!$DF$6:$DG$372,2,FALSE),\"\")","v":""},null,"",{"$f":"IFERROR(VLOOKUP(J219,Inputs_Rec.!$DH$6:$DI$372,2,FALSE),\"\")","v":""}]
[null,{"$f":"IFERROR(INDEX(List,SMALL(IF(List<>\"\",ROW(INDIRECT(\"1:\"&ROWS(List)))),ROWS($1:219))),\"\")","v":""},{"$f":"IFERROR(VLOOKUP(B220,Inputs_Rec.!$DB$6:$DC$372,2,FALSE),\"\")","v":""},{"$f":"IFERROR(VLOOKUP(B220,Inputs_Rec.!$DD$6:$DE$372,2,FALSE),\"\")","v":""},null,null,"",{"$f":"IFERROR(VLOOKUP(G220,Inputs_Rec.!$DF$6:$DG$372,2,FALSE),\"\")","v":""},null,"",{"$f":"IFERROR(VLOOKUP(J220,Inputs_Rec.!$DH$6:$DI$372,2,FALSE),\"\")","v":""}]
[null,{"$f":"IFERROR(INDEX(List,SMALL(IF(List<>\"\",ROW(INDIRECT(\"1:\"&ROWS(List)))),ROWS($1:220))),\"\")","v":""},{"$f":"IFERROR(VLOOKUP(B221,Inputs_Rec.!$DB$6:$DC$372,2,FALSE),\"\")","v":""},{"$f":"IFERROR(VLOOKUP(B221,Inputs_Rec.!$DD$6:$DE$372,2,FALSE),\"\")","v":""},null,null,"",{"$f":"IFERROR(VLOOKUP(G221,Inputs_Rec.!$DF$6:$DG$372,2,FALSE),\"\")","v":""},null,"",{"$f":"IFERROR(VLOOKUP(J221,Inputs_Rec.!$DH$6:$DI$372,2,FALSE),\"\")","v":""}]
[null,{"$f":"IFERROR(INDEX(List,SMALL(IF(List<>\"\",ROW(INDIRECT(\"1:\"&ROWS(List)))),ROWS($1:221))),\"\")","v":""},{"$f":"IFERROR(VLOOKUP(B222,Inputs_Rec.!$DB$6:$DC$372,2,FALSE),\"\")","v":""},{"$f":"IFERROR(VLOOKUP(B222,Inputs_Rec.!$DD$6:$DE$372,2,FALSE),\"\")","v":""},null,null,"",{"$f":"IFERROR(VLOOKUP(G222,Inputs_Rec.!$DF$6:$DG$372,2,FALSE),\"\")","v":""},null,"",{"$f":"IFERROR(VLOOKUP(J222,Inputs_Rec.!$DH$6:$DI$372,2,FALSE),\"\")","v":""}]
[null,{"$f":"IFERROR(INDEX(List,SMALL(IF(List<>\"\",ROW(INDIRECT(\"1:\"&ROWS(List)))),ROWS($1:222))),\"\")","v":""},{"$f":"IFERROR(VLOOKUP(B223,Inputs_Rec.!$DB$6:$DC$372,2,FALSE),\"\")","v":""},{"$f":"IFERROR(VLOOKUP(B223,Inputs_Rec.!$DD$6:$DE$372,2,FALSE),\"\")","v":""},null,null,"",{"$f":"IFERROR(VLOOKUP(G223,Inputs_Rec.!$DF$6:$DG$372,2,FALSE),\"\")","v":""},null,"",{"$f":"IFERROR(VLOOKUP(J223,Inputs_Rec.!$DH$6:$DI$372,2,FALSE),\"\")","v":""}]
[null,{"$f":"IFERROR(INDEX(List,SMALL(IF(List<>\"\",ROW(INDIRECT(\"1:\"&ROWS(List)))),ROWS($1:223))),\"\")","v":""},{"$f":"IFERROR(VLOOKUP(B224,Inputs_Rec.!$DB$6:$DC$372,2,FALSE),\"\")","v":""},{"$f":"IFERROR(VLOOKUP(B224,Inputs_Rec.!$DD$6:$DE$372,2,FALSE),\"\")","v":""},null,null,"",{"$f":"IFERROR(VLOOKUP(G224,Inputs_Rec.!$DF$6:$DG$372,2,FALSE),\"\")","v":""},null,"",{"$f":"IFERROR(VLOOKUP(J224,Inputs_Rec.!$DH$6:$DI$372,2,FALSE),\"\")","v":""}]
[null,{"$f":"IFERROR(INDEX(List,SMALL(IF(List<>\"\",ROW(INDIRECT(\"1:\"&ROWS(List)))),ROWS($1:224))),\"\")","v":""},{"$f":"IFERROR(VLOOKUP(B225,Inputs_Rec.!$DB$6:$DC$372,2,FALSE),\"\")","v":""},{"$f":"IFERROR(VLOOKUP(B225,Inputs_Rec.!$DD$6:$DE$372,2,FALSE),\"\")","v":""},null,null,"",{"$f":"IFERROR(VLOOKUP(G225,Inputs_Rec.!$DF$6:$DG$372,2,FALSE),\"\")","v":""},null,"",{"$f":"IFERROR(VLOOKUP(J225,Inputs_Rec.!$DH$6:$DI$372,2,FALSE),\"\")","v":""}]
[null,{"$f":"IFERROR(INDEX(List,SMALL(IF(List<>\"\",ROW(INDIRECT(\"1:\"&ROWS(List)))),ROWS($1:225))),\"\")","v":""},{"$f":"IFERROR(VLOOKUP(B226,Inputs_Rec.!$DB$6:$DC$372,2,FALSE),\"\")","v":""},{"$f":"IFERROR(VLOOKUP(B226,Inputs_Rec.!$DD$6:$DE$372,2,FALSE),\"\")","v":""},null,null,"",{"$f":"IFERROR(VLOOKUP(G226,Inputs_Rec.!$DF$6:$DG$372,2,FALSE),\"\")","v":""},null,"",{"$f":"IFERROR(VLOOKUP(J226,Inputs_Rec.!$DH$6:$DI$372,2,FALSE),\"\")","v":""}]
[null,{"$f":"IFERROR(INDEX(List,SMALL(IF(List<>\"\",ROW(INDIRECT(\"1:\"&ROWS(List)))),ROWS($1:226))),\"\")","v":""},{"$f":"IFERROR(VLOOKUP(B227,Inputs_Rec.!$DB$6:$DC$372,2,FALSE),\"\")","v":""},{"$f":"IFERROR(VLOOKUP(B227,Inputs_Rec.!$DD$6:$DE$372,2,FALSE),\"\")","v":""},null,null,"",{"$f":"IFERROR(VLOOKUP(G227,Inputs_Rec.!$DF$6:$DG$372,2,FALSE),\"\")","v":""},null,"",{"$f":"IFERROR(VLOOKUP(J227,Inputs_Rec.!$DH$6:$DI$372,2,FALSE),\"\")","v":""}]
[null,{"$f":"IFERROR(INDEX(List,SMALL(IF(List<>\"\",ROW(INDIRECT(\"1:\"&ROWS(List)))),ROWS($1:227))),\"\")","v":""},{"$f":"IFERROR(VLOOKUP(B228,Inputs_Rec.!$DB$6:$DC$372,2,FALSE),\"\")","v":""},{"$f":"IFERROR(VLOOKUP(B228,Inputs_Rec.!$DD$6:$DE$372,2,FALSE),\"\")","v":""},null,null,"",{"$f":"IFERROR(VLOOKUP(G228,Inputs_Rec.!$DF$6:$DG$372,2,FALSE),\"\")","v":""},null,"",{"$f":"IFERROR(VLOOKUP(J228,Inputs_Rec.!$DH$6:$DI$372,2,FALSE),\"\")","v":""}]
[null,{"$f":"IFERROR(INDEX(List,SMALL(IF(List<>\"\",ROW(INDIRECT(\"1:\"&ROWS(List)))),ROWS($1:228))),\"\")","v":""},{"$f":"IFERROR(VLOOKUP(B229,Inputs_Rec.!$DB$6:$DC$372,2,FALSE),\"\")","v":""},{"$f":"IFERROR(VLOOKUP(B229,Inputs_Rec.!$DD$6:$DE$372,2,FALSE),\"\")","v":""},null,null,"",{"$f":"IFERROR(VLOOKUP(G229,Inputs_Rec.!$DF$6:$DG$372,2,FALSE),\"\")","v":""},null,"",{"$f":"IFERROR(VLOOKUP(J229,Inputs_Rec.!$DH$6:$DI$372,2,FALSE),\"\")","v":""}]
[null,{"$f":"IFERROR(INDEX(List,SMALL(IF(List<>\"\",ROW(INDIRECT(\"1:\"&ROWS(List)))),ROWS($1:229))),\"\")","v":""},{"$f":"IFERROR(VLOOKUP(B230,Inputs_Rec.!$DB$6:$DC$372,2,FALSE),\"\")","v":""},{"$f":"IFERROR(VLOOKUP(B230,Inputs_Rec.!$DD$6:$DE$372,2,FALSE),\"\")","v":""},null,null,"",{"$f":"IFERROR(VLOOKUP(G230,Inputs_Rec.!$DF$6:$DG$372,2,FALSE),\"\")","v":""},null,"",{"$f":"IFERROR(VLOOKUP(J230,Inputs_Rec.!$DH$6:$DI$372,2,FALSE),\"\")","v":""}]
[null,{"$f":"IFERROR(INDEX(List,SMALL(IF(List<>\"\",ROW(INDIRECT(\"1:\"&ROWS(List)))),ROWS($1:230))),\"\")","v":""},{"$f":"IFERROR(VLOOKUP(B231,Inputs_Rec.!$DB$6:$DC$372,2,FALSE),\"\")","v":""},{"$f":"IFERROR(VLOOKUP(B231,Inputs_Rec.!$DD$6:$DE$372,2,FALSE),\"\")","v":""},null,null,"",{"$f":"IFERROR(VLOOKUP(G231,Inputs_Rec.!$DF$6:$DG$372,2,FALSE),\"\")","v":""},null,"",{"$f":"IFERROR(VLOOKUP(J231,Inputs_Rec.!$DH$6:$DI$372,2,FALSE),\"\")","v":""}]
[null,{"$f":"IFERROR(INDEX(List,SMALL(IF(List<>\"\",ROW(INDIRECT(\"1:\"&ROWS(List)))),ROWS($1:231))),\"\")","v":""},{"$f":"IFERROR(VLOOKUP(B232,Inputs_Rec.!$DB$6:$DC$372,2,FALSE),\"\")","v":""},{"$f":"IFERROR(VLOOKUP(B232,Inputs_Rec.!$DD$6:$DE$372,2,FALSE),\"\")","v":""},null,null,"",{"$f":"IFERROR(VLOOKUP(G232,Inputs_Rec.!$DF$6:$DG$372,2,FALSE),\"\")","v":""},null,"",{"$f":"IFERROR(VLOOKUP(J232,Inputs_Rec.!$DH$6:$DI$372,2,FALSE),\"\")","v":""}]
[null,{"$f":"IFERROR(INDEX(List,SMALL(IF(List<>\"\",ROW(INDIRECT(\"1:\"&ROWS(List)))),ROWS($1:232))),\"\")","v":""},{"$f":"IFERROR(VLOOKUP(B233,Inputs_Rec.!$DB$6:$DC$372,2,FALSE),\"\")","v":""},{"$f":"IFERROR(VLOOKUP(B233,Inputs_Rec.!$DD$6:$DE$372,2,FALSE),\"\")","v":""},null,null,"",{"$f":"IFERROR(VLOOKUP(G233,Inputs_Rec.!$DF$6:$DG$372,2,FALSE),\"\")","v":""},null,"",{"$f":"IFERROR(VLOOKUP(J233,Inputs_Rec.!$DH$6:$DI$372,2,FALSE),\"\")","v":""}]
[null,{"$f":"IFERROR(INDEX(List,SMALL(IF(List<>\"\",ROW(INDIRECT(\"1:\"&ROWS(List)))),ROWS($1:233))),\"\")","v":""},{"$f":"IFERROR(VLOOKUP(B234,Inputs_Rec.!$DB$6:$DC$372,2,FALSE),\"\")","v":""},{"$f":"IFERROR(VLOOKUP(B234,Inputs_Rec.!$DD$6:$DE$372,2,FALSE),\"\")","v":""},null,null,"",{"$f":"IFERROR(VLOOKUP(G234,Inputs_Rec.!$DF$6:$DG$372,2,FALSE),\"\")","v":""},null,"",{"$f":"IFERROR(VLOOKUP(J234,Inputs_Rec.!$DH$6:$DI$372,2,FALSE),\"\")","v":""}]
[null,{"$f":"IFERROR(INDEX(List,SMALL(IF(List<>\"\",ROW(INDIRECT(\"1:\"&ROWS(List)))),ROWS($1:234))),\"\")","v":""},{"$f":"IFERROR(VLOOKUP(B235,Inputs_Rec.!$DB$6:$DC$372,2,FALSE),\"\")","v":""},{"$f":"IFERROR(VLOOKUP(B235,Inputs_Rec.!$DD$6:$DE$372,2,FALSE),\"\")","v":""},null,null,"",{"$f":"IFERROR(VLOOKUP(G235,Inputs_Rec.!$DF$6:$DG$372,2,FALSE),\"\")","v":""},null,"",{"$f":"IFERROR(VLOOKUP(J235,Inputs_Rec.!$DH$6:$DI$372,2,FALSE),\"\")","v":""}]
[null,{"$f":"IFERROR(INDEX(List,SMALL(IF(List<>\"\",ROW(INDIRECT(\"1:\"&ROWS(List)))),ROWS($1:235))),\"\")","v":""},{"$f":"IFERROR(VLOOKUP(B236,Inputs_Rec.!$DB$6:$DC$372,2,FALSE),\"\")","v":""},{"$f":"IFERROR(VLOOKUP(B236,Inputs_Rec.!$DD$6:$DE$372,2,FALSE),\"\")","v":""},null,null,"",{"$f":"IFERROR(VLOOKUP(G236,Inputs_Rec.!$DF$6:$DG$372,2,FALSE),\"\")","v":""},null,"",{"$f":"IFERROR(VLOOKUP(J236,Inputs_Rec.!$DH$6:$DI$372,2,FALSE),\"\")","v":""}]
[null,{"$f":"IFERROR(INDEX(List,SMALL(IF(List<>\"\",ROW(INDIRECT(\"1:\"&ROWS(List)))),ROWS($1:236))),\"\")","v":""},{"$f":"IFERROR(VLOOKUP(B237,Inputs_Rec.!$DB$6:$DC$372,2,FALSE),\"\")","v":""},{"$f":"IFERROR(VLOOKUP(B237,Inputs_Rec.!$DD$6:$DE$372,2,FALSE),\"\")","v":""},null,null,"",{"$f":"IFERROR(VLOOKUP(G237,Inputs_Rec.!$DF$6:$DG$372,2,FALSE),\"\")","v":""},null,"",{"$f":"IFERROR(VLOOKUP(J237,Inputs_Rec.!$DH$6:$DI$372,2,FALSE),\"\")","v":""}]
[null,{"$f":"IFERROR(INDEX(List,SMALL(IF(List<>\"\",ROW(INDIRECT(\"1:\"&ROWS(List)))),ROWS($1:237))),\"\")","v":""},{"$f":"IFERROR(VLOOKUP(B238,Inputs_Rec.!$DB$6:$DC$372,2,FALSE),\"\")","v":""},{"$f":"IFERROR(VLOOKUP(B238,Inputs_Rec.!$DD$6:$DE$372,2,FALSE),\"\")","v":""},null,null,"",{"$f":"IFERROR(VLOOKUP(G238,Inputs_Rec.!$DF$6:$DG$372,2,FALSE),\"\")","v":""},null,"",{"$f":"IFERROR(VLOOKUP(J238,Inputs_Rec.!$DH$6:$DI$372,2,FALSE),\"\")","v":""}]
[null,{"$f":"IFERROR(INDEX(List,SMALL(IF(List<>\"\",ROW(INDIRECT(\"1:\"&ROWS(List)))),ROWS($1:238))),\"\")","v":""},{"$f":"IFERROR(VLOOKUP(B239,Inputs_Rec.!$DB$6:$DC$372,2,FALSE),\"\")","v":""},{"$f":"IFERROR(VLOOKUP(B239,Inputs_Rec.!$DD$6:$DE$372,2,FALSE),\"\")","v":""},null,null,"",{"$f":"IFERROR(VLOOKUP(G239,Inputs_Rec.!$DF$6:$DG$372,2,FALSE),\"\")","v":""},null,"",{"$f":"IFERROR(VLOOKUP(J239,Inputs_Rec.!$DH$6:$DI$372,2,FALSE),\"\")","v":""}]
[null,{"$f":"IFERROR(INDEX(List,SMALL(IF(List<>\"\",ROW(INDIRECT(\"1:\"&ROWS(List)))),ROWS($1:239))),\"\")","v":""},{"$f":"IFERROR(VLOOKUP(B240,Inputs_Rec.!$DB$6:$DC$372,2,FALSE),\"\")","v":""},{"$f":"IFERROR(VLOOKUP(B240,Inputs_Rec.!$DD$6:$DE$372,2,FALSE),\"\")","v":""},null,null,"",{"$f":"IFERROR(VLOOKUP(G240,Inputs_Rec.!$DF$6:$DG$372,2,FALSE),\"\")","v":""},null,"",{"$f":"IFERROR(VLOOKUP(J240,Inputs_Rec.!$DH$6:$DI$372,2,FALSE),\"\")","v":""}]
[null,{"$f":"IFERROR(INDEX(List,SMALL(IF(List<>\"\",ROW(INDIRECT(\"1:\"&ROWS(List)))),ROWS($1:240))),\"\")","v":""},{"$f":"IFERROR(VLOOKUP(B241,Inputs_Rec.!$DB$6:$DC$372,2,FALSE),\"\")","v":""},{"$f":"IFERROR(VLOOKUP(B241,Inputs_Rec.!$DD$6:$DE$372,2,FALSE),\"\")","v":""},null,null,"",{"$f":"IFERROR(VLOOKUP(G241,Inputs_Rec.!$DF$6:$DG$372,2,FALSE),\"\")","v":""},null,"",{"$f":"IFERROR(VLOOKUP(J241,Inputs_Rec.!$DH$6:$DI$372,2,FALSE),\"\")","v":""}]
[null,{"$f":"IFERROR(INDEX(List,SMALL(IF(List<>\"\",ROW(INDIRECT(\"1:\"&ROWS(List)))),ROWS($1:241))),\"\")","v":""},{"$f":"IFERROR(VLOOKUP(B242,Inputs_Rec.!$DB$6:$DC$372,2,FALSE),\"\")","v":""},{"$f":"IFERROR(VLOOKUP(B242,Inputs_Rec.!$DD$6:$DE$372,2,FALSE),\"\")","v":""},null,null,"",{"$f":"IFERROR(VLOOKUP(G242,Inputs_Rec.!$DF$6:$DG$372,2,FALSE),\"\")","v":""},null,"",{"$f":"IFERROR(VLOOKUP(J242,Inputs_Rec.!$DH$6:$DI$372,2,FALSE),\"\")","v":""}]
[null,{"$f":"IFERROR(INDEX(List,SMALL(IF(List<>\"\",ROW(INDIRECT(\"1:\"&ROWS(List)))),ROWS($1:242))),\"\")","v":""},{"$f":"IFERROR(VLOOKUP(B243,Inputs_Rec.!$DB$6:$DC$372,2,FALSE),\"\")","v":""},{"$f":"IFERROR(VLOOKUP(B243,Inputs_Rec.!$DD$6:$DE$372,2,FALSE),\"\")","v":""},null,null,"",{"$f":"IFERROR(VLOOKUP(G243,Inputs_Rec.!$DF$6:$DG$372,2,FALSE),\"\")","v":""},null,"",{"$f":"IFERROR(VLOOKUP(J243,Inputs_Rec.!$DH$6:$DI$372,2,FALSE),\"\")","v":""}]
[null,{"$f":"IFERROR(INDEX(List,SMALL(IF(List<>\"\",ROW(INDIRECT(\"1:\"&ROWS(List)))),ROWS($1:243))),\"\")","v":""},{"$f":"IFERROR(VLOOKUP(B244,Inputs_Rec.!$DB$6:$DC$372,2,FALSE),\"\")","v":""},{"$f":"IFERROR(VLOOKUP(B244,Inputs_Rec.!$DD$6:$DE$372,2,FALSE),\"\")","v":""},null,null,"",{"$f":"IFERROR(VLOOKUP(G244,Inputs_Rec.!$DF$6:$DG$372,2,FALSE),\"\")","v":""},null,"",{"$f":"IFERROR(VLOOKUP(J244,Inputs_Rec.!$DH$6:$DI$372,2,FALSE),\"\")","v":""}]
[null,{"$f":"IFERROR(INDEX(List,SMALL(IF(List<>\"\",ROW(INDIRECT(\"1:\"&ROWS(List)))),ROWS($1:244))),\"\")","v":""},{"$f":"IFERROR(VLOOKUP(B245,Inputs_Rec.!$DB$6:$DC$372,2,FALSE),\"\")","v":""},{"$f":"IFERROR(VLOOKUP(B245,Inputs_Rec.!$DD$6:$DE$372,2,FALSE),\"\")","v":""},null,null,"",{"$f":"IFERROR(VLOOKUP(G245,Inputs_Rec.!$DF$6:$DG$372,2,FALSE),\"\")","v":""},null,"",{"$f":"IFERROR(VLOOKUP(J245,Inputs_Rec.!$DH$6:$DI$372,2,FALSE),\"\")","v":""}]
[null,{"$f":"IFERROR(INDEX(List,SMALL(IF(List<>\"\",ROW(INDIRECT(\"1:\"&ROWS(List)))),ROWS($1:245))),\"\")","v":""},{"$f":"IFERROR(VLOOKUP(B246,Inputs_Rec.!$DB$6:$DC$372,2,FALSE),\"\")","v":""},{"$f":"IFERROR(VLOOKUP(B246,Inputs_Rec.!$DD$6:$DE$372,2,FALSE),\"\")","v":""},null,null,"",{"$f":"IFERROR(VLOOKUP(G246,Inputs_Rec.!$DF$6:$DG$372,2,FALSE),\"\")","v":""},null,"",{"$f":"IFERROR(VLOOKUP(J246,Inputs_Rec.!$DH$6:$DI$372,2,FALSE),\"\")","v":""}]
[null,{"$f":"IFERROR(INDEX(List,SMALL(IF(List<>\"\",ROW(INDIRECT(\"1:\"&ROWS(List)))),ROWS($1:246))),\"\")","v":""},{"$f":"IFERROR(VLOOKUP(B247,Inputs_Rec.!$DB$6:$DC$372,2,FALSE),\"\")","v":""},{"$f":"IFERROR(VLOOKUP(B247,Inputs_Rec.!$DD$6:$DE$372,2,FALSE),\"\")","v":""},null,null,"",{"$f":"IFERROR(VLOOKUP(G247,Inputs_Rec.!$DF$6:$DG$372,2,FALSE),\"\")","v":""},null,"",{"$f":"IFERROR(VLOOKUP(J247,Inputs_Rec.!$DH$6:$DI$372,2,FALSE),\"\")","v":""}]
[null,{"$f":"IFERROR(INDEX(List,SMALL(IF(List<>\"\",ROW(INDIRECT(\"1:\"&ROWS(List)))),ROWS($1:247))),\"\")","v":""},{"$f":"IFERROR(VLOOKUP(B248,Inputs_Rec.!$DB$6:$DC$372,2,FALSE),\"\")","v":""},{"$f":"IFERROR(VLOOKUP(B248,Inputs_Rec.!$DD$6:$DE$372,2,FALSE),\"\")","v":""},null,null,"",{"$f":"IFERROR(VLOOKUP(G248,Inputs_Rec.!$DF$6:$DG$372,2,FALSE),\"\")","v":""},null,"",{"$f":"IFERROR(VLOOKUP(J248,Inputs_Rec.!$DH$6:$DI$372,2,FALSE),\"\")","v":""}]
[null,{"$f":"IFERROR(INDEX(List,SMALL(IF(List<>\"\",ROW(INDIRECT(\"1:\"&ROWS(List)))),ROWS($1:248))),\"\")","v":""},{"$f":"IFERROR(VLOOKUP(B249,Inputs_Rec.!$DB$6:$DC$372,2,FALSE),\"\")","v":""},{"$f":"IFERROR(VLOOKUP(B249,Inputs_Rec.!$DD$6:$DE$372,2,FALSE),\"\")","v":""},null,null,"",{"$f":"IFERROR(VLOOKUP(G249,Inputs_Rec.!$DF$6:$DG$372,2,FALSE),\"\")","v":""},null,"",{"$f":"IFERROR(VLOOKUP(J249,Inputs_Rec.!$DH$6:$DI$372,2,FALSE),\"\")","v":""}]
[null,{"$f":"IFERROR(INDEX(List,SMALL(IF(List<>\"\",ROW(INDIRECT(\"1:\"&ROWS(List)))),ROWS($1:249))),\"\")","v":""},{"$f":"IFERROR(VLOOKUP(B250,Inputs_Rec.!$DB$6:$DC$372,2,FALSE),\"\")","v":""},{"$f":"IFERROR(VLOOKUP(B250,Inputs_Rec.!$DD$6:$DE$372,2,FALSE),\"\")","v":""},null,null,"",{"$f":"IFERROR(VLOOKUP(G250,Inputs_Rec.!$DF$6:$DG$372,2,FALSE),\"\")","v":""},null,"",{"$f":"IFERROR(VLOOKUP(J250,Inputs_Rec.!$DH$6:$DI$372,2,FALSE),\"\")","v":""}]
[null,{"$f":"IFERROR(INDEX(List,SMALL(IF(List<>\"\",ROW(INDIRECT(\"1:\"&ROWS(List)))),ROWS($1:250))),\"\")","v":""},{"$f":"IFERROR(VLOOKUP(B251,Inputs_Rec.!$DB$6:$DC$372,2,FALSE),\"\")","v":""},{"$f":"IFERROR(VLOOKUP(B251,Inputs_Rec.!$DD$6:$DE$372,2,FALSE),\"\")","v":""},null,null,"",{"$f":"IFERROR(VLOOKUP(G251,Inputs_Rec.!$DF$6:$DG$372,2,FALSE),\"\")","v":""},null,"",{"$f":"IFERROR(VLOOKUP(J251,Inputs_Rec.!$DH$6:$DI$372,2,FALSE),\"\")","v":""}]
[null,{"$f":"IFERROR(INDEX(List,SMALL(IF(List<>\"\",ROW(INDIRECT(\"1:\"&ROWS(List)))),ROWS($1:251))),\"\")","v":""},{"$f":"IFERROR(VLOOKUP(B252,Inputs_Rec.!$DB$6:$DC$372,2,FALSE),\"\")","v":""},{"$f":"IFERROR(VLOOKUP(B252,Inputs_Rec.!$DD$6:$DE$372,2,FALSE),\"\")","v":""},null,null,"",{"$f":"IFERROR(VLOOKUP(G252,Inputs_Rec.!$DF$6:$DG$372,2,FALSE),\"\")","v":""},null,"",{"$f":"IFERROR(VLOOKUP(J252,Inputs_Rec.!$DH$6:$DI$372,2,FALSE),\"\")","v":""}]
[null,{"$f":"IFERROR(INDEX(List,SMALL(IF(List<>\"\",ROW(INDIRECT(\"1:\"&ROWS(List)))),ROWS($1:252))),\"\")","v":""},{"$f":"IFERROR(VLOOKUP(B253,Inputs_Rec.!$DB$6:$DC$372,2,FALSE),\"\")","v":""},{"$f":"IFERROR(VLOOKUP(B253,Inputs_Rec.!$DD$6:$DE$372,2,FALSE),\"\")","v":""},null,null,"",{"$f":"IFERROR(VLOOKUP(G253,Inputs_Rec.!$DF$6:$DG$372,2,FALSE),\"\")","v":""},null,"",{"$f":"IFERROR(VLOOKUP(J253,Inputs_Rec.!$DH$6:$DI$372,2,FALSE),\"\")","v":""}]
[null,{"$f":"IFERROR(INDEX(List,SMALL(IF(List<>\"\",ROW(INDIRECT(\"1:\"&ROWS(List)))),ROWS($1:253))),\"\")","v":""},{"$f":"IFERROR(VLOOKUP(B254,Inputs_Rec.!$DB$6:$DC$372,2,FALSE),\"\")","v":""},{"$f":"IFERROR(VLOOKUP(B254,Inputs_Rec.!$DD$6:$DE$372,2,FALSE),\"\")","v":""},null,null,"",{"$f":"IFERROR(VLOOKUP(G254,Inputs_Rec.!$DF$6:$DG$372,2,FALSE),\"\")","v":""},null,"",{"$f":"IFERROR(VLOOKUP(J254,Inputs_Rec.!$DH$6:$DI$372,2,FALSE),\"\")","v":""}]
[null,{"$f":"IFERROR(INDEX(List,SMALL(IF(List<>\"\",ROW(INDIRECT(\"1:\"&ROWS(List)))),ROWS($1:254))),\"\")","v":""},{"$f":"IFERROR(VLOOKUP(B255,Inputs_Rec.!$DB$6:$DC$372,2,FALSE),\"\")","v":""},{"$f":"IFERROR(VLOOKUP(B255,Inputs_Rec.!$DD$6:$DE$372,2,FALSE),\"\")","v":""},null,null,"",{"$f":"IFERROR(VLOOKUP(G255,Inputs_Rec.!$DF$6:$DG$372,2,FALSE),\"\")","v":""},null,"",{"$f":"IFERROR(VLOOKUP(J255,Inputs_Rec.!$DH$6:$DI$372,2,FALSE),\"\")","v":""}]
[null,{"$f":"IFERROR(INDEX(List,SMALL(IF(List<>\"\",ROW(INDIRECT(\"1:\"&ROWS(List)))),ROWS($1:255))),\"\")","v":""},{"$f":"IFERROR(VLOOKUP(B256,Inputs_Rec.!$DB$6:$DC$372,2,FALSE),\"\")","v":""},{"$f":"IFERROR(VLOOKUP(B256,Inputs_Rec.!$DD$6:$DE$372,2,FALSE),\"\")","v":""},null,null,"",{"$f":"IFERROR(VLOOKUP(G256,Inputs_Rec.!$DF$6:$DG$372,2,FALSE),\"\")","v":""},null,"",{"$f":"IFERROR(VLOOKUP(J256,Inputs_Rec.!$DH$6:$DI$372,2,FALSE),\"\")","v":""}]
[null,{"$f":"IFERROR(INDEX(List,SMALL(IF(List<>\"\",ROW(INDIRECT(\"1:\"&ROWS(List)))),ROWS($1:256))),\"\")","v":""},{"$f":"IFERROR(VLOOKUP(B257,Inputs_Rec.!$DB$6:$DC$372,2,FALSE),\"\")","v":""},{"$f":"IFERROR(VLOOKUP(B257,Inputs_Rec.!$DD$6:$DE$372,2,FALSE),\"\")","v":""},null,null,"",{"$f":"IFERROR(VLOOKUP(G257,Inputs_Rec.!$DF$6:$DG$372,2,FALSE),\"\")","v":""},null,"",{"$f":"IFERROR(VLOOKUP(J257,Inputs_Rec.!$DH$6:$DI$372,2,FALSE),\"\")","v":""}]
[null,{"$f":"IFERROR(INDEX(List,SMALL(IF(List<>\"\",ROW(INDIRECT(\"1:\"&ROWS(List)))),ROWS($1:257))),\"\")","v":""},{"$f":"IFERROR(VLOOKUP(B258,Inputs_Rec.!$DB$6:$DC$372,2,FALSE),\"\")","v":""},{"$f":"IFERROR(VLOOKUP(B258,Inputs_Rec.!$DD$6:$DE$372,2,FALSE),\"\")","v":""},null,null,"",{"$f":"IFERROR(VLOOKUP(G258,Inputs_Rec.!$DF$6:$DG$372,2,FALSE),\"\")","v":""},null,"",{"$f":"IFERROR(VLOOKUP(J258,Inputs_Rec.!$DH$6:$DI$372,2,FALSE),\"\")","v":""}]
[null,{"$f":"IFERROR(INDEX(List,SMALL(IF(List<>\"\",ROW(INDIRECT(\"1:\"&ROWS(List)))),ROWS($1:258))),\"\")","v":""},{"$f":"IFERROR(VLOOKUP(B259,Inputs_Rec.!$DB$6:$DC$372,2,FALSE),\"\")","v":""},{"$f":"IFERROR(VLOOKUP(B259,Inputs_Rec.!$DD$6:$DE$372,2,FALSE),\"\")","v":""},null,null,"",{"$f":"IFERROR(VLOOKUP(G259,Inputs_Rec.!$DF$6:$DG$372,2,FALSE),\"\")","v":""},null,"",{"$f":"IFERROR(VLOOKUP(J259,Inputs_Rec.!$DH$6:$DI$372,2,FALSE),\"\")","v":""}]
[null,{"$f":"IFERROR(INDEX(List,SMALL(IF(List<>\"\",ROW(INDIRECT(\"1:\"&ROWS(List)))),ROWS($1:259))),\"\")","v":""},{"$f":"IFERROR(VLOOKUP(B260,Inputs_Rec.!$DB$6:$DC$372,2,FALSE),\"\")","v":""},{"$f":"IFERROR(VLOOKUP(B260,Inputs_Rec.!$DD$6:$DE$372,2,FALSE),\"\")","v":""},null,null,"",{"$f":"IFERROR(VLOOKUP(G260,Inputs_Rec.!$DF$6:$DG$372,2,FALSE),\"\")","v":""},null,"",{"$f":"IFERROR(VLOOKUP(J260,Inputs_Rec.!$DH$6:$DI$372,2,FALSE),\"\")","v":""}]
[null,{"$f":"IFERROR(INDEX(List,SMALL(IF(List<>\"\",ROW(INDIRECT(\"1:\"&ROWS(List)))),ROWS($1:260))),\"\")","v":""},{"$f":"IFERROR(VLOOKUP(B261,Inputs_Rec.!$DB$6:$DC$372,2,FALSE),\"\")","v":""},{"$f":"IFERROR(VLOOKUP(B261,Inputs_Rec.!$DD$6:$DE$372,2,FALSE),\"\")","v":""},null,null,{"$f":"B261","v":""},{"$f":"IFERROR(VLOOKUP(G261,Inputs_Rec.!$DF$6:$DG$372,2,FALSE),\"\")","v":""},null,{"$f":"G261","v":""},{"$f":"IFERROR(VLOOKUP(J261,Inputs_Rec.!$DH$6:$DI$372,2,FALSE),\"\")","v":""}]
[null,{"$f":"IFERROR(INDEX(List,SMALL(IF(List<>\"\",ROW(INDIRECT(\"1:\"&ROWS(List)))),ROWS($1:261))),\"\")","v":""},{"$f":"IFERROR(VLOOKUP(B262,Inputs_Rec.!$DB$6:$DC$372,2,FALSE),\"\")","v":""},{"$f":"IFERROR(VLOOKUP(B262,Inputs_Rec.!$DD$6:$DE$372,2,FALSE),\"\")","v":""},null,null,"",{"$f":"IFERROR(VLOOKUP(G262,Inputs_Rec.!$DF$6:$DG$372,2,FALSE),\"\")","v":""},null,"",{"$f":"IFERROR(VLOOKUP(J262,Inputs_Rec.!$DH$6:$DI$372,2,FALSE),\"\")","v":""}]
[null,{"$f":"IFERROR(INDEX(List,SMALL(IF(List<>\"\",ROW(INDIRECT(\"1:\"&ROWS(List)))),ROWS($1:262))),\"\")","v":""},{"$f":"IFERROR(VLOOKUP(B263,Inputs_Rec.!$DB$6:$DC$372,2,FALSE),\"\")","v":""},{"$f":"IFERROR(VLOOKUP(B263,Inputs_Rec.!$DD$6:$DE$372,2,FALSE),\"\")","v":""},null,null,"",{"$f":"IFERROR(VLOOKUP(G263,Inputs_Rec.!$DF$6:$DG$372,2,FALSE),\"\")","v":""},null,"",{"$f":"IFERROR(VLOOKUP(J263,Inputs_Rec.!$DH$6:$DI$372,2,FALSE),\"\")","v":""}]
[null,{"$f":"IFERROR(INDEX(List,SMALL(IF(List<>\"\",ROW(INDIRECT(\"1:\"&ROWS(List)))),ROWS($1:263))),\"\")","v":""},{"$f":"IFERROR(VLOOKUP(B264,Inputs_Rec.!$DB$6:$DC$372,2,FALSE),\"\")","v":""},{"$f":"IFERROR(VLOOKUP(B264,Inputs_Rec.!$DD$6:$DE$372,2,FALSE),\"\")","v":""},null,null,"",{"$f":"IFERROR(VLOOKUP(G264,Inputs_Rec.!$DF$6:$DG$372,2,FALSE),\"\")","v":""},null,"",{"$f":"IFERROR(VLOOKUP(J264,Inputs_Rec.!$DH$6:$DI$372,2,FALSE),\"\")","v":""}]
[null,{"$f":"IFERROR(INDEX(List,SMALL(IF(List<>\"\",ROW(INDIRECT(\"1:\"&ROWS(List)))),ROWS($1:264))),\"\")","v":""},{"$f":"IFERROR(VLOOKUP(B265,Inputs_Rec.!$DB$6:$DC$372,2,FALSE),\"\")","v":""},{"$f":"IFERROR(VLOOKUP(B265,Inputs_Rec.!$DD$6:$DE$372,2,FALSE),\"\")","v":""},null,null,"",{"$f":"IFERROR(VLOOKUP(G265,Inputs_Rec.!$DF$6:$DG$372,2,FALSE),\"\")","v":""},null,"",{"$f":"IFERROR(VLOOKUP(J265,Inputs_Rec.!$DH$6:$DI$372,2,FALSE),\"\")","v":""}]
[null,{"$f":"IFERROR(INDEX(List,SMALL(IF(List<>\"\",ROW(INDIRECT(\"1:\"&ROWS(List)))),ROWS($1:265))),\"\")","v":""},{"$f":"IFERROR(VLOOKUP(B266,Inputs_Rec.!$DB$6:$DC$372,2,FALSE),\"\")","v":""},{"$f":"IFERROR(VLOOKUP(B266,Inputs_Rec.!$DD$6:$DE$372,2,FALSE),\"\")","v":""},null,null,"",{"$f":"IFERROR(VLOOKUP(G266,Inputs_Rec.!$DF$6:$DG$372,2,FALSE),\"\")","v":""},null,"",{"$f":"IFERROR(VLOOKUP(J266,Inputs_Rec.!$DH$6:$DI$372,2,FALSE),\"\")","v":""}]
[null,{"$f":"IFERROR(INDEX(List,SMALL(IF(List<>\"\",ROW(INDIRECT(\"1:\"&ROWS(List)))),ROWS($1:266))),\"\")","v":""},{"$f":"IFERROR(VLOOKUP(B267,Inputs_Rec.!$DB$6:$DC$372,2,FALSE),\"\")","v":""},{"$f":"IFERROR(VLOOKUP(B267,Inputs_Rec.!$DD$6:$DE$372,2,FALSE),\"\")","v":""},null,null,"",{"$f":"IFERROR(VLOOKUP(G267,Inputs_Rec.!$DF$6:$DG$372,2,FALSE),\"\")","v":""},null,"",{"$f":"IFERROR(VLOOKUP(J267,Inputs_Rec.!$DH$6:$DI$372,2,FALSE),\"\")","v":""}]
[null,{"$f":"IFERROR(INDEX(List,SMALL(IF(List<>\"\",ROW(INDIRECT(\"1:\"&ROWS(List)))),ROWS($1:267))),\"\")","v":""},{"$f":"IFERROR(VLOOKUP(B268,Inputs_Rec.!$DB$6:$DC$372,2,FALSE),\"\")","v":""},{"$f":"IFERROR(VLOOKUP(B268,Inputs_Rec.!$DD$6:$DE$372,2,FALSE),\"\")","v":""},null,null,"",{"$f":"IFERROR(VLOOKUP(G268,Inputs_Rec.!$DF$6:$DG$372,2,FALSE),\"\")","v":""},null,"",{"$f":"IFERROR(VLOOKUP(J268,Inputs_Rec.!$DH$6:$DI$372,2,FALSE),\"\")","v":""}]
[null,{"$f":"IFERROR(INDEX(List,SMALL(IF(List<>\"\",ROW(INDIRECT(\"1:\"&ROWS(List)))),ROWS($1:268))),\"\")","v":""},{"$f":"IFERROR(VLOOKUP(B269,Inputs_Rec.!$DB$6:$DC$372,2,FALSE),\"\")","v":""},{"$f":"IFERROR(VLOOKUP(B269,Inputs_Rec.!$DD$6:$DE$372,2,FALSE),\"\")","v":""},null,null,"",{"$f":"IFERROR(VLOOKUP(G269,Inputs_Rec.!$DF$6:$DG$372,2,FALSE),\"\")","v":""},null,"",{"$f":"IFERROR(VLOOKUP(J269,Inputs_Rec.!$DH$6:$DI$372,2,FALSE),\"\")","v":""}]
[null,{"$f":"IFERROR(INDEX(List,SMALL(IF(List<>\"\",ROW(INDIRECT(\"1:\"&ROWS(List)))),ROWS($1:269))),\"\")","v":""},{"$f":"IFERROR(VLOOKUP(B270,Inputs_Rec.!$DB$6:$DC$372,2,FALSE),\"\")","v":""},{"$f":"IFERROR(VLOOKUP(B270,Inputs_Rec.!$DD$6:$DE$372,2,FALSE),\"\")","v":""},null,null,"",{"$f":"IFERROR(VLOOKUP(G270,Inputs_Rec.!$DF$6:$DG$372,2,FALSE),\"\")","v":""},null,"",{"$f":"IFERROR(VLOOKUP(J270,Inputs_Rec.!$DH$6:$DI$372,2,FALSE),\"\")","v":""}]
[null,{"$f":"IFERROR(INDEX(List,SMALL(IF(List<>\"\",ROW(INDIRECT(\"1:\"&ROWS(List)))),ROWS($1:270))),\"\")","v":""},{"$f":"IFERROR(VLOOKUP(B271,Inputs_Rec.!$DB$6:$DC$372,2,FALSE),\"\")","v":""},{"$f":"IFERROR(VLOOKUP(B271,Inputs_Rec.!$DD$6:$DE$372,2,FALSE),\"\")","v":""},null,null,"",{"$f":"IFERROR(VLOOKUP(G271,Inputs_Rec.!$DF$6:$DG$372,2,FALSE),\"\")","v":""},null,"",{"$f":"IFERROR(VLOOKUP(J271,Inputs_Rec.!$DH$6:$DI$372,2,FALSE),\"\")","v":""}]
[null,{"$f":"IFERROR(INDEX(List,SMALL(IF(List<>\"\",ROW(INDIRECT(\"1:\"&ROWS(List)))),ROWS($1:271))),\"\")","v":""},{"$f":"IFERROR(VLOOKUP(B272,Inputs_Rec.!$DB$6:$DC$372,2,FALSE),\"\")","v":""},{"$f":"IFERROR(VLOOKUP(B272,Inputs_Rec.!$DD$6:$DE$372,2,FALSE),\"\")","v":""},null,null,"",{"$f":"IFERROR(VLOOKUP(G272,Inputs_Rec.!$DF$6:$DG$372,2,FALSE),\"\")","v":""},null,"",{"$f":"IFERROR(VLOOKUP(J272,Inputs_Rec.!$DH$6:$DI$372,2,FALSE),\"\")","v":""}]
[null,{"$f":"IFERROR(INDEX(List,SMALL(IF(List<>\"\",ROW(INDIRECT(\"1:\"&ROWS(List)))),ROWS($1:272))),\"\")","v":""},{"$f":"IFERROR(VLOOKUP(B273,Inputs_Rec.!$DB$6:$DC$372,2,FALSE),\"\")","v":""},{"$f":"IFERROR(VLOOKUP(B273,Inputs_Rec.!$DD$6:$DE$372,2,FALSE),\"\")","v":""},null,null,"",{"$f":"IFERROR(VLOOKUP(G273,Inputs_Rec.!$DF$6:$DG$372,2,FALSE),\"\")","v":""},null,"",{"$f":"IFERROR(VLOOKUP(J273,Inputs_Rec.!$DH$6:$DI$372,2,FALSE),\"\")","v":""}]
[null,{"$f":"IFERROR(INDEX(List,SMALL(IF(List<>\"\",ROW(INDIRECT(\"1:\"&ROWS(List)))),ROWS($1:273))),\"\")","v":""},{"$f":"IFERROR(VLOOKUP(B274,Inputs_Rec.!$DB$6:$DC$372,2,FALSE),\"\")","v":""},{"$f":"IFERROR(VLOOKUP(B274,Inputs_Rec.!$DD$6:$DE$372,2,FALSE),\"\")","v":""},null,null,"",{"$f":"IFERROR(VLOOKUP(G274,Inputs_Rec.!$DF$6:$DG$372,2,FALSE),\"\")","v":""},null,"",{"$f":"IFERROR(VLOOKUP(J274,Inputs_Rec.!$DH$6:$DI$372,2,FALSE),\"\")","v":""}]
[null,{"$f":"IFERROR(INDEX(List,SMALL(IF(List<>\"\",ROW(INDIRECT(\"1:\"&ROWS(List)))),ROWS($1:274))),\"\")","v":""},{"$f":"IFERROR(VLOOKUP(B275,Inputs_Rec.!$DB$6:$DC$372,2,FALSE),\"\")","v":""},{"$f":"IFERROR(VLOOKUP(B275,Inputs_Rec.!$DD$6:$DE$372,2,FALSE),\"\")","v":""},null,null,"",{"$f":"IFERROR(VLOOKUP(G275,Inputs_Rec.!$DF$6:$DG$372,2,FALSE),\"\")","v":""},null,"",{"$f":"IFERROR(VLOOKUP(J275,Inputs_Rec.!$DH$6:$DI$372,2,FALSE),\"\")","v":""}]
[null,{"$f":"IFERROR(INDEX(List,SMALL(IF(List<>\"\",ROW(INDIRECT(\"1:\"&ROWS(List)))),ROWS($1:275))),\"\")","v":""},{"$f":"IFERROR(VLOOKUP(B276,Inputs_Rec.!$DB$6:$DC$372,2,FALSE),\"\")","v":""},{"$f":"IFERROR(VLOOKUP(B276,Inputs_Rec.!$DD$6:$DE$372,2,FALSE),\"\")","v":""},null,null,"",{"$f":"IFERROR(VLOOKUP(G276,Inputs_Rec.!$DF$6:$DG$372,2,FALSE),\"\")","v":""},null,"",{"$f":"IFERROR(VLOOKUP(J276,Inputs_Rec.!$DH$6:$DI$372,2,FALSE),\"\")","v":""}]
[null,{"$f":"IFERROR(INDEX(List,SMALL(IF(List<>\"\",ROW(INDIRECT(\"1:\"&ROWS(List)))),ROWS($1:276))),\"\")","v":""},{"$f":"IFERROR(VLOOKUP(B277,Inputs_Rec.!$DB$6:$DC$372,2,FALSE),\"\")","v":""},{"$f":"IFERROR(VLOOKUP(B277,Inputs_Rec.!$DD$6:$DE$372,2,FALSE),\"\")","v":""},null,null,"",{"$f":"IFERROR(VLOOKUP(G277,Inputs_Rec.!$DF$6:$DG$372,2,FALSE),\"\")","v":""},null,"",{"$f":"IFERROR(VLOOKUP(J277,Inputs_Rec.!$DH$6:$DI$372,2,FALSE),\"\")","v":""}]
[null,{"$f":"IFERROR(INDEX(List,SMALL(IF(List<>\"\",ROW(INDIRECT(\"1:\"&ROWS(List)))),ROWS($1:277))),\"\")","v":""},{"$f":"IFERROR(VLOOKUP(B278,Inputs_Rec.!$DB$6:$DC$372,2,FALSE),\"\")","v":""},{"$f":"IFERROR(VLOOKUP(B278,Inputs_Rec.!$DD$6:$DE$372,2,FALSE),\"\")","v":""},null,null,"",{"$f":"IFERROR(VLOOKUP(G278,Inputs_Rec.!$DF$6:$DG$372,2,FALSE),\"\")","v":""},null,"",{"$f":"IFERROR(VLOOKUP(J278,Inputs_Rec.!$DH$6:$DI$372,2,FALSE),\"\")","v":""}]
[null,{"$f":"IFERROR(INDEX(List,SMALL(IF(List<>\"\",ROW(INDIRECT(\"1:\"&ROWS(List)))),ROWS($1:278))),\"\")","v":""},{"$f":"IFERROR(VLOOKUP(B279,Inputs_Rec.!$DB$6:$DC$372,2,FALSE),\"\")","v":""},{"$f":"IFERROR(VLOOKUP(B279,Inputs_Rec.!$DD$6:$DE$372,2,FALSE),\"\")","v":""},null,null,"",{"$f":"IFERROR(VLOOKUP(G279,Inputs_Rec.!$DF$6:$DG$372,2,FALSE),\"\")","v":""},null,"",{"$f":"IFERROR(VLOOKUP(J279,Inputs_Rec.!$DH$6:$DI$372,2,FALSE),\"\")","v":""}]
[null,{"$f":"IFERROR(INDEX(List,SMALL(IF(List<>\"\",ROW(INDIRECT(\"1:\"&ROWS(List)))),ROWS($1:279))),\"\")","v":""},{"$f":"IFERROR(VLOOKUP(B280,Inputs_Rec.!$DB$6:$DC$372,2,FALSE),\"\")","v":""},{"$f":"IFERROR(VLOOKUP(B280,Inputs_Rec.!$DD$6:$DE$372,2,FALSE),\"\")","v":""},null,null,"",{"$f":"IFERROR(VLOOKUP(G280,Inputs_Rec.!$DF$6:$DG$372,2,FALSE),\"\")","v":""},null,"",{"$f":"IFERROR(VLOOKUP(J280,Inputs_Rec.!$DH$6:$DI$372,2,FALSE),\"\")","v":""}]
[null,{"$f":"IFERROR(INDEX(List,SMALL(IF(List<>\"\",ROW(INDIRECT(\"1:\"&ROWS(List)))),ROWS($1:280))),\"\")","v":""},{"$f":"IFERROR(VLOOKUP(B281,Inputs_Rec.!$DB$6:$DC$372,2,FALSE),\"\")","v":""},{"$f":"IFERROR(VLOOKUP(B281,Inputs_Rec.!$DD$6:$DE$372,2,FALSE),\"\")","v":""},null,null,"",{"$f":"IFERROR(VLOOKUP(G281,Inputs_Rec.!$DF$6:$DG$372,2,FALSE),\"\")","v":""},null,"",{"$f":"IFERROR(VLOOKUP(J281,Inputs_Rec.!$DH$6:$DI$372,2,FALSE),\"\")","v":""}]
[null,{"$f":"IFERROR(INDEX(List,SMALL(IF(List<>\"\",ROW(INDIRECT(\"1:\"&ROWS(List)))),ROWS($1:281))),\"\")","v":""},{"$f":"IFERROR(VLOOKUP(B282,Inputs_Rec.!$DB$6:$DC$372,2,FALSE),\"\")","v":""},{"$f":"IFERROR(VLOOKUP(B282,Inputs_Rec.!$DD$6:$DE$372,2,FALSE),\"\")","v":""},null,null,"",{"$f":"IFERROR(VLOOKUP(G282,Inputs_Rec.!$DF$6:$DG$372,2,FALSE),\"\")","v":""},null,"",{"$f":"IFERROR(VLOOKUP(J282,Inputs_Rec.!$DH$6:$DI$372,2,FALSE),\"\")","v":""}]
[null,{"$f":"IFERROR(INDEX(List,SMALL(IF(List<>\"\",ROW(INDIRECT(\"1:\"&ROWS(List)))),ROWS($1:282))),\"\")","v":""},{"$f":"IFERROR(VLOOKUP(B283,Inputs_Rec.!$DB$6:$DC$372,2,FALSE),\"\")","v":""},{"$f":"IFERROR(VLOOKUP(B283,Inputs_Rec.!$DD$6:$DE$372,2,FALSE),\"\")","v":""},null,null,"",{"$f":"IFERROR(VLOOKUP(G283,Inputs_Rec.!$DF$6:$DG$372,2,FALSE),\"\")","v":""},null,"",{"$f":"IFERROR(VLOOKUP(J283,Inputs_Rec.!$DH$6:$DI$372,2,FALSE),\"\")","v":""}]
[null,{"$f":"IFERROR(INDEX(List,SMALL(IF(List<>\"\",ROW(INDIRECT(\"1:\"&ROWS(List)))),ROWS($1:283))),\"\")","v":""},{"$f":"IFERROR(VLOOKUP(B284,Inputs_Rec.!$DB$6:$DC$372,2,FALSE),\"\")","v":""},{"$f":"IFERROR(VLOOKUP(B284,Inputs_Rec.!$DD$6:$DE$372,2,FALSE),\"\")","v":""},null,null,"",{"$f":"IFERROR(VLOOKUP(G284,Inputs_Rec.!$DF$6:$DG$372,2,FALSE),\"\")","v":""},null,"",{"$f":"IFERROR(VLOOKUP(J284,Inputs_Rec.!$DH$6:$DI$372,2,FALSE),\"\")","v":""}]
[null,{"$f":"IFERROR(INDEX(List,SMALL(IF(List<>\"\",ROW(INDIRECT(\"1:\"&ROWS(List)))),ROWS($1:284))),\"\")","v":""},{"$f":"IFERROR(VLOOKUP(B285,Inputs_Rec.!$DB$6:$DC$372,2,FALSE),\"\")","v":""},{"$f":"IFERROR(VLOOKUP(B285,Inputs_Rec.!$DD$6:$DE$372,2,FALSE),\"\")","v":""},null,null,"",{"$f":"IFERROR(VLOOKUP(G285,Inputs_Rec.!$DF$6:$DG$372,2,FALSE),\"\")","v":""},null,"",{"$f":"IFERROR(VLOOKUP(J285,Inputs_Rec.!$DH$6:$DI$372,2,FALSE),\"\")","v":""}]
[null,{"$f":"IFERROR(INDEX(List,SMALL(IF(List<>\"\",ROW(INDIRECT(\"1:\"&ROWS(List)))),ROWS($1:285))),\"\")","v":""},{"$f":"IFERROR(VLOOKUP(B286,Inputs_Rec.!$DB$6:$DC$372,2,FALSE),\"\")","v":""},{"$f":"IFERROR(VLOOKUP(B286,Inputs_Rec.!$DD$6:$DE$372,2,FALSE),\"\")","v":""},null,null,"",{"$f":"IFERROR(VLOOKUP(G286,Inputs_Rec.!$DF$6:$DG$372,2,FALSE),\"\")","v":""},null,"",{"$f":"IFERROR(VLOOKUP(J286,Inputs_Rec.!$DH$6:$DI$372,2,FALSE),\"\")","v":""}]
[null,{"$f":"IFERROR(INDEX(List,SMALL(IF(List<>\"\",ROW(INDIRECT(\"1:\"&ROWS(List)))),ROWS($1:286))),\"\")","v":""},{"$f":"IFERROR(VLOOKUP(B287,Inputs_Rec.!$DB$6:$DC$372,2,FALSE),\"\")","v":""},{"$f":"IFERROR(VLOOKUP(B287,Inputs_Rec.!$DD$6:$DE$372,2,FALSE),\"\")","v":""},null,null,"",{"$f":"IFERROR(VLOOKUP(G287,Inputs_Rec.!$DF$6:$DG$372,2,FALSE),\"\")","v":""},null,"",{"$f":"IFERROR(VLOOKUP(J287,Inputs_Rec.!$DH$6:$DI$372,2,FALSE),\"\")","v":""}]
[null,{"$f":"IFERROR(INDEX(List,SMALL(IF(List<>\"\",ROW(INDIRECT(\"1:\"&ROWS(List)))),ROWS($1:287))),\"\")","v":""},{"$f":"IFERROR(VLOOKUP(B288,Inputs_Rec.!$DB$6:$DC$372,2,FALSE),\"\")","v":""},{"$f":"IFERROR(VLOOKUP(B288,Inputs_Rec.!$DD$6:$DE$372,2,FALSE),\"\")","v":""},null,null,"",{"$f":"IFERROR(VLOOKUP(G288,Inputs_Rec.!$DF$6:$DG$372,2,FALSE),\"\")","v":""},null,"",{"$f":"IFERROR(VLOOKUP(J288,Inputs_Rec.!$DH$6:$DI$372,2,FALSE),\"\")","v":""}]
[null,{"$f":"IFERROR(INDEX(List,SMALL(IF(List<>\"\",ROW(INDIRECT(\"1:\"&ROWS(List)))),ROWS($1:288))),\"\")","v":""},{"$f":"IFERROR(VLOOKUP(B289,Inputs_Rec.!$DB$6:$DC$372,2,FALSE),\"\")","v":""},{"$f":"IFERROR(VLOOKUP(B289,Inputs_Rec.!$DD$6:$DE$372,2,FALSE),\"\")","v":""},null,null,"",{"$f":"IFERROR(VLOOKUP(G289,Inputs_Rec.!$DF$6:$DG$372,2,FALSE),\"\")","v":""},null,"",{"$f":"IFERROR(VLOOKUP(J289,Inputs_Rec.!$DH$6:$DI$372,2,FALSE),\"\")","v":""}]
[null,{"$f":"IFERROR(INDEX(List,SMALL(IF(List<>\"\",ROW(INDIRECT(\"1:\"&ROWS(List)))),ROWS($1:289))),\"\")","v":""},{"$f":"IFERROR(VLOOKUP(B290,Inputs_Rec.!$DB$6:$DC$372,2,FALSE),\"\")","v":""},{"$f":"IFERROR(VLOOKUP(B290,Inputs_Rec.!$DD$6:$DE$372,2,FALSE),\"\")","v":""},null,null,"",{"$f":"IFERROR(VLOOKUP(G290,Inputs_Rec.!$DF$6:$DG$372,2,FALSE),\"\")","v":""},null,"",{"$f":"IFERROR(VLOOKUP(J290,Inputs_Rec.!$DH$6:$DI$372,2,FALSE),\"\")","v":""}]
[null,{"$f":"IFERROR(INDEX(List,SMALL(IF(List<>\"\",ROW(INDIRECT(\"1:\"&ROWS(List)))),ROWS($1:290))),\"\")","v":""},{"$f":"IFERROR(VLOOKUP(B291,Inputs_Rec.!$DB$6:$DC$372,2,FALSE),\"\")","v":""},{"$f":"IFERROR(VLOOKUP(B291,Inputs_Rec.!$DD$6:$DE$372,2,FALSE),\"\")","v":""},null,null,"",{"$f":"IFERROR(VLOOKUP(G291,Inputs_Rec.!$DF$6:$DG$372,2,FALSE),\"\")","v":""},null,"",{"$f":"IFERROR(VLOOKUP(J291,Inputs_Rec.!$DH$6:$DI$372,2,FALSE),\"\")","v":""}]
[null,{"$f":"IFERROR(INDEX(List,SMALL(IF(List<>\"\",ROW(INDIRECT(\"1:\"&ROWS(List)))),ROWS($1:291))),\"\")","v":""},{"$f":"IFERROR(VLOOKUP(B292,Inputs_Rec.!$DB$6:$DC$372,2,FALSE),\"\")","v":""},{"$f":"IFERROR(VLOOKUP(B292,Inputs_Rec.!$DD$6:$DE$372,2,FALSE),\"\")","v":""},null,null,"",{"$f":"IFERROR(VLOOKUP(G292,Inputs_Rec.!$DF$6:$DG$372,2,FALSE),\"\")","v":""},null,"",{"$f":"IFERROR(VLOOKUP(J292,Inputs_Rec.!$DH$6:$DI$372,2,FALSE),\"\")","v":""}]
[null,{"$f":"IFERROR(INDEX(List,SMALL(IF(List<>\"\",ROW(INDIRECT(\"1:\"&ROWS(List)))),ROWS($1:292))),\"\")","v":""},{"$f":"IFERROR(VLOOKUP(B293,Inputs_Rec.!$DB$6:$DC$372,2,FALSE),\"\")","v":""},{"$f":"IFERROR(VLOOKUP(B293,Inputs_Rec.!$DD$6:$DE$372,2,FALSE),\"\")","v":""},null,null,"",{"$f":"IFERROR(VLOOKUP(G293,Inputs_Rec.!$DF$6:$DG$372,2,FALSE),\"\")","v":""},null,"",{"$f":"IFERROR(VLOOKUP(J293,Inputs_Rec.!$DH$6:$DI$372,2,FALSE),\"\")","v":""}]
[null,{"$f":"IFERROR(INDEX(List,SMALL(IF(List<>\"\",ROW(INDIRECT(\"1:\"&ROWS(List)))),ROWS($1:293))),\"\")","v":""},{"$f":"IFERROR(VLOOKUP(B294,Inputs_Rec.!$DB$6:$DC$372,2,FALSE),\"\")","v":""},{"$f":"IFERROR(VLOOKUP(B294,Inputs_Rec.!$DD$6:$DE$372,2,FALSE),\"\")","v":""},null,null,"",{"$f":"IFERROR(VLOOKUP(G294,Inputs_Rec.!$DF$6:$DG$372,2,FALSE),\"\")","v":""},null,"",{"$f":"IFERROR(VLOOKUP(J294,Inputs_Rec.!$DH$6:$DI$372,2,FALSE),\"\")","v":""}]
[null,{"$f":"IFERROR(INDEX(List,SMALL(IF(List<>\"\",ROW(INDIRECT(\"1:\"&ROWS(List)))),ROWS($1:294))),\"\")","v":""},{"$f":"IFERROR(VLOOKUP(B295,Inputs_Rec.!$DB$6:$DC$372,2,FALSE),\"\")","v":""},{"$f":"IFERROR(VLOOKUP(B295,Inputs_Rec.!$DD$6:$DE$372,2,FALSE),\"\")","v":""},null,null,"",{"$f":"IFERROR(VLOOKUP(G295,Inputs_Rec.!$DF$6:$DG$372,2,FALSE),\"\")","v":""},null,"",{"$f":"IFERROR(VLOOKUP(J295,Inputs_Rec.!$DH$6:$DI$372,2,FALSE),\"\")","v":""}]
[null,{"$f":"IFERROR(INDEX(List,SMALL(IF(List<>\"\",ROW(INDIRECT(\"1:\"&ROWS(List)))),ROWS($1:295))),\"\")","v":""},{"$f":"IFERROR(VLOOKUP(B296,Inputs_Rec.!$DB$6:$DC$372,2,FALSE),\"\")","v":""},{"$f":"IFERROR(VLOOKUP(B296,Inputs_Rec.!$DD$6:$DE$372,2,FALSE),\"\")","v":""},null,null,"",{"$f":"IFERROR(VLOOKUP(G296,Inputs_Rec.!$DF$6:$DG$372,2,FALSE),\"\")","v":""},null,"",{"$f":"IFERROR(VLOOKUP(J296,Inputs_Rec.!$DH$6:$DI$372,2,FALSE),\"\")","v":""}]
[null,{"$f":"IFERROR(INDEX(List,SMALL(IF(List<>\"\",ROW(INDIRECT(\"1:\"&ROWS(List)))),ROWS($1:296))),\"\")","v":""},{"$f":"IFERROR(VLOOKUP(B297,Inputs_Rec.!$DB$6:$DC$372,2,FALSE),\"\")","v":""},{"$f":"IFERROR(VLOOKUP(B297,Inputs_Rec.!$DD$6:$DE$372,2,FALSE),\"\")","v":""},null,null,"",{"$f":"IFERROR(VLOOKUP(G297,Inputs_Rec.!$DF$6:$DG$372,2,FALSE),\"\")","v":""},null,"",{"$f":"IFERROR(VLOOKUP(J297,Inputs_Rec.!$DH$6:$DI$372,2,FALSE),\"\")","v":""}]
[null,{"$f":"IFERROR(INDEX(List,SMALL(IF(List<>\"\",ROW(INDIRECT(\"1:\"&ROWS(List)))),ROWS($1:297))),\"\")","v":""},{"$f":"IFERROR(VLOOKUP(B298,Inputs_Rec.!$DB$6:$DC$372,2,FALSE),\"\")","v":""},{"$f":"IFERROR(VLOOKUP(B298,Inputs_Rec.!$DD$6:$DE$372,2,FALSE),\"\")","v":""},null,null,"",{"$f":"IFERROR(VLOOKUP(G298,Inputs_Rec.!$DF$6:$DG$372,2,FALSE),\"\")","v":""},null,"",{"$f":"IFERROR(VLOOKUP(J298,Inputs_Rec.!$DH$6:$DI$372,2,FALSE),\"\")","v":""}]
[null,{"$f":"IFERROR(INDEX(List,SMALL(IF(List<>\"\",ROW(INDIRECT(\"1:\"&ROWS(List)))),ROWS($1:298))),\"\")","v":""},{"$f":"IFERROR(VLOOKUP(B299,Inputs_Rec.!$DB$6:$DC$372,2,FALSE),\"\")","v":""},{"$f":"IFERROR(VLOOKUP(B299,Inputs_Rec.!$DD$6:$DE$372,2,FALSE),\"\")","v":""},null,null,"",{"$f":"IFERROR(VLOOKUP(G299,Inputs_Rec.!$DF$6:$DG$372,2,FALSE),\"\")","v":""},null,"",{"$f":"IFERROR(VLOOKUP(J299,Inputs_Rec.!$DH$6:$DI$372,2,FALSE),\"\")","v":""}]
[null,{"$f":"IFERROR(INDEX(List,SMALL(IF(List<>\"\",ROW(INDIRECT(\"1:\"&ROWS(List)))),ROWS($1:299))),\"\")","v":""},{"$f":"IFERROR(VLOOKUP(B300,Inputs_Rec.!$DB$6:$DC$372,2,FALSE),\"\")","v":""},{"$f":"IFERROR(VLOOKUP(B300,Inputs_Rec.!$DD$6:$DE$372,2,FALSE),\"\")","v":""},null,null,"",{"$f":"IFERROR(VLOOKUP(G300,Inputs_Rec.!$DF$6:$DG$372,2,FALSE),\"\")","v":""},null,"",{"$f":"IFERROR(VLOOKUP(J300,Inputs_Rec.!$DH$6:$DI$372,2,FALSE),\"\")","v":""}]
[null,{"$f":"IFERROR(INDEX(List,SMALL(IF(List<>\"\",ROW(INDIRECT(\"1:\"&ROWS(List)))),ROWS($1:300))),\"\")","v":""},{"$f":"IFERROR(VLOOKUP(B301,Inputs_Rec.!$DB$6:$DC$372,2,FALSE),\"\")","v":""},{"$f":"IFERROR(VLOOKUP(B301,Inputs_Rec.!$DD$6:$DE$372,2,FALSE),\"\")","v":""},null,null,"",{"$f":"IFERROR(VLOOKUP(G301,Inputs_Rec.!$DF$6:$DG$372,2,FALSE),\"\")","v":""},null,"",{"$f":"IFERROR(VLOOKUP(J301,Inputs_Rec.!$DH$6:$DI$372,2,FALSE),\"\")","v":""}]
[null,{"$f":"IFERROR(INDEX(List,SMALL(IF(List<>\"\",ROW(INDIRECT(\"1:\"&ROWS(List)))),ROWS($1:301))),\"\")","v":""},{"$f":"IFERROR(VLOOKUP(B302,Inputs_Rec.!$DB$6:$DC$372,2,FALSE),\"\")","v":""},{"$f":"IFERROR(VLOOKUP(B302,Inputs_Rec.!$DD$6:$DE$372,2,FALSE),\"\")","v":""},null,null,"",{"$f":"IFERROR(VLOOKUP(G302,Inputs_Rec.!$DF$6:$DG$372,2,FALSE),\"\")","v":""},null,"",{"$f":"IFERROR(VLOOKUP(J302,Inputs_Rec.!$DH$6:$DI$372,2,FALSE),\"\")","v":""}]
[null,{"$f":"IFERROR(INDEX(List,SMALL(IF(List<>\"\",ROW(INDIRECT(\"1:\"&ROWS(List)))),ROWS($1:302))),\"\")","v":""},{"$f":"IFERROR(VLOOKUP(B303,Inputs_Rec.!$DB$6:$DC$372,2,FALSE),\"\")","v":""},{"$f":"IFERROR(VLOOKUP(B303,Inputs_Rec.!$DD$6:$DE$372,2,FALSE),\"\")","v":""},null,null,"",{"$f":"IFERROR(VLOOKUP(G303,Inputs_Rec.!$DF$6:$DG$372,2,FALSE),\"\")","v":""},null,"",{"$f":"IFERROR(VLOOKUP(J303,Inputs_Rec.!$DH$6:$DI$372,2,FALSE),\"\")","v":""}]
[null,{"$f":"IFERROR(INDEX(List,SMALL(IF(List<>\"\",ROW(INDIRECT(\"1:\"&ROWS(List)))),ROWS($1:303))),\"\")","v":""},{"$f":"IFERROR(VLOOKUP(B304,Inputs_Rec.!$DB$6:$DC$372,2,FALSE),\"\")","v":""},{"$f":"IFERROR(VLOOKUP(B304,Inputs_Rec.!$DD$6:$DE$372,2,FALSE),\"\")","v":""},null,null,"",{"$f":"IFERROR(VLOOKUP(G304,Inputs_Rec.!$DF$6:$DG$372,2,FALSE),\"\")","v":""},null,"",{"$f":"IFERROR(VLOOKUP(J304,Inputs_Rec.!$DH$6:$DI$372,2,FALSE),\"\")","v":""}]
[null,{"$f":"IFERROR(INDEX(List,SMALL(IF(List<>\"\",ROW(INDIRECT(\"1:\"&ROWS(List)))),ROWS($1:304))),\"\")","v":""},{"$f":"IFERROR(VLOOKUP(B305,Inputs_Rec.!$DB$6:$DC$372,2,FALSE),\"\")","v":""},{"$f":"IFERROR(VLOOKUP(B305,Inputs_Rec.!$DD$6:$DE$372,2,FALSE),\"\")","v":""},null,null,"",{"$f":"IFERROR(VLOOKUP(G305,Inputs_Rec.!$DF$6:$DG$372,2,FALSE),\"\")","v":""},null,"",{"$f":"IFERROR(VLOOKUP(J305,Inputs_Rec.!$DH$6:$DI$372,2,FALSE),\"\")","v":""}]
[null,{"$f":"IFERROR(INDEX(List,SMALL(IF(List<>\"\",ROW(INDIRECT(\"1:\"&ROWS(List)))),ROWS($1:305))),\"\")","v":""},{"$f":"IFERROR(VLOOKUP(B306,Inputs_Rec.!$DB$6:$DC$372,2,FALSE),\"\")","v":""},{"$f":"IFERROR(VLOOKUP(B306,Inputs_Rec.!$DD$6:$DE$372,2,FALSE),\"\")","v":""},null,null,"",{"$f":"IFERROR(VLOOKUP(G306,Inputs_Rec.!$DF$6:$DG$372,2,FALSE),\"\")","v":""},null,"",{"$f":"IFERROR(VLOOKUP(J306,Inputs_Rec.!$DH$6:$DI$372,2,FALSE),\"\")","v":""}]
[null,{"$f":"IFERROR(INDEX(List,SMALL(IF(List<>\"\",ROW(INDIRECT(\"1:\"&ROWS(List)))),ROWS($1:306))),\"\")","v":""},{"$f":"IFERROR(VLOOKUP(B307,Inputs_Rec.!$DB$6:$DC$372,2,FALSE),\"\")","v":""},{"$f":"IFERROR(VLOOKUP(B307,Inputs_Rec.!$DD$6:$DE$372,2,FALSE),\"\")","v":""},null,null,"",{"$f":"IFERROR(VLOOKUP(G307,Inputs_Rec.!$DF$6:$DG$372,2,FALSE),\"\")","v":""},null,"",{"$f":"IFERROR(VLOOKUP(J307,Inputs_Rec.!$DH$6:$DI$372,2,FALSE),\"\")","v":""}]
[null,{"$f":"IFERROR(INDEX(List,SMALL(IF(List<>\"\",ROW(INDIRECT(\"1:\"&ROWS(List)))),ROWS($1:307))),\"\")","v":""},{"$f":"IFERROR(VLOOKUP(B308,Inputs_Rec.!$DB$6:$DC$372,2,FALSE),\"\")","v":""},{"$f":"IFERROR(VLOOKUP(B308,Inputs_Rec.!$DD$6:$DE$372,2,FALSE),\"\")","v":""},null,null,"",{"$f":"IFERROR(VLOOKUP(G308,Inputs_Rec.!$DF$6:$DG$372,2,FALSE),\"\")","v":""},null,"",{"$f":"IFERROR(VLOOKUP(J308,Inputs_Rec.!$DH$6:$DI$372,2,FALSE),\"\")","v":""}]
[null,{"$f":"IFERROR(INDEX(List,SMALL(IF(List<>\"\",ROW(INDIRECT(\"1:\"&ROWS(List)))),ROWS($1:308))),\"\")","v":""},{"$f":"IFERROR(VLOOKUP(B309,Inputs_Rec.!$DB$6:$DC$372,2,FALSE),\"\")","v":""},{"$f":"IFERROR(VLOOKUP(B309,Inputs_Rec.!$DD$6:$DE$372,2,FALSE),\"\")","v":""},null,null,"",{"$f":"IFERROR(VLOOKUP(G309,Inputs_Rec.!$DF$6:$DG$372,2,FALSE),\"\")","v":""},null,"",{"$f":"IFERROR(VLOOKUP(J309,Inputs_Rec.!$DH$6:$DI$372,2,FALSE),\"\")","v":""}]
[null,{"$f":"IFERROR(INDEX(List,SMALL(IF(List<>\"\",ROW(INDIRECT(\"1:\"&ROWS(List)))),ROWS($1:309))),\"\")","v":""},{"$f":"IFERROR(VLOOKUP(B310,Inputs_Rec.!$DB$6:$DC$372,2,FALSE),\"\")","v":""},{"$f":"IFERROR(VLOOKUP(B310,Inputs_Rec.!$DD$6:$DE$372,2,FALSE),\"\")","v":""},null,null,"",{"$f":"IFERROR(VLOOKUP(G310,Inputs_Rec.!$DF$6:$DG$372,2,FALSE),\"\")","v":""},null,"",{"$f":"IFERROR(VLOOKUP(J310,Inputs_Rec.!$DH$6:$DI$372,2,FALSE),\"\")","v":""}]
[null,{"$f":"IFERROR(INDEX(List,SMALL(IF(List<>\"\",ROW(INDIRECT(\"1:\"&ROWS(List)))),ROWS($1:310))),\"\")","v":""},{"$f":"IFERROR(VLOOKUP(B311,Inputs_Rec.!$DB$6:$DC$372,2,FALSE),\"\")","v":""},{"$f":"IFERROR(VLOOKUP(B311,Inputs_Rec.!$DD$6:$DE$372,2,FALSE),\"\")","v":""},null,null,"",{"$f":"IFERROR(VLOOKUP(G311,Inputs_Rec.!$DF$6:$DG$372,2,FALSE),\"\")","v":""},null,"",{"$f":"IFERROR(VLOOKUP(J311,Inputs_Rec.!$DH$6:$DI$372,2,FALSE),\"\")","v":""}]
[null,{"$f":"IFERROR(INDEX(List,SMALL(IF(List<>\"\",ROW(INDIRECT(\"1:\"&ROWS(List)))),ROWS($1:311))),\"\")","v":""},{"$f":"IFERROR(VLOOKUP(B312,Inputs_Rec.!$DB$6:$DC$372,2,FALSE),\"\")","v":""},{"$f":"IFERROR(VLOOKUP(B312,Inputs_Rec.!$DD$6:$DE$372,2,FALSE),\"\")","v":""},null,null,"",{"$f":"IFERROR(VLOOKUP(G312,Inputs_Rec.!$DF$6:$DG$372,2,FALSE),\"\")","v":""},null,"",{"$f":"IFERROR(VLOOKUP(J312,Inputs_Rec.!$DH$6:$DI$372,2,FALSE),\"\")","v":""}]
[null,{"$f":"IFERROR(INDEX(List,SMALL(IF(List<>\"\",ROW(INDIRECT(\"1:\"&ROWS(List)))),ROWS($1:312))),\"\")","v":""},{"$f":"IFERROR(VLOOKUP(B313,Inputs_Rec.!$DB$6:$DC$372,2,FALSE),\"\")","v":""},{"$f":"IFERROR(VLOOKUP(B313,Inputs_Rec.!$DD$6:$DE$372,2,FALSE),\"\")","v":""},null,null,"",{"$f":"IFERROR(VLOOKUP(G313,Inputs_Rec.!$DF$6:$DG$372,2,FALSE),\"\")","v":""},null,"",{"$f":"IFERROR(VLOOKUP(J313,Inputs_Rec.!$DH$6:$DI$372,2,FALSE),\"\")","v":""}]
[null,{"$f":"IFERROR(INDEX(List,SMALL(IF(List<>\"\",ROW(INDIRECT(\"1:\"&ROWS(List)))),ROWS($1:313))),\"\")","v":""},{"$f":"IFERROR(VLOOKUP(B314,Inputs_Rec.!$DB$6:$DC$372,2,FALSE),\"\")","v":""},{"$f":"IFERROR(VLOOKUP(B314,Inputs_Rec.!$DD$6:$DE$372,2,FALSE),\"\")","v":""},null,null,"",{"$f":"IFERROR(VLOOKUP(G314,Inputs_Rec.!$DF$6:$DG$372,2,FALSE),\"\")","v":""},null,"",{"$f":"IFERROR(VLOOKUP(J314,Inputs_Rec.!$DH$6:$DI$372,2,FALSE),\"\")","v":""}]
[null,{"$f":"IFERROR(INDEX(List,SMALL(IF(List<>\"\",ROW(INDIRECT(\"1:\"&ROWS(List)))),ROWS($1:314))),\"\")","v":""},{"$f":"IFERROR(VLOOKUP(B315,Inputs_Rec.!$DB$6:$DC$372,2,FALSE),\"\")","v":""},{"$f":"IFERROR(VLOOKUP(B315,Inputs_Rec.!$DD$6:$DE$372,2,FALSE),\"\")","v":""},null,null,"",{"$f":"IFERROR(VLOOKUP(G315,Inputs_Rec.!$DF$6:$DG$372,2,FALSE),\"\")","v":""},null,"",{"$f":"IFERROR(VLOOKUP(J315,Inputs_Rec.!$DH$6:$DI$372,2,FALSE),\"\")","v":""}]
[null,{"$f":"IFERROR(INDEX(List,SMALL(IF(List<>\"\",ROW(INDIRECT(\"1:\"&ROWS(List)))),ROWS($1:315))),\"\")","v":""},{"$f":"IFERROR(VLOOKUP(B316,Inputs_Rec.!$DB$6:$DC$372,2,FALSE),\"\")","v":""},{"$f":"IFERROR(VLOOKUP(B316,Inputs_Rec.!$DD$6:$DE$372,2,FALSE),\"\")","v":""},null,null,"",{"$f":"IFERROR(VLOOKUP(G316,Inputs_Rec.!$DF$6:$DG$372,2,FALSE),\"\")","v":""},null,"",{"$f":"IFERROR(VLOOKUP(J316,Inputs_Rec.!$DH$6:$DI$372,2,FALSE),\"\")","v":""}]
[null,{"$f":"IFERROR(INDEX(List,SMALL(IF(List<>\"\",ROW(INDIRECT(\"1:\"&ROWS(List)))),ROWS($1:316))),\"\")","v":""},{"$f":"IFERROR(VLOOKUP(B317,Inputs_Rec.!$DB$6:$DC$372,2,FALSE),\"\")","v":""},{"$f":"IFERROR(VLOOKUP(B317,Inputs_Rec.!$DD$6:$DE$372,2,FALSE),\"\")","v":""},null,null,"",{"$f":"IFERROR(VLOOKUP(G317,Inputs_Rec.!$DF$6:$DG$372,2,FALSE),\"\")","v":""},null,"",{"$f":"IFERROR(VLOOKUP(J317,Inputs_Rec.!$DH$6:$DI$372,2,FALSE),\"\")","v":""}]
[null,{"$f":"IFERROR(INDEX(List,SMALL(IF(List<>\"\",ROW(INDIRECT(\"1:\"&ROWS(List)))),ROWS($1:317))),\"\")","v":""},{"$f":"IFERROR(VLOOKUP(B318,Inputs_Rec.!$DB$6:$DC$372,2,FALSE),\"\")","v":""},{"$f":"IFERROR(VLOOKUP(B318,Inputs_Rec.!$DD$6:$DE$372,2,FALSE),\"\")","v":""},null,null,"",{"$f":"IFERROR(VLOOKUP(G318,Inputs_Rec.!$DF$6:$DG$372,2,FALSE),\"\")","v":""},null,"",{"$f":"IFERROR(VLOOKUP(J318,Inputs_Rec.!$DH$6:$DI$372,2,FALSE),\"\")","v":""}]
[null,{"$f":"IFERROR(INDEX(List,SMALL(IF(List<>\"\",ROW(INDIRECT(\"1:\"&ROWS(List)))),ROWS($1:318))),\"\")","v":""},{"$f":"IFERROR(VLOOKUP(B319,Inputs_Rec.!$DB$6:$DC$372,2,FALSE),\"\")","v":""},{"$f":"IFERROR(VLOOKUP(B319,Inputs_Rec.!$DD$6:$DE$372,2,FALSE),\"\")","v":""},null,null,"",{"$f":"IFERROR(VLOOKUP(G319,Inputs_Rec.!$DF$6:$DG$372,2,FALSE),\"\")","v":""},null,"",{"$f":"IFERROR(VLOOKUP(J319,Inputs_Rec.!$DH$6:$DI$372,2,FALSE),\"\")","v":""}]
[null,{"$f":"IFERROR(INDEX(List,SMALL(IF(List<>\"\",ROW(INDIRECT(\"1:\"&ROWS(List)))),ROWS($1:319))),\"\")","v":""},{"$f":"IFERROR(VLOOKUP(B320,Inputs_Rec.!$DB$6:$DC$372,2,FALSE),\"\")","v":""},{"$f":"IFERROR(VLOOKUP(B320,Inputs_Rec.!$DD$6:$DE$372,2,FALSE),\"\")","v":""},null,null,"",{"$f":"IFERROR(VLOOKUP(G320,Inputs_Rec.!$DF$6:$DG$372,2,FALSE),\"\")","v":""},null,"",{"$f":"IFERROR(VLOOKUP(J320,Inputs_Rec.!$DH$6:$DI$372,2,FALSE),\"\")","v":""}]
[null,{"$f":"IFERROR(INDEX(List,SMALL(IF(List<>\"\",ROW(INDIRECT(\"1:\"&ROWS(List)))),ROWS($1:320))),\"\")","v":""},{"$f":"IFERROR(VLOOKUP(B321,Inputs_Rec.!$DB$6:$DC$372,2,FALSE),\"\")","v":""},{"$f":"IFERROR(VLOOKUP(B321,Inputs_Rec.!$DD$6:$DE$372,2,FALSE),\"\")","v":""},null,null,"",{"$f":"IFERROR(VLOOKUP(G321,Inputs_Rec.!$DF$6:$DG$372,2,FALSE),\"\")","v":""},null,"",{"$f":"IFERROR(VLOOKUP(J321,Inputs_Rec.!$DH$6:$DI$372,2,FALSE),\"\")","v":""}]
[null,{"$f":"IFERROR(INDEX(List,SMALL(IF(List<>\"\",ROW(INDIRECT(\"1:\"&ROWS(List)))),ROWS($1:321))),\"\")","v":""},{"$f":"IFERROR(VLOOKUP(B322,Inputs_Rec.!$DB$6:$DC$372,2,FALSE),\"\")","v":""},{"$f":"IFERROR(VLOOKUP(B322,Inputs_Rec.!$DD$6:$DE$372,2,FALSE),\"\")","v":""},null,null,"",{"$f":"IFERROR(VLOOKUP(G322,Inputs_Rec.!$DF$6:$DG$372,2,FALSE),\"\")","v":""},null,"",{"$f":"IFERROR(VLOOKUP(J322,Inputs_Rec.!$DH$6:$DI$372,2,FALSE),\"\")","v":""}]
[null,{"$f":"IFERROR(INDEX(List,SMALL(IF(List<>\"\",ROW(INDIRECT(\"1:\"&ROWS(List)))),ROWS($1:322))),\"\")","v":""},{"$f":"IFERROR(VLOOKUP(B323,Inputs_Rec.!$DB$6:$DC$372,2,FALSE),\"\")","v":""},{"$f":"IFERROR(VLOOKUP(B323,Inputs_Rec.!$DD$6:$DE$372,2,FALSE),\"\")","v":""},null,null,"",{"$f":"IFERROR(VLOOKUP(G323,Inputs_Rec.!$DF$6:$DG$372,2,FALSE),\"\")","v":""},null,"",{"$f":"IFERROR(VLOOKUP(J323,Inputs_Rec.!$DH$6:$DI$372,2,FALSE),\"\")","v":""}]
[null,{"$f":"IFERROR(INDEX(List,SMALL(IF(List<>\"\",ROW(INDIRECT(\"1:\"&ROWS(List)))),ROWS($1:323))),\"\")","v":""},{"$f":"IFERROR(VLOOKUP(B324,Inputs_Rec.!$DB$6:$DC$372,2,FALSE),\"\")","v":""},{"$f":"IFERROR(VLOOKUP(B324,Inputs_Rec.!$DD$6:$DE$372,2,FALSE),\"\")","v":""},null,null,"",{"$f":"IFERROR(VLOOKUP(G324,Inputs_Rec.!$DF$6:$DG$372,2,FALSE),\"\")","v":""},null,"",{"$f":"IFERROR(VLOOKUP(J324,Inputs_Rec.!$DH$6:$DI$372,2,FALSE),\"\")","v":""}]
[null,{"$f":"IFERROR(INDEX(List,SMALL(IF(List<>\"\",ROW(INDIRECT(\"1:\"&ROWS(List)))),ROWS($1:324))),\"\")","v":""},{"$f":"IFERROR(VLOOKUP(B325,Inputs_Rec.!$DB$6:$DC$372,2,FALSE),\"\")","v":""},{"$f":"IFERROR(VLOOKUP(B325,Inputs_Rec.!$DD$6:$DE$372,2,FALSE),\"\")","v":""},null,null,{"$f":"B325","v":""},{"$f":"IFERROR(VLOOKUP(G325,Inputs_Rec.!$DF$6:$DG$372,2,FALSE),\"\")","v":""},null,{"$f":"G325","v":""},{"$f":"IFERROR(VLOOKUP(J325,Inputs_Rec.!$DH$6:$DI$372,2,FALSE),\"\")","v":""}]
[null,{"$f":"IFERROR(INDEX(List,SMALL(IF(List<>\"\",ROW(INDIRECT(\"1:\"&ROWS(List)))),ROWS($1:325))),\"\")","v":""},{"$f":"IFERROR(VLOOKUP(B326,Inputs_Rec.!$DB$6:$DC$372,2,FALSE),\"\")","v":""},{"$f":"IFERROR(VLOOKUP(B326,Inputs_Rec.!$DD$6:$DE$372,2,FALSE),\"\")","v":""},null,null,"",{"$f":"IFERROR(VLOOKUP(G326,Inputs_Rec.!$DF$6:$DG$372,2,FALSE),\"\")","v":""},null,"",{"$f":"IFERROR(VLOOKUP(J326,Inputs_Rec.!$DH$6:$DI$372,2,FALSE),\"\")","v":""}]
[null,{"$f":"IFERROR(INDEX(List,SMALL(IF(List<>\"\",ROW(INDIRECT(\"1:\"&ROWS(List)))),ROWS($1:326))),\"\")","v":""},{"$f":"IFERROR(VLOOKUP(B327,Inputs_Rec.!$DB$6:$DC$372,2,FALSE),\"\")","v":""},{"$f":"IFERROR(VLOOKUP(B327,Inputs_Rec.!$DD$6:$DE$372,2,FALSE),\"\")","v":""},null,null,"",{"$f":"IFERROR(VLOOKUP(G327,Inputs_Rec.!$DF$6:$DG$372,2,FALSE),\"\")","v":""},null,"",{"$f":"IFERROR(VLOOKUP(J327,Inputs_Rec.!$DH$6:$DI$372,2,FALSE),\"\")","v":""}]
[null,{"$f":"IFERROR(INDEX(List,SMALL(IF(List<>\"\",ROW(INDIRECT(\"1:\"&ROWS(List)))),ROWS($1:327))),\"\")","v":""},{"$f":"IFERROR(VLOOKUP(B328,Inputs_Rec.!$DB$6:$DC$372,2,FALSE),\"\")","v":""},{"$f":"IFERROR(VLOOKUP(B328,Inputs_Rec.!$DD$6:$DE$372,2,FALSE),\"\")","v":""},null,null,"",{"$f":"IFERROR(VLOOKUP(G328,Inputs_Rec.!$DF$6:$DG$372,2,FALSE),\"\")","v":""},null,"",{"$f":"IFERROR(VLOOKUP(J328,Inputs_Rec.!$DH$6:$DI$372,2,FALSE),\"\")","v":""}]
[null,{"$f":"IFERROR(INDEX(List,SMALL(IF(List<>\"\",ROW(INDIRECT(\"1:\"&ROWS(List)))),ROWS($1:328))),\"\")","v":""},{"$f":"IFERROR(VLOOKUP(B329,Inputs_Rec.!$DB$6:$DC$372,2,FALSE),\"\")","v":""},{"$f":"IFERROR(VLOOKUP(B329,Inputs_Rec.!$DD$6:$DE$372,2,FALSE),\"\")","v":""},null,null,"",{"$f":"IFERROR(VLOOKUP(G329,Inputs_Rec.!$DF$6:$DG$372,2,FALSE),\"\")","v":""},null,"",{"$f":"IFERROR(VLOOKUP(J329,Inputs_Rec.!$DH$6:$DI$372,2,FALSE),\"\")","v":""}]
[null,{"$f":"IFERROR(INDEX(List,SMALL(IF(List<>\"\",ROW(INDIRECT(\"1:\"&ROWS(List)))),ROWS($1:329))),\"\")","v":""},{"$f":"IFERROR(VLOOKUP(B330,Inputs_Rec.!$DB$6:$DC$372,2,FALSE),\"\")","v":""},{"$f":"IFERROR(VLOOKUP(B330,Inputs_Rec.!$DD$6:$DE$372,2,FALSE),\"\")","v":""},null,null,"",{"$f":"IFERROR(VLOOKUP(G330,Inputs_Rec.!$DF$6:$DG$372,2,FALSE),\"\")","v":""},null,"",{"$f":"IFERROR(VLOOKUP(J330,Inputs_Rec.!$DH$6:$DI$372,2,FALSE),\"\")","v":""}]
[null,{"$f":"IFERROR(INDEX(List,SMALL(IF(List<>\"\",ROW(INDIRECT(\"1:\"&ROWS(List)))),ROWS($1:330))),\"\")","v":""},{"$f":"IFERROR(VLOOKUP(B331,Inputs_Rec.!$DB$6:$DC$372,2,FALSE),\"\")","v":""},{"$f":"IFERROR(VLOOKUP(B331,Inputs_Rec.!$DD$6:$DE$372,2,FALSE),\"\")","v":""},null,null,"",{"$f":"IFERROR(VLOOKUP(G331,Inputs_Rec.!$DF$6:$DG$372,2,FALSE),\"\")","v":""},null,"",{"$f":"IFERROR(VLOOKUP(J331,Inputs_Rec.!$DH$6:$DI$372,2,FALSE),\"\")","v":""}]
[null,{"$f":"IFERROR(INDEX(List,SMALL(IF(List<>\"\",ROW(INDIRECT(\"1:\"&ROWS(List)))),ROWS($1:331))),\"\")","v":""},{"$f":"IFERROR(VLOOKUP(B332,Inputs_Rec.!$DB$6:$DC$372,2,FALSE),\"\")","v":""},{"$f":"IFERROR(VLOOKUP(B332,Inputs_Rec.!$DD$6:$DE$372,2,FALSE),\"\")","v":""},null,null,"",{"$f":"IFERROR(VLOOKUP(G332,Inputs_Rec.!$DF$6:$DG$372,2,FALSE),\"\")","v":""},null,"",{"$f":"IFERROR(VLOOKUP(J332,Inputs_Rec.!$DH$6:$DI$372,2,FALSE),\"\")","v":""}]
[null,{"$f":"IFERROR(INDEX(List,SMALL(IF(List<>\"\",ROW(INDIRECT(\"1:\"&ROWS(List)))),ROWS($1:332))),\"\")","v":""},{"$f":"IFERROR(VLOOKUP(B333,Inputs_Rec.!$DB$6:$DC$372,2,FALSE),\"\")","v":""},{"$f":"IFERROR(VLOOKUP(B333,Inputs_Rec.!$DD$6:$DE$372,2,FALSE),\"\")","v":""},null,null,"",{"$f":"IFERROR(VLOOKUP(G333,Inputs_Rec.!$DF$6:$DG$372,2,FALSE),\"\")","v":""},null,"",{"$f":"IFERROR(VLOOKUP(J333,Inputs_Rec.!$DH$6:$DI$372,2,FALSE),\"\")","v":""}]
[null,{"$f":"IFERROR(INDEX(List,SMALL(IF(List<>\"\",ROW(INDIRECT(\"1:\"&ROWS(List)))),ROWS($1:333))),\"\")","v":""},{"$f":"IFERROR(VLOOKUP(B334,Inputs_Rec.!$DB$6:$DC$372,2,FALSE),\"\")","v":""},{"$f":"IFERROR(VLOOKUP(B334,Inputs_Rec.!$DD$6:$DE$372,2,FALSE),\"\")","v":""},null,null,"",{"$f":"IFERROR(VLOOKUP(G334,Inputs_Rec.!$DF$6:$DG$372,2,FALSE),\"\")","v":""},null,"",{"$f":"IFERROR(VLOOKUP(J334,Inputs_Rec.!$DH$6:$DI$372,2,FALSE),\"\")","v":""}]
[null,{"$f":"IFERROR(INDEX(List,SMALL(IF(List<>\"\",ROW(INDIRECT(\"1:\"&ROWS(List)))),ROWS($1:334))),\"\")","v":""},{"$f":"IFERROR(VLOOKUP(B335,Inputs_Rec.!$DB$6:$DC$372,2,FALSE),\"\")","v":""},{"$f":"IFERROR(VLOOKUP(B335,Inputs_Rec.!$DD$6:$DE$372,2,FALSE),\"\")","v":""},null,null,"",{"$f":"IFERROR(VLOOKUP(G335,Inputs_Rec.!$DF$6:$DG$372,2,FALSE),\"\")","v":""},null,"",{"$f":"IFERROR(VLOOKUP(J335,Inputs_Rec.!$DH$6:$DI$372,2,FALSE),\"\")","v":""}]
[null,{"$f":"IFERROR(INDEX(List,SMALL(IF(List<>\"\",ROW(INDIRECT(\"1:\"&ROWS(List)))),ROWS($1:335))),\"\")","v":""},{"$f":"IFERROR(VLOOKUP(B336,Inputs_Rec.!$DB$6:$DC$372,2,FALSE),\"\")","v":""},{"$f":"IFERROR(VLOOKUP(B336,Inputs_Rec.!$DD$6:$DE$372,2,FALSE),\"\")","v":""},null,null,"",{"$f":"IFERROR(VLOOKUP(G336,Inputs_Rec.!$DF$6:$DG$372,2,FALSE),\"\")","v":""},null,"",{"$f":"IFERROR(VLOOKUP(J336,Inputs_Rec.!$DH$6:$DI$372,2,FALSE),\"\")","v":""}]
[null,{"$f":"IFERROR(INDEX(List,SMALL(IF(List<>\"\",ROW(INDIRECT(\"1:\"&ROWS(List)))),ROWS($1:336))),\"\")","v":""},{"$f":"IFERROR(VLOOKUP(B337,Inputs_Rec.!$DB$6:$DC$372,2,FALSE),\"\")","v":""},{"$f":"IFERROR(VLOOKUP(B337,Inputs_Rec.!$DD$6:$DE$372,2,FALSE),\"\")","v":""},null,null,"",{"$f":"IFERROR(VLOOKUP(G337,Inputs_Rec.!$DF$6:$DG$372,2,FALSE),\"\")","v":""},null,"",{"$f":"IFERROR(VLOOKUP(J337,Inputs_Rec.!$DH$6:$DI$372,2,FALSE),\"\")","v":""}]
[null,{"$f":"IFERROR(INDEX(List,SMALL(IF(List<>\"\",ROW(INDIRECT(\"1:\"&ROWS(List)))),ROWS($1:337))),\"\")","v":""},{"$f":"IFERROR(VLOOKUP(B338,Inputs_Rec.!$DB$6:$DC$372,2,FALSE),\"\")","v":""},{"$f":"IFERROR(VLOOKUP(B338,Inputs_Rec.!$DD$6:$DE$372,2,FALSE),\"\")","v":""},null,null,"",{"$f":"IFERROR(VLOOKUP(G338,Inputs_Rec.!$DF$6:$DG$372,2,FALSE),\"\")","v":""},null,"",{"$f":"IFERROR(VLOOKUP(J338,Inputs_Rec.!$DH$6:$DI$372,2,FALSE),\"\")","v":""}]
[null,{"$f":"IFERROR(INDEX(List,SMALL(IF(List<>\"\",ROW(INDIRECT(\"1:\"&ROWS(List)))),ROWS($1:338))),\"\")","v":""},{"$f":"IFERROR(VLOOKUP(B339,Inputs_Rec.!$DB$6:$DC$372,2,FALSE),\"\")","v":""},{"$f":"IFERROR(VLOOKUP(B339,Inputs_Rec.!$DD$6:$DE$372,2,FALSE),\"\")","v":""},null,null,"",{"$f":"IFERROR(VLOOKUP(G339,Inputs_Rec.!$DF$6:$DG$372,2,FALSE),\"\")","v":""},null,"",{"$f":"IFERROR(VLOOKUP(J339,Inputs_Rec.!$DH$6:$DI$372,2,FALSE),\"\")","v":""}]
[null,{"$f":"IFERROR(INDEX(List,SMALL(IF(List<>\"\",ROW(INDIRECT(\"1:\"&ROWS(List)))),ROWS($1:339))),\"\")","v":""},{"$f":"IFERROR(VLOOKUP(B340,Inputs_Rec.!$DB$6:$DC$372,2,FALSE),\"\")","v":""},{"$f":"IFERROR(VLOOKUP(B340,Inputs_Rec.!$DD$6:$DE$372,2,FALSE),\"\")","v":""},null,null,"",{"$f":"IFERROR(VLOOKUP(G340,Inputs_Rec.!$DF$6:$DG$372,2,FALSE),\"\")","v":""},null,"",{"$f":"IFERROR(VLOOKUP(J340,Inputs_Rec.!$DH$6:$DI$372,2,FALSE),\"\")","v":""}]
[null,{"$f":"IFERROR(INDEX(List,SMALL(IF(List<>\"\",ROW(INDIRECT(\"1:\"&ROWS(List)))),ROWS($1:340))),\"\")","v":""},{"$f":"IFERROR(VLOOKUP(B341,Inputs_Rec.!$DB$6:$DC$372,2,FALSE),\"\")","v":""},{"$f":"IFERROR(VLOOKUP(B341,Inputs_Rec.!$DD$6:$DE$372,2,FALSE),\"\")","v":""},null,null,"",{"$f":"IFERROR(VLOOKUP(G341,Inputs_Rec.!$DF$6:$DG$372,2,FALSE),\"\")","v":""},null,"",{"$f":"IFERROR(VLOOKUP(J341,Inputs_Rec.!$DH$6:$DI$372,2,FALSE),\"\")","v":""}]
[null,{"$f":"IFERROR(INDEX(List,SMALL(IF(List<>\"\",ROW(INDIRECT(\"1:\"&ROWS(List)))),ROWS($1:341))),\"\")","v":""},{"$f":"IFERROR(VLOOKUP(B342,Inputs_Rec.!$DB$6:$DC$372,2,FALSE),\"\")","v":""},{"$f":"IFERROR(VLOOKUP(B342,Inputs_Rec.!$DD$6:$DE$372,2,FALSE),\"\")","v":""},null,null,"",{"$f":"IFERROR(VLOOKUP(G342,Inputs_Rec.!$DF$6:$DG$372,2,FALSE),\"\")","v":""},null,"",{"$f":"IFERROR(VLOOKUP(J342,Inputs_Rec.!$DH$6:$DI$372,2,FALSE),\"\")","v":""}]
[null,{"$f":"IFERROR(INDEX(List,SMALL(IF(List<>\"\",ROW(INDIRECT(\"1:\"&ROWS(List)))),ROWS($1:342))),\"\")","v":""},{"$f":"IFERROR(VLOOKUP(B343,Inputs_Rec.!$DB$6:$DC$372,2,FALSE),\"\")","v":""},{"$f":"IFERROR(VLOOKUP(B343,Inputs_Rec.!$DD$6:$DE$372,2,FALSE),\"\")","v":""},null,null,"",{"$f":"IFERROR(VLOOKUP(G343,Inputs_Rec.!$DF$6:$DG$372,2,FALSE),\"\")","v":""},null,"",{"$f":"IFERROR(VLOOKUP(J343,Inputs_Rec.!$DH$6:$DI$372,2,FALSE),\"\")","v":""}]
[null,{"$f":"IFERROR(INDEX(List,SMALL(IF(List<>\"\",ROW(INDIRECT(\"1:\"&ROWS(List)))),ROWS($1:343))),\"\")","v":""},{"$f":"IFERROR(VLOOKUP(B344,Inputs_Rec.!$DB$6:$DC$372,2,FALSE),\"\")","v":""},{"$f":"IFERROR(VLOOKUP(B344,Inputs_Rec.!$DD$6:$DE$372,2,FALSE),\"\")","v":""},null,null,"",{"$f":"IFERROR(VLOOKUP(G344,Inputs_Rec.!$DF$6:$DG$372,2,FALSE),\"\")","v":""},null,"",{"$f":"IFERROR(VLOOKUP(J344,Inputs_Rec.!$DH$6:$DI$372,2,FALSE),\"\")","v":""}]
[null,{"$f":"IFERROR(INDEX(List,SMALL(IF(List<>\"\",ROW(INDIRECT(\"1:\"&ROWS(List)))),ROWS($1:344))),\"\")","v":""},{"$f":"IFERROR(VLOOKUP(B345,Inputs_Rec.!$DB$6:$DC$372,2,FALSE),\"\")","v":""},{"$f":"IFERROR(VLOOKUP(B345,Inputs_Rec.!$DD$6:$DE$372,2,FALSE),\"\")","v":""},null,null,"",{"$f":"IFERROR(VLOOKUP(G345,Inputs_Rec.!$DF$6:$DG$372,2,FALSE),\"\")","v":""},null,"",{"$f":"IFERROR(VLOOKUP(J345,Inputs_Rec.!$DH$6:$DI$372,2,FALSE),\"\")","v":""}]
[null,{"$f":"IFERROR(INDEX(List,SMALL(IF(List<>\"\",ROW(INDIRECT(\"1:\"&ROWS(List)))),ROWS($1:345))),\"\")","v":""},{"$f":"IFERROR(VLOOKUP(B346,Inputs_Rec.!$DB$6:$DC$372,2,FALSE),\"\")","v":""},{"$f":"IFERROR(VLOOKUP(B346,Inputs_Rec.!$DD$6:$DE$372,2,FALSE),\"\")","v":""},null,null,"",{"$f":"IFERROR(VLOOKUP(G346,Inputs_Rec.!$DF$6:$DG$372,2,FALSE),\"\")","v":""},null,"",{"$f":"IFERROR(VLOOKUP(J346,Inputs_Rec.!$DH$6:$DI$372,2,FALSE),\"\")","v":""}]
[null,{"$f":"IFERROR(INDEX(List,SMALL(IF(List<>\"\",ROW(INDIRECT(\"1:\"&ROWS(List)))),ROWS($1:346))),\"\")","v":""},{"$f":"IFERROR(VLOOKUP(B347,Inputs_Rec.!$DB$6:$DC$372,2,FALSE),\"\")","v":""},{"$f":"IFERROR(VLOOKUP(B347,Inputs_Rec.!$DD$6:$DE$372,2,FALSE),\"\")","v":""},null,null,"",{"$f":"IFERROR(VLOOKUP(G347,Inputs_Rec.!$DF$6:$DG$372,2,FALSE),\"\")","v":""},null,"",{"$f":"IFERROR(VLOOKUP(J347,Inputs_Rec.!$DH$6:$DI$372,2,FALSE),\"\")","v":""}]
[null,{"$f":"IFERROR(INDEX(List,SMALL(IF(List<>\"\",ROW(INDIRECT(\"1:\"&ROWS(List)))),ROWS($1:347))),\"\")","v":""},{"$f":"IFERROR(VLOOKUP(B348,Inputs_Rec.!$DB$6:$DC$372,2,FALSE),\"\")","v":""},{"$f":"IFERROR(VLOOKUP(B348,Inputs_Rec.!$DD$6:$DE$372,2,FALSE),\"\")","v":""},null,null,"",{"$f":"IFERROR(VLOOKUP(G348,Inputs_Rec.!$DF$6:$DG$372,2,FALSE),\"\")","v":""},null,"",{"$f":"IFERROR(VLOOKUP(J348,Inputs_Rec.!$DH$6:$DI$372,2,FALSE),\"\")","v":""}]
[null,{"$f":"IFERROR(INDEX(List,SMALL(IF(List<>\"\",ROW(INDIRECT(\"1:\"&ROWS(List)))),ROWS($1:348))),\"\")","v":""},{"$f":"IFERROR(VLOOKUP(B349,Inputs_Rec.!$DB$6:$DC$372,2,FALSE),\"\")","v":""},{"$f":"IFERROR(VLOOKUP(B349,Inputs_Rec.!$DD$6:$DE$372,2,FALSE),\"\")","v":""},null,null,"",{"$f":"IFERROR(VLOOKUP(G349,Inputs_Rec.!$DF$6:$DG$372,2,FALSE),\"\")","v":""},null,"",{"$f":"IFERROR(VLOOKUP(J349,Inputs_Rec.!$DH$6:$DI$372,2,FALSE),\"\")","v":""}]
[null,{"$f":"IFERROR(INDEX(List,SMALL(IF(List<>\"\",ROW(INDIRECT(\"1:\"&ROWS(List)))),ROWS($1:349))),\"\")","v":""},{"$f":"IFERROR(VLOOKUP(B350,Inputs_Rec.!$DB$6:$DC$372,2,FALSE),\"\")","v":""},{"$f":"IFERROR(VLOOKUP(B350,Inputs_Rec.!$DD$6:$DE$372,2,FALSE),\"\")","v":""},null,null,"",{"$f":"IFERROR(VLOOKUP(G350,Inputs_Rec.!$DF$6:$DG$372,2,FALSE),\"\")","v":""},null,"",{"$f":"IFERROR(VLOOKUP(J350,Inputs_Rec.!$DH$6:$DI$372,2,FALSE),\"\")","v":""}]
[null,{"$f":"IFERROR(INDEX(List,SMALL(IF(List<>\"\",ROW(INDIRECT(\"1:\"&ROWS(List)))),ROWS($1:350))),\"\")","v":""},{"$f":"IFERROR(VLOOKUP(B351,Inputs_Rec.!$DB$6:$DC$372,2,FALSE),\"\")","v":""},{"$f":"IFERROR(VLOOKUP(B351,Inputs_Rec.!$DD$6:$DE$372,2,FALSE),\"\")","v":""},null,null,"",{"$f":"IFERROR(VLOOKUP(G351,Inputs_Rec.!$DF$6:$DG$372,2,FALSE),\"\")","v":""},null,"",{"$f":"IFERROR(VLOOKUP(J351,Inputs_Rec.!$DH$6:$DI$372,2,FALSE),\"\")","v":""}]
[null,{"$f":"IFERROR(INDEX(List,SMALL(IF(List<>\"\",ROW(INDIRECT(\"1:\"&ROWS(List)))),ROWS($1:351))),\"\")","v":""},{"$f":"IFERROR(VLOOKUP(B352,Inputs_Rec.!$DB$6:$DC$372,2,FALSE),\"\")","v":""},{"$f":"IFERROR(VLOOKUP(B352,Inputs_Rec.!$DD$6:$DE$372,2,FALSE),\"\")","v":""},null,null,"",{"$f":"IFERROR(VLOOKUP(G352,Inputs_Rec.!$DF$6:$DG$372,2,FALSE),\"\")","v":""},null,"",{"$f":"IFERROR(VLOOKUP(J352,Inputs_Rec.!$DH$6:$DI$372,2,FALSE),\"\")","v":""}]
[null,{"$f":"IFERROR(INDEX(List,SMALL(IF(List<>\"\",ROW(INDIRECT(\"1:\"&ROWS(List)))),ROWS($1:352))),\"\")","v":""},{"$f":"IFERROR(VLOOKUP(B353,Inputs_Rec.!$DB$6:$DC$372,2,FALSE),\"\")","v":""},{"$f":"IFERROR(VLOOKUP(B353,Inputs_Rec.!$DD$6:$DE$372,2,FALSE),\"\")","v":""},null,null,"",{"$f":"IFERROR(VLOOKUP(G353,Inputs_Rec.!$DF$6:$DG$372,2,FALSE),\"\")","v":""},null,"",{"$f":"IFERROR(VLOOKUP(J353,Inputs_Rec.!$DH$6:$DI$372,2,FALSE),\"\")","v":""}]
[null,{"$f":"IFERROR(INDEX(List,SMALL(IF(List<>\"\",ROW(INDIRECT(\"1:\"&ROWS(List)))),ROWS($1:353))),\"\")","v":""},{"$f":"IFERROR(VLOOKUP(B354,Inputs_Rec.!$DB$6:$DC$372,2,FALSE),\"\")","v":""},{"$f":"IFERROR(VLOOKUP(B354,Inputs_Rec.!$DD$6:$DE$372,2,FALSE),\"\")","v":""},null,null,"",{"$f":"IFERROR(VLOOKUP(G354,Inputs_Rec.!$DF$6:$DG$372,2,FALSE),\"\")","v":""},null,"",{"$f":"IFERROR(VLOOKUP(J354,Inputs_Rec.!$DH$6:$DI$372,2,FALSE),\"\")","v":""}]
[null,{"$f":"IFERROR(INDEX(List,SMALL(IF(List<>\"\",ROW(INDIRECT(\"1:\"&ROWS(List)))),ROWS($1:354))),\"\")","v":""},{"$f":"IFERROR(VLOOKUP(B355,Inputs_Rec.!$DB$6:$DC$372,2,FALSE),\"\")","v":""},{"$f":"IFERROR(VLOOKUP(B355,Inputs_Rec.!$DD$6:$DE$372,2,FALSE),\"\")","v":""},null,null,"",{"$f":"IFERROR(VLOOKUP(G355,Inputs_Rec.!$DF$6:$DG$372,2,FALSE),\"\")","v":""},null,"",{"$f":"IFERROR(VLOOKUP(J355,Inputs_Rec.!$DH$6:$DI$372,2,FALSE),\"\")","v":""}]
[null,{"$f":"IFERROR(INDEX(List,SMALL(IF(List<>\"\",ROW(INDIRECT(\"1:\"&ROWS(List)))),ROWS($1:355))),\"\")","v":""},{"$f":"IFERROR(VLOOKUP(B356,Inputs_Rec.!$DB$6:$DC$372,2,FALSE),\"\")","v":""},{"$f":"IFERROR(VLOOKUP(B356,Inputs_Rec.!$DD$6:$DE$372,2,FALSE),\"\")","v":""},null,null,"",{"$f":"IFERROR(VLOOKUP(G356,Inputs_Rec.!$DF$6:$DG$372,2,FALSE),\"\")","v":""},null,"",{"$f":"IFERROR(VLOOKUP(J356,Inputs_Rec.!$DH$6:$DI$372,2,FALSE),\"\")","v":""}]
[null,{"$f":"IFERROR(INDEX(List,SMALL(IF(List<>\"\",ROW(INDIRECT(\"1:\"&ROWS(List)))),ROWS($1:356))),\"\")","v":""},{"$f":"IFERROR(VLOOKUP(B357,Inputs_Rec.!$DB$6:$DC$372,2,FALSE),\"\")","v":""},{"$f":"IFERROR(VLOOKUP(B357,Inputs_Rec.!$DD$6:$DE$372,2,FALSE),\"\")","v":""},null,null,"",{"$f":"IFERROR(VLOOKUP(G357,Inputs_Rec.!$DF$6:$DG$372,2,FALSE),\"\")","v":""},null,"",{"$f":"IFERROR(VLOOKUP(J357,Inputs_Rec.!$DH$6:$DI$372,2,FALSE),\"\")","v":""}]
[null,{"$f":"IFERROR(INDEX(List,SMALL(IF(List<>\"\",ROW(INDIRECT(\"1:\"&ROWS(List)))),ROWS($1:357))),\"\")","v":""},{"$f":"IFERROR(VLOOKUP(B358,Inputs_Rec.!$DB$6:$DC$372,2,FALSE),\"\")","v":""},{"$f":"IFERROR(VLOOKUP(B358,Inputs_Rec.!$DD$6:$DE$372,2,FALSE),\"\")","v":""},null,null,"",{"$f":"IFERROR(VLOOKUP(G358,Inputs_Rec.!$DF$6:$DG$372,2,FALSE),\"\")","v":""},null,"",{"$f":"IFERROR(VLOOKUP(J358,Inputs_Rec.!$DH$6:$DI$372,2,FALSE),\"\")","v":""}]
[null,{"$f":"IFERROR(INDEX(List,SMALL(IF(List<>\"\",ROW(INDIRECT(\"1:\"&ROWS(List)))),ROWS($1:358))),\"\")","v":""},{"$f":"IFERROR(VLOOKUP(B359,Inputs_Rec.!$DB$6:$DC$372,2,FALSE),\"\")","v":""},{"$f":"IFERROR(VLOOKUP(B359,Inputs_Rec.!$DD$6:$DE$372,2,FALSE),\"\")","v":""},null,null,"",{"$f":"IFERROR(VLOOKUP(G359,Inputs_Rec.!$DF$6:$DG$372,2,FALSE),\"\")","v":""},null,"",{"$f":"IFERROR(VLOOKUP(J359,Inputs_Rec.!$DH$6:$DI$372,2,FALSE),\"\")","v":""}]
[null,{"$f":"IFERROR(INDEX(List,SMALL(IF(List<>\"\",ROW(INDIRECT(\"1:\"&ROWS(List)))),ROWS($1:359))),\"\")","v":""},{"$f":"IFERROR(VLOOKUP(B360,Inputs_Rec.!$DB$6:$DC$372,2,FALSE),\"\")","v":""},{"$f":"IFERROR(VLOOKUP(B360,Inputs_Rec.!$DD$6:$DE$372,2,FALSE),\"\")","v":""},null,null,"",{"$f":"IFERROR(VLOOKUP(G360,Inputs_Rec.!$DF$6:$DG$372,2,FALSE),\"\")","v":""},null,"",{"$f":"IFERROR(VLOOKUP(J360,Inputs_Rec.!$DH$6:$DI$372,2,FALSE),\"\")","v":""}]
[null,{"$f":"IFERROR(INDEX(List,SMALL(IF(List<>\"\",ROW(INDIRECT(\"1:\"&ROWS(List)))),ROWS($1:360))),\"\")","v":""},{"$f":"IFERROR(VLOOKUP(B361,Inputs_Rec.!$DB$6:$DC$372,2,FALSE),\"\")","v":""},{"$f":"IFERROR(VLOOKUP(B361,Inputs_Rec.!$DD$6:$DE$372,2,FALSE),\"\")","v":""},null,null,"",{"$f":"IFERROR(VLOOKUP(G361,Inputs_Rec.!$DF$6:$DG$372,2,FALSE),\"\")","v":""},null,"",{"$f":"IFERROR(VLOOKUP(J361,Inputs_Rec.!$DH$6:$DI$372,2,FALSE),\"\")","v":""}]
[null,{"$f":"IFERROR(INDEX(List,SMALL(IF(List<>\"\",ROW(INDIRECT(\"1:\"&ROWS(List)))),ROWS($1:361))),\"\")","v":""},{"$f":"IFERROR(VLOOKUP(B362,Inputs_Rec.!$DB$6:$DC$372,2,FALSE),\"\")","v":""},{"$f":"IFERROR(VLOOKUP(B362,Inputs_Rec.!$DD$6:$DE$372,2,FALSE),\"\")","v":""},null,null,"",{"$f":"IFERROR(VLOOKUP(G362,Inputs_Rec.!$DF$6:$DG$372,2,FALSE),\"\")","v":""},null,"",{"$f":"IFERROR(VLOOKUP(J362,Inputs_Rec.!$DH$6:$DI$372,2,FALSE),\"\")","v":""}]
[null,{"$f":"IFERROR(INDEX(List,SMALL(IF(List<>\"\",ROW(INDIRECT(\"1:\"&ROWS(List)))),ROWS($1:362))),\"\")","v":""},{"$f":"IFERROR(VLOOKUP(B363,Inputs_Rec.!$DB$6:$DC$372,2,FALSE),\"\")","v":""},{"$f":"IFERROR(VLOOKUP(B363,Inputs_Rec.!$DD$6:$DE$372,2,FALSE),\"\")","v":""},null,null,"",{"$f":"IFERROR(VLOOKUP(G363,Inputs_Rec.!$DF$6:$DG$372,2,FALSE),\"\")","v":""},null,"",{"$f":"IFERROR(VLOOKUP(J363,Inputs_Rec.!$DH$6:$DI$372,2,FALSE),\"\")","v":""}]
[null,{"$f":"IFERROR(INDEX(List,SMALL(IF(List<>\"\",ROW(INDIRECT(\"1:\"&ROWS(List)))),ROWS($1:363))),\"\")","v":""},{"$f":"IFERROR(VLOOKUP(B364,Inputs_Rec.!$DB$6:$DC$372,2,FALSE),\"\")","v":""},{"$f":"IFERROR(VLOOKUP(B364,Inputs_Rec.!$DD$6:$DE$372,2,FALSE),\"\")","v":""},null,null,"",{"$f":"IFERROR(VLOOKUP(G364,Inputs_Rec.!$DF$6:$DG$372,2,FALSE),\"\")","v":""},null,"",{"$f":"IFERROR(VLOOKUP(J364,Inputs_Rec.!$DH$6:$DI$372,2,FALSE),\"\")","v":""}]
[null,{"$f":"IFERROR(INDEX(List,SMALL(IF(List<>\"\",ROW(INDIRECT(\"1:\"&ROWS(List)))),ROWS($1:364))),\"\")","v":""},{"$f":"IFERROR(VLOOKUP(B365,Inputs_Rec.!$DB$6:$DC$372,2,FALSE),\"\")","v":""},{"$f":"IFERROR(VLOOKUP(B365,Inputs_Rec.!$DD$6:$DE$372,2,FALSE),\"\")","v":""},null,null,"",{"$f":"IFERROR(VLOOKUP(G365,Inputs_Rec.!$DF$6:$DG$372,2,FALSE),\"\")","v":""},null,"",{"$f":"IFERROR(VLOOKUP(J365,Inputs_Rec.!$DH$6:$DI$372,2,FALSE),\"\")","v":""}]
[null,{"$f":"IFERROR(INDEX(List,SMALL(IF(List<>\"\",ROW(INDIRECT(\"1:\"&ROWS(List)))),ROWS($1:365))),\"\")","v":""},{"$f":"IFERROR(VLOOKUP(B366,Inputs_Rec.!$DB$6:$DC$372,2,FALSE),\"\")","v":""},{"$f":"IFERROR(VLOOKUP(B366,Inputs_Rec.!$DD$6:$DE$372,2,FALSE),\"\")","v":""},null,null,"",{"$f":"IFERROR(VLOOKUP(G366,Inputs_Rec.!$DF$6:$DG$372,2,FALSE),\"\")","v":""},null,"",{"$f":"IFERROR(VLOOKUP(J366,Inputs_Rec.!$DH$6:$DI$372,2,FALSE),\"\")","v":""}]
[null,{"$f":"IFERROR(INDEX(List,SMALL(IF(List<>\"\",ROW(INDIRECT(\"1:\"&ROWS(List)))),ROWS($1:366))),\"\")","v":""},{"$f":"IFERROR(VLOOKUP(B367,Inputs_Rec.!$DB$6:$DC$372,2,FALSE),\"\")","v":""},{"$f":"IFERROR(VLOOKUP(B367,Inputs_Rec.!$DD$6:$DE$372,2,FALSE),\"\")","v":""},null,null,"",{"$f":"IFERROR(VLOOKUP(G367,Inputs_Rec.!$DF$6:$DG$372,2,FALSE),\"\")","v":""},null,"",{"$f":"IFERROR(VLOOKUP(J367,Inputs_Rec.!$DH$6:$DI$372,2,FALSE),\"\")","v":""}]
[null,{"$f":"IFERROR(INDEX(List,SMALL(IF(List<>\"\",ROW(INDIRECT(\"1:\"&ROWS(List)))),ROWS($1:367))),\"\")","v":""},{"$f":"IFERROR(VLOOKUP(B368,Inputs_Rec.!$DB$6:$DC$372,2,FALSE),\"\")","v":""},{"$f":"IFERROR(VLOOKUP(B368,Inputs_Rec.!$DD$6:$DE$372,2,FALSE),\"\")","v":""},null,null,"",{"$f":"IFERROR(VLOOKUP(G368,Inputs_Rec.!$DF$6:$DG$372,2,FALSE),\"\")","v":""},null,"",{"$f":"IFERROR(VLOOKUP(J368,Inputs_Rec.!$DH$6:$DI$372,2,FALSE),\"\")","v":""}]
[null,{"$f":"IFERROR(INDEX(List,SMALL(IF(List<>\"\",ROW(INDIRECT(\"1:\"&ROWS(List)))),ROWS($1:368))),\"\")","v":""},{"$f":"IFERROR(VLOOKUP(B369,Inputs_Rec.!$DB$6:$DC$372,2,FALSE),\"\")","v":""},{"$f":"IFERROR(VLOOKUP(B369,Inputs_Rec.!$DD$6:$DE$372,2,FALSE),\"\")","v":""},null,null,"",{"$f":"IFERROR(VLOOKUP(G369,Inputs_Rec.!$DF$6:$DG$372,2,FALSE),\"\")","v":""},null,"",{"$f":"IFERROR(VLOOKUP(J369,Inputs_Rec.!$DH$6:$DI$372,2,FALSE),\"\")","v":""}]
[null,{"$f":"IFERROR(INDEX(List,SMALL(IF(List<>\"\",ROW(INDIRECT(\"1:\"&ROWS(List)))),ROWS($1:369))),\"\")","v":""},{"$f":"IFERROR(VLOOKUP(B370,Inputs_Rec.!$DB$6:$DC$372,2,FALSE),\"\")","v":""},{"$f":"IFERROR(VLOOKUP(B370,Inputs_Rec.!$DD$6:$DE$372,2,FALSE),\"\")","v":""},null,null,"",{"$f":"IFERROR(VLOOKUP(G370,Inputs_Rec.!$DF$6:$DG$372,2,FALSE),\"\")","v":""},null,"",{"$f":"IFERROR(VLOOKUP(J370,Inputs_Rec.!$DH$6:$DI$372,2,FALSE),\"\")","v":""}]
[null,{"$f":"IFERROR(INDEX(List,SMALL(IF(List<>\"\",ROW(INDIRECT(\"1:\"&ROWS(List)))),ROWS($1:370))),\"\")","v":""},{"$f":"IFERROR(VLOOKUP(B371,Inputs_Rec.!$DB$6:$DC$372,2,FALSE),\"\")","v":""},{"$f":"IFERROR(VLOOKUP(B371,Inputs_Rec.!$DD$6:$DE$372,2,FALSE),\"\")","v":""},null,null,"",{"$f":"IFERROR(VLOOKUP(G371,Inputs_Rec.!$DF$6:$DG$372,2,FALSE),\"\")","v":""},null,"",{"$f":"IFERROR(VLOOKUP(J371,Inputs_Rec.!$DH$6:$DI$372,2,FALSE),\"\")","v":""}]
[null,{"$f":"IFERROR(INDEX(List,SMALL(IF(List<>\"\",ROW(INDIRECT(\"1:\"&ROWS(List)))),ROWS($1:371))),\"\")","v":""},{"$f":"IFERROR(VLOOKUP(B372,Inputs_Rec.!$DB$6:$DC$372,2,FALSE),\"\")","v":""},{"$f":"IFERROR(VLOOKUP(B372,Inputs_Rec.!$DD$6:$DE$372,2,FALSE),\"\")","v":""},null,null,"",{"$f":"IFERROR(VLOOKUP(G372,Inputs_Rec.!$DF$6:$DG$372,2,FALSE),\"\")","v":""},null,"",{"$f":"IFERROR(VLOOKUP(J372,Inputs_Rec.!$DH$6:$DI$372,2,FALSE),\"\")","v":""}]
[null,{"$f":"IFERROR(INDEX(List,SMALL(IF(List<>\"\",ROW(INDIRECT(\"1:\"&ROWS(List)))),ROWS($1:372))),\"\")","v":""},{"$f":"IFERROR(VLOOKUP(B373,Inputs_Rec.!$DB$6:$DC$372,2,FALSE),\"\")","v":""},{"$f":"IFERROR(VLOOKUP(B373,Inputs_Rec.!$DD$6:$DE$372,2,FALSE),\"\")","v":""},null,null,"",{"$f":"IFERROR(VLOOKUP(G373,Inputs_Rec.!$DF$6:$DG$372,2,FALSE),\"\")","v":""},null,"",{"$f":"IFERROR(VLOOKUP(J373,Inputs_Rec.!$DH$6:$DI$372,2,FALSE),\"\")","v":""}]
[null,{"$f":"IFERROR(INDEX(List,SMALL(IF(List<>\"\",ROW(INDIRECT(\"1:\"&ROWS(List)))),ROWS($1:373))),\"\")","v":""},{"$f":"IFERROR(VLOOKUP(B374,Inputs_Rec.!$DB$6:$DC$372,2,FALSE),\"\")","v":""},{"$f":"IFERROR(VLOOKUP(B374,Inputs_Rec.!$DD$6:$DE$372,2,FALSE),\"\")","v":""},null,null,"",{"$f":"IFERROR(VLOOKUP(G374,Inputs_Rec.!$DF$6:$DG$372,2,FALSE),\"\")","v":""},null,"",{"$f":"IFERROR(VLOOKUP(J374,Inputs_Rec.!$DH$6:$DI$372,2,FALSE),\"\")","v":""}]
[null,{"$f":"IFERROR(INDEX(List,SMALL(IF(List<>\"\",ROW(INDIRECT(\"1:\"&ROWS(List)))),ROWS($1:374))),\"\")","v":""},{"$f":"IFERROR(VLOOKUP(B375,Inputs_Rec.!$DB$6:$DC$372,2,FALSE),\"\")","v":""},{"$f":"IFERROR(VLOOKUP(B375,Inputs_Rec.!$DD$6:$DE$372,2,FALSE),\"\")","v":""},null,null,"",{"$f":"IFERROR(VLOOKUP(G375,Inputs_Rec.!$DF$6:$DG$372,2,FALSE),\"\")","v":""},null,"",{"$f":"IFERROR(VLOOKUP(J375,Inputs_Rec.!$DH$6:$DI$372,2,FALSE),\"\")","v":""}]
[null,{"$f":"IFERROR(INDEX(List,SMALL(IF(List<>\"\",ROW(INDIRECT(\"1:\"&ROWS(List)))),ROWS($1:375))),\"\")","v":""},{"$f":"IFERROR(VLOOKUP(B376,Inputs_Rec.!$DB$6:$DC$372,2,FALSE),\"\")","v":""},{"$f":"IFERROR(VLOOKUP(B376,Inputs_Rec.!$DD$6:$DE$372,2,FALSE),\"\")","v":""},null,null,"",{"$f":"IFERROR(VLOOKUP(G376,Inputs_Rec.!$DF$6:$DG$372,2,FALSE),\"\")","v":""},null,"",{"$f":"IFERROR(VLOOKUP(J376,Inputs_Rec.!$DH$6:$DI$372,2,FALSE),\"\")","v":""}]
[null,{"$f":"IFERROR(INDEX(List,SMALL(IF(List<>\"\",ROW(INDIRECT(\"1:\"&ROWS(List)))),ROWS($1:376))),\"\")","v":""},{"$f":"IFERROR(VLOOKUP(B377,Inputs_Rec.!$DB$6:$DC$372,2,FALSE),\"\")","v":""},{"$f":"IFERROR(VLOOKUP(B377,Inputs_Rec.!$DD$6:$DE$372,2,FALSE),\"\")","v":""},null,null,"",{"$f":"IFERROR(VLOOKUP(G377,Inputs_Rec.!$DF$6:$DG$372,2,FALSE),\"\")","v":""},null,"",{"$f":"IFERROR(VLOOKUP(J377,Inputs_Rec.!$DH$6:$DI$372,2,FALSE),\"\")","v":""}]
[null,{"$f":"IFERROR(INDEX(List,SMALL(IF(List<>\"\",ROW(INDIRECT(\"1:\"&ROWS(List)))),ROWS($1:377))),\"\")","v":""},{"$f":"IFERROR(VLOOKUP(B378,Inputs_Rec.!$DB$6:$DC$372,2,FALSE),\"\")","v":""},{"$f":"IFERROR(VLOOKUP(B378,Inputs_Rec.!$DD$6:$DE$372,2,FALSE),\"\")","v":""},null,null,"",{"$f":"IFERROR(VLOOKUP(G378,Inputs_Rec.!$DF$6:$DG$372,2,FALSE),\"\")","v":""},null,"",{"$f":"IFERROR(VLOOKUP(J378,Inputs_Rec.!$DH$6:$DI$372,2,FALSE),\"\")","v":""}]
[null,{"$f":"IFERROR(INDEX(List,SMALL(IF(List<>\"\",ROW(INDIRECT(\"1:\"&ROWS(List)))),ROWS($1:378))),\"\")","v":""},{"$f":"IFERROR(VLOOKUP(B379,Inputs_Rec.!$DB$6:$DC$372,2,FALSE),\"\")","v":""},{"$f":"IFERROR(VLOOKUP(B379,Inputs_Rec.!$DD$6:$DE$372,2,FALSE),\"\")","v":""},null,null,"",{"$f":"IFERROR(VLOOKUP(G379,Inputs_Rec.!$DF$6:$DG$372,2,FALSE),\"\")","v":""},null,"",{"$f":"IFERROR(VLOOKUP(J379,Inputs_Rec.!$DH$6:$DI$372,2,FALSE),\"\")","v":""}]
[null,{"$f":"IFERROR(INDEX(List,SMALL(IF(List<>\"\",ROW(INDIRECT(\"1:\"&ROWS(List)))),ROWS($1:379))),\"\")","v":""},{"$f":"IFERROR(VLOOKUP(B380,Inputs_Rec.!$DB$6:$DC$372,2,FALSE),\"\")","v":""},{"$f":"IFERROR(VLOOKUP(B380,Inputs_Rec.!$DD$6:$DE$372,2,FALSE),\"\")","v":""},null,null,"",{"$f":"IFERROR(VLOOKUP(G380,Inputs_Rec.!$DF$6:$DG$372,2,FALSE),\"\")","v":""},null,"",{"$f":"IFERROR(VLOOKUP(J380,Inputs_Rec.!$DH$6:$DI$372,2,FALSE),\"\")","v":""}]
[null,{"$f":"IFERROR(INDEX(List,SMALL(IF(List<>\"\",ROW(INDIRECT(\"1:\"&ROWS(List)))),ROWS($1:380))),\"\")","v":""},{"$f":"IFERROR(VLOOKUP(B381,Inputs_Rec.!$DB$6:$DC$372,2,FALSE),\"\")","v":""},{"$f":"IFERROR(VLOOKUP(B381,Inputs_Rec.!$DD$6:$DE$372,2,FALSE),\"\")","v":""},null,null,"",{"$f":"IFERROR(VLOOKUP(G381,Inputs_Rec.!$DF$6:$DG$372,2,FALSE),\"\")","v":""},null,"",{"$f":"IFERROR(VLOOKUP(J381,Inputs_Rec.!$DH$6:$DI$372,2,FALSE),\"\")","v":""}]
[null,{"$f":"IFERROR(INDEX(List,SMALL(IF(List<>\"\",ROW(INDIRECT(\"1:\"&ROWS(List)))),ROWS($1:381))),\"\")","v":""},{"$f":"IFERROR(VLOOKUP(B382,Inputs_Rec.!$DB$6:$DC$372,2,FALSE),\"\")","v":""},{"$f":"IFERROR(VLOOKUP(B382,Inputs_Rec.!$DD$6:$DE$372,2,FALSE),\"\")","v":""},null,null,"",{"$f":"IFERROR(VLOOKUP(G382,Inputs_Rec.!$DF$6:$DG$372,2,FALSE),\"\")","v":""},null,"",{"$f":"IFERROR(VLOOKUP(J382,Inputs_Rec.!$DH$6:$DI$372,2,FALSE),\"\")","v":""}]
[null,{"$f":"#REF!","v":{"$error":"#REF!"}}]
[null,{"$f":"#REF!","v":{"$error":"#REF!"}}]
[null,{"$f":"#REF!","v":{"$error":"#REF!"}}]
[null,{"$f":"#REF!","v":{"$error":"#REF!"}}]
[null,{"$f":"#REF!","v":{"$error":"#REF!"}}]
[null,{"$f":"#REF!","v":{"$error":"#REF!"}}]
[null,{"$f":"#REF!","v":{"$error":"#REF!"}}]
[null,{"$f":"#REF!","v":{"$error":"#REF!"}}]
[null,{"$f":"#REF!","v":{"$error":"#REF!"}}]
[null,{"$f":"#REF!","v":{"$error":"#REF!"}}]
[null,{"$f":"#REF!","v":{"$error":"#REF!"}}]
[null,{"$f":"#REF!","v":{"$error":"#REF!"}}]
[null,{"$f":"#REF!","v":{"$error":"#REF!"}}]
[null,{"$f":"#REF!","v":{"$error":"#REF!"}}]
[null,{"$f":"#REF!","v":{"$error":"#REF!"}}]
[null,{"$f":"#REF!","v":{"$error":"#REF!"}}]
[null,{"$f":"#REF!","v":{"$error":"#REF!"}}]
[null,{"$f":"#REF!","v":{"$error":"#REF!"}}]
[null,{"$f":"#REF!","v":{"$error":"#REF!"}}]

{"sheet":"Translate","index":4,"n_rows":126,"n_cols":10,"rows_kept":126,"hidden":true}
[null,"LISTE DES MESURES/CONDITIONS/RECOMMANDATIONS","LIST OF MEASURES/RECOMMENDATIONS/CONDITIONS"]
[null,"Français","English"]
[null,"Instructions","Instructions"]
[null,"Instructions globales","Overall instructions"]
[null,"Ce fichier est destiné aux structures mettant en œuvre des activités du Fonds mondial. Il permet de suivre la mise en œuvre des recommandations/mesures et permet de remplir la feuille \"Gestion subvention_4\" du PU/PUDR","This file is intended for structures implementing Global Fund activities. It enables to follow up the implementation of the recommendations/measures and to complete the PU/PUDR “Grant management_4” sheet"]
[null,"Pour toute question: ","For any question:"]
[null,"Pour utiliser ce fichier, voici les instructions (les colonnes B, C, D, E, F, H, I, J, N et O sont a remplir obligatoirement)","To use this file, here are the instructions (columns B, C, D, E, F, H, I, J, N and O must be filled compulsorily)"]
[null,"a) Paramétrer ci-dessous au besoin la nature de l'état de réalisation et ou le type de mesures/recommandations","a) Set up below the state of achievement or type of activity, as needed"]
[null,"b) Se rendre au niveau de la Feuille \" Inputs_Rec.\". A ce niveau procéder comme suit (remplir toutes les 11 étapes):","b) Go to the “Inputs_Rec.” sheet. At this level, proceed as follows (complete all 11 steps):"]
[null,"b.1) Ecrire/saisir ou y copier l'intitule de la mesures/recommandations a la colonne B","b.1) Write/enter or copy the name of the measures/recommendations in column B"]
[null,"b.2) Préciser la nature ou le type de mesures/recommandations (liste de choix) dans la colonne C","b.2) Specify the nature or type of measures/recommendations (option list) in column C"]
[null,"b.3) Préciser le domaine concerne par mesures/recommandations (liste de choix) dans la colonne D","b.3) Specify the area of the measures/recommendations (option list) in column D"]
[null,"b.4) Préciser l'origine de la mesure/recommandation (liste de choix) dans la colonne E","b.4) Specify the origin of the measures/recommendations (option list) in column E"]
[null,"b.5) Préciser la structure responsable de mise en œuvre de  la mesure/recommandation (liste de choix) dans la colonne F","b.5) Specify the structure in charge of implementing the measure/recommendation (option list) in column F"]
[null,"b.6) Préciser l'appartenance de la structure (structure publique, association…) dans la colonne G","b.6) Specify the nature of the structure (public structure, association…) in column G"]
[null,"b.7) Préciser les structures impliquées dans la mise en œuvre des mesures/recommandations (a saisir) dans la colonne H","b.7) Specify the structures involved in the implementation of measures/recommendations (enter) in column H"]
[null,"b.8) Préciser la date butoir (deadline) pour la mise en œuvre de la mesure/recommandation (a saisir) dans la colonne I","b.8) Specify the deadline for the implementation of the measures/recommendations (enter) in column I"]
[null,"b.9) Actualiser régulièrement l'état des mesures/recommandations (liste de choix) dans la colonne J","b.9) Regularly update the state of measures/recommendations (option list) in column J"]
[null,"b.10) Identifier les produits qui doivent servir a lever les recommandations/Mesures dans la colonne N","b.10) Identify the products that should help to address the recommendations/measures in column N"]
[null,"b.11) Actualiser régulièrement les commentaires sur la mise en œuvre des mesures/recommandations dans la colonne O","b.11) Regularly update comments on the implementation of measures/activities in column O"]
[null,"c) Les résultats sont automatiques de la synthèse est automatique et consultables dans lieux ci-dessous","c) Results are automatic and the summary is automatic and can be consulted in the following locations"]
[null,"Liste des structures/personnes intervenant ","List of intervening structures /persons"]
[null,"Tableau de bord structures","Structures dashboard ",{"$nulls":6},"Satisfaite, "]
[null,"Tableau de bord domaines","Areas dashboard ",{"$nulls":6},"b. Non satisfaite - en cours "]
[null,"Tableau de bord des mesures/recommandations","Measures/Recommendations dashboard ",{"$nulls":6},"c. Non satisfaite - Non commencée"]
[null,"Paramétrage état de mise en œuvre","Implementation status set up "]
[null,"Selectionner","Select"]
[null,"Satisfait","Completed "]
[null,"Non satisfaite-en cours","Not completd and in progress"]
[null,"Non satisfaite - Non commencée","Not completed -Not started"]
[null,"Non commencé","Unstarted"]
[null,"Non applicable/Non valable","Not applicable/Non avalaible"]
[null,"Immédiat (réalisé)","Immediate (completed)"]
[null,"Immédiat (non réalisé)","Immediate (not completed)"]
[null,"Sans délai (en cours)","Without delay (in progress)"]
[null,"Sans délai (réalisé)","Without delay (completed)"]
[null,"Sans délai (non réalisé)","Without delay (not completed)"]
[null,"Delai depasse","Out of delay"]
[null,"Paramétrage des types de mesures/recommandations","Set up of types of Measures/Recommendations"]
[null,"Condition de l'accord ","Agreement measures "]
[null,"Mesures de gestion","Management measures "]
[null,"Recommandations OIG","OIG recommendations"]
[null,"Actions/recommandations Equipe pays","Country team actions/recommendations "]
[null,"Actions suite revue PU/PUDR","PU/PUDR action monitoring review"]
[null,"Actions/Recommandations LFA","LFA actions/recommendations "]
[null,"Actions/recommandations ICN","CCM actions/recommendations "]
[null,"Recommandations du PR vers les SR","PR recommendations to SR"]
[null,"Actions/recommandations d'audit interne","Internal audit actions/recommendations "]
[null,"Actions/recommandations d'audit externe","External audit actions/recommendations "]
[null,"Autres","Other"]
[null,"Liste des personnes/structures intervenant ","List of involved structures or persons"]
[null,"Inputs-Rec",{"$f":"B52","v":"Inputs-Rec"}]
[null,"Recommandations et mesures","Recommendations and measures "]
[null,"Décisions, Mesures, Recommandations","Decision, Measures or Recommendations"]
[null,"Type/Nature ","Type/Nature "]
[null,"Domaines","Areas"]
[null,"Origine","Origin"]
[null,"Responsable de mise en œuvre","In charge of implementation "]
[null,"Nature de la structure responsable","Nature of the structure in charge "]
[null,"Personnes/ structures  Impliquées","Involved people/structures "]
[null,"Date butoir (Dernier délai)","Deadline "]
[null,"Etat de mise en œuvre ","State of implementation "]
[null,"Jours restants/ dépassés","Days remaining/ exceeded "]
[null,"Eléments de vérification de la réalisation","Elements to check achievement/completion "]
[null,"Observations/ Commentaires/ Explications","Remarks/ comments/ explanations "]
[null,"Recommandations/Mesures en attente","Pending Recommendations/Measures "]
[null,{"$f":"UPPER(\"Recommandations et mesures non encore mises en œuvre\")","v":"RECOMMANDATIONS ET MESURES NON ENCORE MISES EN ŒUVRE"},{"$f":"UPPER(\"Pendings Recommendations and measures\")","v":"PENDINGS RECOMMENDATIONS AND MEASURES"}]
[null,"Numéro","Number"]
[null,"Intitule Recommandations/Mesures","Designation of recommendations/measures "]
[null,"Catégorie","Category "]
[null,"Responsable de la mise en œuvre","In charge of implementation "]
[null,"Date limite","Deadline "]
[null,"Tableau de bord structures","Structure dashboard"]
[null,"Nombre total de Recommandations/ Décisions par type","Total number of recommendations/decisions per type"]
[null,"Nombre de Recommandations/Décisions par structure","Total number of recommendations/decisions per structure "]
[null,"Nombre de Recommandations/Décisions par structure","Total number of recommendations/decisions per structure"]
[null,"Nombre total de Recommandations/ Décisions","Total number of recommendations/decisions "]
[null,{"$f":"UPPER(\"Synthèse par domaines\")","v":"SYNTHÈSE PAR DOMAINES"},{"$f":"UPPER(\"Summary per area\")","v":"SUMMARY PER AREA"}]
[null,{"$f":"UPPER(\"Synthèse des recommandations/mesures par type\")","v":"SYNTHÈSE DES RECOMMANDATIONS/MESURES PAR TYPE"},{"$f":"UPPER(\"Summary of recommendations/measures per type\")","v":"SUMMARY OF RECOMMENDATIONS/MEASURES PER TYPE"}]
[null,"LANGUE","LANGAGE"]
[null,"OUTIL STANDARD DE SUIVI DES MESURES/RECOMMANDATIONS/CONDITIONS/ACTIVITES","STANDARD  TOOL FOR THE MONITORING OF THE MEASURES/RECOMMENDATIONS/CONDITIONS /ACTIVITIES"]
[null,"PAYS","COUNTRY"]
[null,"NOM DU PR","PR NAME"]
[null,"DATE  DEBUT SUBVENTION","SUBVENTION BEGINNING DATE"]
[null,"Selectionner","Select"]
[null,"VIH","HIV"]
[null,"TB","TB"]
[null,"TB/VIH","HIV/TB"]
[null,"PALUDISME","MALARIA"]
[null,"RSS","HSS"]
[null,"VIH/RSS","HIV/HSS"]
[null,"TB/RSS","TB/RSS"]
[null,"VIH/TB/RSS","HIV/TB/HSS"]
[null,"PALUDISME/RSS","MALARIA/HSS"]
[null,"SUBVENTION","GRANT"]
[null,"RESPONSABLE DE LA BONNE TENUE DU FICHIER","RESPONSIBLE FOR KEEPING FILE"]
[null,"GESTIONNAIRE PR","PR MANAGER"]
[null,"Fonds Mondial","Global Fund"]
[null,"ICN/CCM","CCM"]
[null,"PR","PR"]
[null,"SR","SR"]
[null,"Agent local du Fonds (LFA)","Local fund Agent"]
[null,"Agent fiscal","Fiscal agency"]
[null,"Ministere de la sante","Ministry of health (MOH)"]
[null,"Ministere des finances","Ministry of finance"]
[null,"Autres","Others"]
[null,"Delai depasse","Timeout"]
[null,"Dans moins de 2 semaines","In less than 2 weeks"]
[null,"Dans plus de 2 semaines","In over 2 weeks"]
[null,"Vigilance","Alertness"]
[null,{"$f":"UPPER(\"Saisie et suivi des mesures/recommandations\")","v":"SAISIE ET SUIVI DES MESURES/RECOMMANDATIONS"},{"$f":"UPPER(\"Entry and monitoring of measures / recommendations\")","v":"ENTRY AND MONITORING OF MEASURES / RECOMMENDATIONS"}]
[null,"Gestion du programme","Program management"]
[null,"Gouvernance nationale","National governance"]
[null,"Suivi evaluation","Monitoring and evaluation"]
[null,"Gestion des achats/stocks","Procurement & Supply management"]
[null,"Finances","Finances"]
[null,"Autres","Others"]
[null,"Selectionner","Select"]
[null,"Struture publique","Public institution"]
[null,"Struture privee","Pivate institution"]
[null,"Societe civile (Assoc. ONG..)","Civil society organization (CSO's)"]
[null,"ONG/Structures internationales","NGO's/ International institutions"]
[null,"Partenaires ","Parteners"]
[null,"Autres","Others"]
[null,"INSTRUCTIONS","GUIDELINES"]
[null,"Pour choisir le menu, il faut cliquer sur la liste de choix ci-dessous. Cela ouvre automatiquement la feuille excel correspondate","To choose the menu, you must click on the selection list below. This automatically opens the excel sheet correspondate"]

{"sheet":"Dashboard_Structures","index":5,"n_rows":30,"n_cols":21,"rows_kept":30,"merged":[[0,0,0,10],[0,18,0,20],[1,1,1,2],[2,1,2,2],[3,1,3,16]]}
[{"$f":"IF(Setup!$F$9=1,Translate!B78,Translate!C78)","v":"SYNTHÈSE PAR DOMAINES"},{"$nulls":17},{"$f":"IF(Setup!$F$9=1,Translate!B110,Translate!C110)","v":"Vigilance"}]
[{"$nulls":3},"Total",{"$f":"Inputs_Rec.!BI5","v":"Satisfait"},{"$f":"Inputs_Rec.!BJ5","v":"Non satisfaite-en cours"},{"$f":"Inputs_Rec.!BK5","v":"Non satisfaite - Non commencée"},{"$f":"Inputs_Rec.!BL5","v":"Non commencé"},{"$f":"Inputs_Rec.!BO5","v":"Delai depasse"},{"$f":"Inputs_Rec.!BM5","v":"Non applicable/Non valable"},{"$f":"Inputs_Rec.!BN5","v":"Immédiat (réalisé)"},{"$f":"Inputs_Rec.!BO5","v":"Delai depasse"},{"$f":"Inputs_Rec.!BP5","v":0},{"$f":"Inputs_Rec.!CX5","v":"Immédiat (non réalisé)"},{"$f":"Inputs_Rec.!CY5","v":"Sans délai (en cours)"},{"$f":"Inputs_Rec.!CZ5","v":"Sans délai (réalisé)"},{"$f":"Inputs_Rec.!DA5","v":"Sans délai (non réalisé)"},null,{"$f":"IF(Setup!$F$9=1,Translate!B107,Translate!C107)","v":"Delai depasse"},{"$f":"IF(Setup!$F$9=1,Translate!B108,Translate!C108)","v":"Dans moins de 2 semaines"},{"$f":"IF(Setup!$F$9=1,Translate!B109,Translate!C109)","v":"Dans plus de 2 semaines"}]
[null,{"$f":"IF(Setup!$F$9=1,Translate!B77,Translate!C77)","v":"Nombre total de Recommandations/ Décisions"},null,{"$f":"IF(SUM(Inputs_Rec.!BH6:'Inputs_Rec.'!BH373)=0,\"\",SUM(Inputs_Rec.!BH6:'Inputs_Rec.'!BH373))","v":1},{"$f":"IF(SUM(Inputs_Rec.!BI6:'Inputs_Rec.'!BI373)=0,\"\",SUM(Inputs_Rec.!BI6:'Inputs_Rec.'!BI373))","v":""},{"$f":"IF(SUM(Inputs_Rec.!BJ6:'Inputs_Rec.'!BJ373)=0,\"\",SUM(Inputs_Rec.!BJ6:'Inputs_Rec.'!BJ373))","v":1},{"$f":"IF(SUM(Inputs_Rec.!BK6:'Inputs_Rec.'!BK373)=0,\"\",SUM(Inputs_Rec.!BK6:'Inputs_Rec.'!BK373))","v":""},{"$f":"IF(SUM(Inputs_Rec.!BL6:'Inputs_Rec.'!BL373)=0,\"\",SUM(Inputs_Rec.!BL6:'Inputs_Rec.'!BL373))","v":""},{"$f":"IF(SUM(Inputs_Rec.!BO6:'Inputs_Rec.'!BO373)=0,\"\",SUM(Inputs_Rec.!BO6:'Inputs_Rec.'!BO373))","v":1},{"$f":"IF(SUM(Inputs_Rec.!BM6:'Inputs_Rec.'!BM373)=0,\"\",SUM(Inputs_Rec.!BM6:'Inputs_Rec.'!BM373))","v":""},{"$f":"IF(SUM(Inputs_Rec.!BN6:'Inputs_Rec.'!BN373)=0,\"\",SUM(Inputs_Rec.!BN6:'Inputs_Rec.'!BN373))","v":""},null,null,{"$f":"IF(SUM(Inputs_Rec.!CX6:'Inputs_Rec.'!CX373)=0,\"\",SUM(Inputs_Rec.!CX6:'Inputs_Rec.'!CX373))","v":""},{"$f":"IF(SUM(Inputs_Rec.!CY6:'Inputs_Rec.'!CY373)=0,\"\",SUM(Inputs_Rec.!CY6:'Inputs_Rec.'!CY373))","v":""},{"$f":"IF(SUM(Inputs_Rec.!CZ6:'Inputs_Rec.'!CZ373)=0,\"\",SUM(Inputs_Rec.!CZ6:'Inputs_Rec.'!CZ373))","v":""},{"$f":"IF(SUM(Inputs_Rec.!DA6:'Inputs_Rec.'!DA373)=0,\"\",SUM(Inputs_Rec.!DA6:'Inputs_Rec.'!DA373))","v":""},null,{"$f":"IF(OR(I3=\"\",OR(I3=0)),\"\",I3)","v":1},{"$f":"IF(SUM(Inputs_Rec.!CI6:CI373)=0,\"\",SUM(Inputs_Rec.!CI6:CI373))","v":""},{"$f":"IF(SUM(Inputs_Rec.!CJ6:CJ373)=0,\"\",SUM(Inputs_Rec.!CJ6:CJ373))","v":""}]
[null,{"$f":"IF(Setup!$F$9=1,Translate!B76,Translate!C76)","v":"Nombre de Recommandations/Décisions par structure"}]
[null,null,{"$f":"IF(M5=0,\"\",M5)","v":"CNLS"},{"$f":"SUM(Inputs_Rec.!AR6:'Inputs_Rec.'!AR373)","v":1},{"$f":"SUMIF(Inputs_Rec.!$AR$6:$AR$373,1,Inputs_Rec.!$BI$6:$BI$373)","v":0},{"$f":"SUMIF(Inputs_Rec.!$AR$6:$AR$373,1,Inputs_Rec.!$BJ$6:$BJ$373)","v":1},{"$f":"SUMIF(Inputs_Rec.!$AR$6:$AR$373,1,Inputs_Rec.!$BK$6:$BK$373)","v":0},{"$f":"SUMIF(Inputs_Rec.!$AR$6:$AR$373,1,Inputs_Rec.!$BL$6:$BL$373)","v":0},{"$f":"SUMIF(Inputs_Rec.!$AR$6:$AR$373,1,Inputs_Rec.!$BO$6:$BO$373)","v":1},{"$f":"SUMIF(Inputs_Rec.!$AR$6:$AR$373,1,Inputs_Rec.!$BM$6:$BM$373)","v":0},{"$f":"SUMIF(Inputs_Rec.!$AR$6:$AR$373,1,Inputs_Rec.!$BN$6:$BN$373)","v":0},null,{"$f":"Inputs_Rec.!AN375","v":"CNLS"},{"$f":"SUMIF(Inputs_Rec.!$AR$6:$AR$373,1,Inputs_Rec.!$CX$6:$CX$373)","v":0},{"$f":"SUMIF(Inputs_Rec.!$AR$6:$AR$373,1,Inputs_Rec.!$CY$6:$CY$373)","v":0},{"$f":"SUMIF(Inputs_Rec.!$AR$6:$AR$373,1,Inputs_Rec.!$CZ$6:$CZ$373)","v":0},{"$f":"SUMIF(Inputs_Rec.!$AR$6:$AR$373,1,Inputs_Rec.!$DA$6:$DA$373)","v":0},null,{"$f":"IF(OR(I5=\"\",OR(I5=0)),\"\",I5)","v":1},{"$f":"IF(OR(SUMIF(Inputs_Rec.!$AR$6:$AR$372,1,Inputs_Rec.!$CI$6:$CI$372)=0,OR(SUMIF(Inputs_Rec.!$AR$6:$AR$372,1,Inputs_Rec.!$CI$6:$CI$372)=\"\")),\"\",SUMIF(Inputs_Rec.!$AR$6:$AR$372,1,Inputs_Rec.!$CI$6:$CI$372))","v":""},{"$f":"IF(OR(SUMIF(Inputs_Rec.!$AR$6:$AR$372,1,Inputs_Rec.!$CJ$6:$CJ$372)=0,OR(SUMIF(Inputs_Rec.!$AR$6:$AR$372,1,Inputs_Rec.!$CJ$6:$CJ$372)=\"\")),\"\",SUMIF(Inputs_Rec.!$AR$6:$AR$372,1,Inputs_Rec.!$CJ$6:$CJ$372))","v":""}]
[null,null,{"$f":"IF(M6=0,\"\",M6)","v":"PNLS"},{"$f":"SUM(Inputs_Rec.!AS6:'Inputs_Rec.'!AS373)","v":0},{"$f":"SUMIF(Inputs_Rec.!$AS$6:$AS$373,1,Inputs_Rec.!$BI$6:$BI$373)","v":0},{"$f":"SUMIF(Inputs_Rec.!$AS$6:$AS$373,1,Inputs_Rec.!$BJ$6:$BJ$373)","v":0},{"$f":"SUMIF(Inputs_Rec.!$AS$6:$AS$373,1,Inputs_Rec.!$BK$6:$BK$373)","v":0},{"$f":"SUMIF(Inputs_Rec.!$AS$6:$AS$373,1,Inputs_Rec.!$BL$6:$BL$373)","v":0},{"$f":"SUMIF(Inputs_Rec.!$AS$6:$AS$373,1,Inputs_Rec.!$BO$6:$BO$373)","v":0},{"$f":"SUMIF(Inputs_Rec.!$AS$6:$AS$373,1,Inputs_Rec.!$BM$6:$BM$373)","v":0},{"$f":"SUMIF(Inputs_Rec.!$AS$6:$AS$373,1,Inputs_Rec.!$BN$6:$BN$373)","v":0},null,{"$f":"Inputs_Rec.!AN376","v":"PNLS"},{"$f":"SUMIF(Inputs_Rec.!$AS$6:$AS$373,1,Inputs_Rec.!$CX$6:$CX$373)","v":0},{"$f":"SUMIF(Inputs_Rec.!$AS$6:$AS$373,1,Inputs_Rec.!$CY$6:$CY$373)","v":0},{"$f":"SUMIF(Inputs_Rec.!$AS$6:$AS$373,1,Inputs_Rec.!$CZ$6:$CZ$373)","v":0},{"$f":"SUMIF(Inputs_Rec.!$AS$6:$AS$373,1,Inputs_Rec.!$DA$6:$DA$373)","v":0},null,{"$f":"IF(OR(I6=\"\",OR(I6=0)),\"\",I6)","v":""},{"$f":"IF(OR(SUMIF(Inputs_Rec.!$AS$6:$AS$372,1,Inputs_Rec.!$CI$6:$CI$372)=0,OR(SUMIF(Inputs_Rec.!$AS$6:$AS$372,1,Inputs_Rec.!$CI$6:$CI$372)=\"\")),\"\",SUMIF(Inputs_Rec.!$AS$6:$AS$372,1,Inputs_Rec.!$CI$6:$CI$372))","v":""},{"$f":"IF(OR(SUMIF(Inputs_Rec.!$AS$6:$AS$372,1,Inputs_Rec.!$CJ$6:$CJ$372)=0,OR(SUMIF(Inputs_Rec.!$AS$6:$AS$372,1,Inputs_Rec.!$CJ$6:$CJ$372)=\"\")),\"\",SUMIF(Inputs_Rec.!$AS$6:$AS$372,1,Inputs_Rec.!$CJ$6:$CJ$372))","v":""}]
[null,null,"",{"$f":"SUM(Inputs_Rec.!AT6:'Inputs_Rec.'!AT373)","v":0},{"$f":"SUMIF(Inputs_Rec.!$AT$6:$AT$373,1,Inputs_Rec.!$BI$6:$BI$373)","v":0},{"$f":"SUMIF(Inputs_Rec.!$AT$6:$AT$373,1,Inputs_Rec.!$BJ$6:$BJ$373)","v":0},{"$f":"SUMIF(Inputs_Rec.!$AT$6:$AT$373,1,Inputs_Rec.!$BK$6:$BK$373)","v":0},{"$f":"SUMIF(Inputs_Rec.!$AT$6:$AT$373,1,Inputs_Rec.!$BL$6:$BL$373)","v":0},{"$f":"SUMIF(Inputs_Rec.!$AT$6:$AT$373,1,Inputs_Rec.!$BO$6:$BO$373)","v":0},{"$f":"SUMIF(Inputs_Rec.!$AT$6:$AT$373,1,Inputs_Rec.!$BM$6:$BM$373)","v":0},{"$f":"SUMIF(Inputs_Rec.!$AT$6:$AT$373,1,Inputs_Rec.!$BN$6:$BN$373)","v":0},null,{"$f":"Inputs_Rec.!AN377","v":0},{"$f":"SUMIF(Inputs_Rec.!$AT$6:$AT$373,1,Inputs_Rec.!$CX$6:$CX$373)","v":0},{"$f":"SUMIF(Inputs_Rec.!$AT$6:$AT$373,1,Inputs_Rec.!$CY$6:$CY$373)","v":0},{"$f":"SUMIF(Inputs_Rec.!$AT$6:$AT$373,1,Inputs_Rec.!$CZ$6:$CZ$373)","v":0},{"$f":"SUMIF(Inputs_Rec.!$AT$6:$AT$373,1,Inputs_Rec.!$DA$6:$DA$373)","v":0},null,"",{"$f":"IF(OR(SUMIF(Inputs_Rec.!$AT$6:$AT$372,1,Inputs_Rec.!$CI$6:$CI$372)=0,OR(SUMIF(Inputs_Rec.!$AT$6:$AT$372,1,Inputs_Rec.!$CI$6:$CI$372)=\"\")),\"\",SUMIF(Inputs_Rec.!$AT$6:$AT$372,1,Inputs_Rec.!$CI$6:$CI$372))","v":""},{"$f":"IF(OR(SUMIF(Inputs_Rec.!$AT$6:$AT$372,1,Inputs_Rec.!$CJ$6:$CJ$372)=0,OR(SUMIF(Inputs_Rec.!$AT$6:$AT$372,1,Inputs_Rec.!$CJ$6:$CJ$372)=\"\")),\"\",SUMIF(Inputs_Rec.!$AT$6:$AT$372,1,Inputs_Rec.!$CJ$6:$CJ$372))","v":""}]
[null,null,"",{"$f":"SUM(Inputs_Rec.!AU6:'Inputs_Rec.'!AU373)","v":0},{"$f":"SUMIF(Inputs_Rec.!$AU$6:$AU$373,1,Inputs_Rec.!$BI$6:$BI$373)","v":0},{"$f":"SUMIF(Inputs_Rec.!$AU$6:$AU$373,1,Inputs_Rec.!$BJ$6:$BJ$373)","v":0},{"$f":"SUMIF(Inputs_Rec.!$AU$6:$AU$373,1,Inputs_Rec.!$BK$6:$BK$373)","v":0},{"$f":"SUMIF(Inputs_Rec.!$AU$6:$AU$373,1,Inputs_Rec.!$BL$6:$BL$373)","v":0},{"$f":"SUMIF(Inputs_Rec.!$AU$6:$AU$373,1,Inputs_Rec.!$BO$6:$BO$373)","v":0},{"$f":"SUMIF(Inputs_Rec.!$AU$6:$AU$373,1,Inputs_Rec.!$BM$6:$BM$373)","v":0},{"$f":"SUMIF(Inputs_Rec.!$AU$6:$AU$373,1,Inputs_Rec.!$BN$6:$BN$373)","v":0},null,{"$f":"Inputs_Rec.!AN378","v":0},{"$f":"SUMIF(Inputs_Rec.!$AU$6:$AU$373,1,Inputs_Rec.!$CX$6:$CX$373)","v":0},{"$f":"SUMIF(Inputs_Rec.!$AU$6:$AU$373,1,Inputs_Rec.!$CY$6:$CY$373)","v":0},{"$f":"SUMIF(Inputs_Rec.!$AU$6:$AU$373,1,Inputs_Rec.!$CZ$6:$CZ$373)","v":0},{"$f":"SUMIF(Inputs_Rec.!$AU$6:$AU$373,1,Inputs_Rec.!$DA$6:$DA$373)","v":0},null,"",{"$f":"IF(OR(SUMIF(Inputs_Rec.!$AU$6:$AU$372,1,Inputs_Rec.!$CI$6:$CI$372)=0,OR(SUMIF(Inputs_Rec.!$AU$6:$AU$372,1,Inputs_Rec.!$CI$6:$CI$372)=\"\")),\"\",SUMIF(Inputs_Rec.!$AU$6:$AU$372,1,Inputs_Rec.!$CI$6:$CI$372))","v":""},{"$f":"IF(OR(SUMIF(Inputs_Rec.!$AU$6:$AU$372,1,Inputs_Rec.!$CJ$6:$CJ$372)=0,OR(SUMIF(Inputs_Rec.!$AU$6:$AU$372,1,Inputs_Rec.!$CJ$6:$CJ$372)=\"\")),\"\",SUMIF(Inputs_Rec.!$AU$6:$AU$372,1,Inputs_Rec.!$CJ$6:$CJ$372))","v":""}]
[null,null,"",{"$f":"SUM(Inputs_Rec.!AV6:'Inputs_Rec.'!AV373)","v":0},{"$f":"SUMIF(Inputs_Rec.!$AV$6:$AV$373,1,Inputs_Rec.!$BI$6:$BI$373)","v":0},{"$f":"SUMIF(Inputs_Rec.!$AV$6:$AV$373,1,Inputs_Rec.!$BJ$6:$BJ$373)","v":0},{"$f":"SUMIF(Inputs_Rec.!$AV$6:$AV$373,1,Inputs_Rec.!$BK$6:$BK$373)","v":0},{"$f":"SUMIF(Inputs_Rec.!$AV$6:$AV$373,1,Inputs_Rec.!$BL$6:$BL$373)","v":0},{"$f":"SUMIF(Inputs_Rec.!$AV$6:$AV$373,1,Inputs_Rec.!$BO$6:$BO$373)","v":0},{"$f":"SUMIF(Inputs_Rec.!$AV$6:$AV$373,1,Inputs_Rec.!$BM$6:$BM$373)","v":0},{"$f":"SUMIF(Inputs_Rec.!$AV$6:$AV$373,1,Inputs_Rec.!$BN$6:$BN$373)","v":0},null,{"$f":"Inputs_Rec.!AN379","v":0},{"$f":"SUMIF(Inputs_Rec.!$AV$6:$AV$373,1,Inputs_Rec.!$CX$6:$CX$373)","v":0},{"$f":"SUMIF(Inputs_Rec.!$AV$6:$AV$373,1,Inputs_Rec.!$CY$6:$CY$373)","v":0},{"$f":"SUMIF(Inputs_Rec.!$AV$6:$AV$373,1,Inputs_Rec.!$CZ$6:$CZ$373)","v":0},{"$f":"SUMIF(Inputs_Rec.!$AV$6:$AV$373,1,Inputs_Rec.!$DA$6:$DA$373)","v":0},null,"",{"$f":"IF(OR(SUMIF(Inputs_Rec.!$AV$6:$AV$372,1,Inputs_Rec.!$CI$6:$CI$372)=0,OR(SUMIF(Inputs_Rec.!$AV$6:$AV$372,1,Inputs_Rec.!$CI$6:$CI$372)=\"\")),\"\",SUMIF(Inputs_Rec.!$AV$6:$AV$372,1,Inputs_Rec.!$CI$6:$CI$372))","v":""},{"$f":"IF(OR(SUMIF(Inputs_Rec.!$AV$6:$AV$372,1,Inputs_Rec.!$CJ$6:$CJ$372)=0,OR(SUMIF(Inputs_Rec.!$AV$6:$AV$372,1,Inputs_Rec.!$CJ$6:$CJ$372)=\"\")),\"\",SUMIF(Inputs_Rec.!$AV$6:$AV$372,1,Inputs_Rec.!$CJ$6:$CJ$372))","v":""}]
[null,null,"",{"$f":"SUM(Inputs_Rec.!AW6:'Inputs_Rec.'!AW373)","v":0},{"$f":"SUMIF(Inputs_Rec.!$AW$6:$AW$373,1,Inputs_Rec.!$BI$6:$BI$373)","v":0},{"$f":"SUMIF(Inputs_Rec.!$AW$6:$AW$373,1,Inputs_Rec.!$BJ$6:$BJ$373)","v":0},{"$f":"SUMIF(Inputs_Rec.!$AW$6:$AW$373,1,Inputs_Rec.!$BK$6:$BK$373)","v":0},{"$f":"SUMIF(Inputs_Rec.!$AW$6:$AW$373,1,Inputs_Rec.!$BL$6:$BL$373)","v":0},{"$f":"SUMIF(Inputs_Rec.!$AW$6:$AW$373,1,Inputs_Rec.!$BO$6:$BO$373)","v":0},{"$f":"SUMIF(Inputs_Rec.!$AW$6:$AW$373,1,Inputs_Rec.!$BM$6:$BM$373)","v":0},{"$f":"SUMIF(Inputs_Rec.!$AW$6:$AW$373,1,Inputs_Rec.!$BN$6:$BN$373)","v":0},null,{"$f":"Inputs_Rec.!AN380","v":0},{"$f":"SUMIF(Inputs_Rec.!$AW$6:$AW$373,1,Inputs_Rec.!$CX$6:$CX$373)","v":0},{"$f":"SUMIF(Inputs_Rec.!$AW$6:$AW$373,1,Inputs_Rec.!$CY$6:$CY$373)","v":0},{"$f":"SUMIF(Inputs_Rec.!$AW$6:$AW$373,1,Inputs_Rec.!$CZ$6:$CZ$373)","v":0},{"$f":"SUMIF(Inputs_Rec.!$AW$6:$AW$373,1,Inputs_Rec.!$DA$6:$DA$373)","v":0},null,"",{"$f":"IF(OR(SUMIF(Inputs_Rec.!$AW$6:$AW$372,1,Inputs_Rec.!$CI$6:$CI$372)=0,OR(SUMIF(Inputs_Rec.!$AW$6:$AW$372,1,Inputs_Rec.!$CI$6:$CI$372)=\"\")),\"\",SUMIF(Inputs_Rec.!$AW$6:$AW$372,1,Inputs_Rec.!$CI$6:$CI$372))","v":""},{"$f":"IF(OR(SUMIF(Inputs_Rec.!$AW$6:$AW$372,1,Inputs_Rec.!$CJ$6:$CJ$372)=0,OR(SUMIF(Inputs_Rec.!$AW$6:$AW$372,1,Inputs_Rec.!$CJ$6:$CJ$372)=\"\")),\"\",SUMIF(Inputs_Rec.!$AW$6:$AW$372,1,Inputs_Rec.!$CJ$6:$CJ$372))","v":""}]
[null,null,"",{"$f":"SUM(Inputs_Rec.!AX6:'Inputs_Rec.'!AX373)","v":0},{"$f":"SUMIF(Inputs_Rec.!$AX$6:$AX$373,1,Inputs_Rec.!$BI$6:$BI$373)","v":0},{"$f":"SUMIF(Inputs_Rec.!$AX$6:$AX$373,1,Inputs_Rec.!$BJ$6:$BJ$373)","v":0},{"$f":"SUMIF(Inputs_Rec.!$AX$6:$AX$373,1,Inputs_Rec.!$BK$6:$BK$373)","v":0},{"$f":"SUMIF(Inputs_Rec.!$AX$6:$AX$373,1,Inputs_Rec.!$BL$6:$BL$373)","v":0},{"$f":"SUMIF(Inputs_Rec.!$AX$6:$AX$373,1,Inputs_Rec.!$BO$6:$BO$373)","v":0},{"$f":"SUMIF(Inputs_Rec.!$AX$6:$AX$373,1,Inputs_Rec.!$BM$6:$BM$373)","v":0},{"$f":"SUMIF(Inputs_Rec.!$AX$6:$AX$373,1,Inputs_Rec.!$BN$6:$BN$373)","v":0},null,{"$f":"Inputs_Rec.!AN381","v":0},{"$f":"SUMIF(Inputs_Rec.!$AX$6:$AX$373,1,Inputs_Rec.!$CX$6:$CX$373)","v":0},{"$f":"SUMIF(Inputs_Rec.!$AX$6:$AX$373,1,Inputs_Rec.!$CY$6:$CY$373)","v":0},{"$f":"SUMIF(Inputs_Rec.!$AX$6:$AX$373,1,Inputs_Rec.!$CZ$6:$CZ$373)","v":0},{"$f":"SUMIF(Inputs_Rec.!$AX$6:$AX$373,1,Inputs_Rec.!$DA$6:$DA$373)","v":0},null,"",{"$f":"IF(OR(SUMIF(Inputs_Rec.!$AX$6:$AX$372,1,Inputs_Rec.!$CI$6:$CI$372)=0,OR(SUMIF(Inputs_Rec.!$AX$6:$AX$372,1,Inputs_Rec.!$CI$6:$CI$372)=\"\")),\"\",SUMIF(Inputs_Rec.!$AX$6:$AX$372,1,Inputs_Rec.!$CI$6:$CI$372))","v":""},{"$f":"IF(OR(SUMIF(Inputs_Rec.!$AX$6:$AX$372,1,Inputs_Rec.!$CJ$6:$CJ$372)=0,OR(SUMIF(Inputs_Rec.!$AX$6:$AX$372,1,Inputs_Rec.!$CJ$6:$CJ$372)=\"\")),\"\",SUMIF(Inputs_Rec.!$AX$6:$AX$372,1,Inputs_Rec.!$CJ$6:$CJ$372))","v":""}]
[null,null,"",{"$f":"SUM(Inputs_Rec.!AY6:'Inputs_Rec.'!AY373)","v":0},{"$f":"SUMIF(Inputs_Rec.!$AY$6:$AY$373,1,Inputs_Rec.!$BI$6:$BI$373)","v":0},{"$f":"SUMIF(Inputs_Rec.!$AY$6:$AY$373,1,Inputs_Rec.!$BJ$6:$BJ$373)","v":0},{"$f":"SUMIF(Inputs_Rec.!$AY$6:$AY$373,1,Inputs_Rec.!$BK$6:$BK$373)","v":0},{"$f":"SUMIF(Inputs_Rec.!$AY$6:$AY$373,1,Inputs_Rec.!$BL$6:$BL$373)","v":0},{"$f":"SUMIF(Inputs_Rec.!$AY$6:$AY$373,1,Inputs_Rec.!$BO$6:$BO$373)","v":0},{"$f":"SUMIF(Inputs_Rec.!$AY$6:$AY$373,1,Inputs_Rec.!$BM$6:$BM$373)","v":0},{"$f":"SUMIF(Inputs_Rec.!$AY$6:$AY$373,1,Inputs_Rec.!$BN$6:$BN$373)","v":0},null,{"$f":"Inputs_Rec.!AN382","v":0},{"$f":"SUMIF(Inputs_Rec.!$AY$6:$AY$373,1,Inputs_Rec.!$CX$6:$CX$373)","v":0},{"$f":"SUMIF(Inputs_Rec.!$AY$6:$AY$373,1,Inputs_Rec.!$CY$6:$CY$373)","v":0},{"$f":"SUMIF(Inputs_Rec.!$AY$6:$AY$373,1,Inputs_Rec.!$CZ$6:$CZ$373)","v":0},{"$f":"SUMIF(Inputs_Rec.!$AY$6:$AY$373,1,Inputs_Rec.!$DA$6:$DA$373)","v":0},null,"",{"$f":"IF(OR(SUMIF(Inputs_Rec.!$AY$6:$AY$372,1,Inputs_Rec.!$CI$6:$CI$372)=0,OR(SUMIF(Inputs_Rec.!$AY$6:$AY$372,1,Inputs_Rec.!$CI$6:$CI$372)=\"\")),\"\",SUMIF(Inputs_Rec.!$AY$6:$AY$372,1,Inputs_Rec.!$CI$6:$CI$372))","v":""},{"$f":"IF(OR(SUMIF(Inputs_Rec.!$AY$6:$AY$372,1,Inputs_Rec.!$CJ$6:$CJ$372)=0,OR(SUMIF(Inputs_Rec.!$AY$6:$AY$372,1,Inputs_Rec.!$CJ$6:$CJ$372)=\"\")),\"\",SUMIF(Inputs_Rec.!$AY$6:$AY$372,1,Inputs_Rec.!$CJ$6:$CJ$372))","v":""}]
[null,null,"",{"$f":"SUM(Inputs_Rec.!AZ6:'Inputs_Rec.'!AZ373)","v":0},{"$f":"SUMIF(Inputs_Rec.!$AZ$6:$AZ$373,1,Inputs_Rec.!$BI$6:$BI$373)","v":0},{"$f":"SUMIF(Inputs_Rec.!$AZ$6:$AZ$373,1,Inputs_Rec.!$BJ$6:$BJ$373)","v":0},{"$f":"SUMIF(Inputs_Rec.!$AZ$6:$AZ$373,1,Inputs_Rec.!$BK$6:$BK$373)","v":0},{"$f":"SUMIF(Inputs_Rec.!$AZ$6:$AZ$373,1,Inputs_Rec.!$BL$6:$BL$373)","v":0},{"$f":"SUMIF(Inputs_Rec.!$AZ$6:$AZ$373,1,Inputs_Rec.!$BO$6:$BO$373)","v":0},{"$f":"SUMIF(Inputs_Rec.!$AZ$6:$AZ$373,1,Inputs_Rec.!$BM$6:$BM$373)","v":0},{"$f":"SUMIF(Inputs_Rec.!$AZ$6:$AZ$373,1,Inputs_Rec.!$BN$6:$BN$373)","v":0},null,{"$f":"Inputs_Rec.!AN383","v":0},{"$f":"SUMIF(Inputs_Rec.!$AZ$6:$AZ$373,1,Inputs_Rec.!$CX$6:$CX$373)","v":0},{"$f":"SUMIF(Inputs_Rec.!$AZ$6:$AZ$373,1,Inputs_Rec.!$CY$6:$CY$373)","v":0},{"$f":"SUMIF(Inputs_Rec.!$AZ$6:$AZ$373,1,Inputs_Rec.!$CZ$6:$CZ$373)","v":0},{"$f":"SUMIF(Inputs_Rec.!$AZ$6:$AZ$373,1,Inputs_Rec.!$DA$6:$DA$373)","v":0},null,"",{"$f":"IF(OR(SUMIF(Inputs_Rec.!$AZ$6:$AZ$372,1,Inputs_Rec.!$CI$6:$CI$372)=0,OR(SUMIF(Inputs_Rec.!$AZ$6:$AZ$372,1,Inputs_Rec.!$CI$6:$CI$372)=\"\")),\"\",SUMIF(Inputs_Rec.!$AZ$6:$AZ$372,1,Inputs_Rec.!$CI$6:$CI$372))","v":""},{"$f":"IF(OR(SUMIF(Inputs_Rec.!$AZ$6:$AZ$372,1,Inputs_Rec.!$CJ$6:$CJ$372)=0,OR(SUMIF(Inputs_Rec.!$AZ$6:$AZ$372,1,Inputs_Rec.!$CJ$6:$CJ$372)=\"\")),\"\",SUMIF(Inputs_Rec.!$AZ$6:$AZ$372,1,Inputs_Rec.!$CJ$6:$CJ$372))","v":""}]
[null,null,"",{"$f":"SUM(Inputs_Rec.!BA6:'Inputs_Rec.'!BA373)","v":0},{"$f":"SUMIF(Inputs_Rec.!$BA$6:$BA$373,1,Inputs_Rec.!$BI$6:$BI$373)","v":0},{"$f":"SUMIF(Inputs_Rec.!$BA$6:$BA$373,1,Inputs_Rec.!$BJ$6:$BJ$373)","v":0},{"$f":"SUMIF(Inputs_Rec.!$BA$6:$BA$373,1,Inputs_Rec.!$BK$6:$BK$373)","v":0},{"$f":"SUMIF(Inputs_Rec.!$BA$6:$BA$373,1,Inputs_Rec.!$BL$6:$BL$373)","v":0},{"$f":"SUMIF(Inputs_Rec.!$BA$6:$BA$373,1,Inputs_Rec.!$BO$6:$BO$373)","v":0},{"$f":"SUMIF(Inputs_Rec.!$BA$6:$BA$373,1,Inputs_Rec.!$BM$6:$BM$373)","v":0},{"$f":"SUMIF(Inputs_Rec.!$BA$6:$BA$373,1,Inputs_Rec.!$BN$6:$BN$373)","v":0},null,{"$f":"Inputs_Rec.!AN384","v":0},{"$f":"SUMIF(Inputs_Rec.!$BA$6:$BA$373,1,Inputs_Rec.!$CX$6:$CX$373)","v":0},{"$f":"SUMIF(Inputs_Rec.!$BA$6:$BA$373,1,Inputs_Rec.!$CY$6:$CY$373)","v":0},{"$f":"SUMIF(Inputs_Rec.!$BA$6:$BA$373,1,Inputs_Rec.!$CZ$6:$CZ$373)","v":0},{"$f":"SUMIF(Inputs_Rec.!$BA$6:$BA$373,1,Inputs_Rec.!$DA$6:$DA$373)","v":0},null,"",{"$f":"IF(OR(SUMIF(Inputs_Rec.!$BA$6:$BA$372,1,Inputs_Rec.!$CI$6:$CI$372)=0,OR(SUMIF(Inputs_Rec.!$BA$6:$BA$372,1,Inputs_Rec.!$CI$6:$CI$372)=\"\")),\"\",SUMIF(Inputs_Rec.!$BA$6:$BA$372,1,Inputs_Rec.!$CI$6:$CI$372))","v":""},{"$f":"IF(OR(SUMIF(Inputs_Rec.!$BA$6:$BA$372,1,Inputs_Rec.!$CJ$6:$CJ$372)=0,OR(SUMIF(Inputs_Rec.!$BA$6:$BA$372,1,Inputs_Rec.!$CJ$6:$CJ$372)=\"\")),\"\",SUMIF(Inputs_Rec.!$BA$6:$BA$372,1,Inputs_Rec.!$CJ$6:$CJ$372))","v":""}]
[null,null,"",{"$f":"SUM(Inputs_Rec.!BB6:'Inputs_Rec.'!BB373)","v":0},{"$f":"SUMIF(Inputs_Rec.!$BB$6:$BB$373,1,Inputs_Rec.!$BI$6:$BI$373)","v":0},{"$f":"SUMIF(Inputs_Rec.!$BB$6:$BB$373,1,Inputs_Rec.!$BJ$6:$BJ$373)","v":0},{"$f":"SUMIF(Inputs_Rec.!$BB$6:$BB$373,1,Inputs_Rec.!$BK$6:$BK$373)","v":0},{"$f":"SUMIF(Inputs_Rec.!$BB$6:$BB$373,1,Inputs_Rec.!$BL$6:$BL$373)","v":0},{"$f":"SUMIF(Inputs_Rec.!$BB$6:$BB$373,1,Inputs_Rec.!$BO$6:$BO$373)","v":0},{"$f":"SUMIF(Inputs_Rec.!$BB$6:$BB$373,1,Inputs_Rec.!$BM$6:$BM$373)","v":0},{"$f":"SUMIF(Inputs_Rec.!$BB$6:$BB$373,1,Inputs_Rec.!$BN$6:$BN$373)","v":0},null,{"$f":"Inputs_Rec.!AN385","v":0},{"$f":"SUMIF(Inputs_Rec.!$BB$6:$BB$373,1,Inputs_Rec.!$CX$6:$CX$373)","v":0},{"$f":"SUMIF(Inputs_Rec.!$BB$6:$BB$373,1,Inputs_Rec.!$CY$6:$CY$373)","v":0},{"$f":"SUMIF(Inputs_Rec.!$BB$6:$BB$373,1,Inputs_Rec.!$CZ$6:$CZ$373)","v":0},{"$f":"SUMIF(Inputs_Rec.!$BB$6:$BB$373,1,Inputs_Rec.!$DA$6:$DA$373)","v":0},null,"",{"$f":"IF(OR(SUMIF(Inputs_Rec.!$BB$6:$BB$372,1,Inputs_Rec.!$CI$6:$CI$372)=0,OR(SUMIF(Inputs_Rec.!$BB$6:$BB$372,1,Inputs_Rec.!$CI$6:$CI$372)=\"\")),\"\",SUMIF(Inputs_Rec.!$BB$6:$BB$372,1,Inputs_Rec.!$CI$6:$CI$372))","v":""},{"$f":"IF(OR(SUMIF(Inputs_Rec.!$BB$6:$BB$372,1,Inputs_Rec.!$CJ$6:$CJ$372)=0,OR(SUMIF(Inputs_Rec.!$BB$6:$BB$372,1,Inputs_Rec.!$CJ$6:$CJ$372)=\"\")),\"\",SUMIF(Inputs_Rec.!$BB$6:$BB$372,1,Inputs_Rec.!$CJ$6:$CJ$372))","v":""}]
[null,null,"",{"$f":"SUM(Inputs_Rec.!BC6:'Inputs_Rec.'!BC373)","v":0},{"$f":"SUMIF(Inputs_Rec.!$BC$6:$BC$373,1,Inputs_Rec.!$BI$6:$BI$373)","v":0},{"$f":"SUMIF(Inputs_Rec.!$BC$6:$BC$373,1,Inputs_Rec.!$BJ$6:$BJ$373)","v":0},{"$f":"SUMIF(Inputs_Rec.!$BC$6:$BC$373,1,Inputs_Rec.!$BK$6:$BK$373)","v":0},{"$f":"SUMIF(Inputs_Rec.!$BC$6:$BC$373,1,Inputs_Rec.!$BL$6:$BL$373)","v":0},{"$f":"SUMIF(Inputs_Rec.!$BC$6:$BC$373,1,Inputs_Rec.!$BO$6:$BO$373)","v":0},{"$f":"SUMIF(Inputs_Rec.!$BC$6:$BC$373,1,Inputs_Rec.!$BM$6:$BM$373)","v":0},{"$f":"SUMIF(Inputs_Rec.!$BC$6:$BC$373,1,Inputs_Rec.!$BN$6:$BN$373)","v":0},null,{"$f":"Inputs_Rec.!AN386","v":0},{"$f":"SUMIF(Inputs_Rec.!$BC$6:$BC$373,1,Inputs_Rec.!$CX$6:$CX$373)","v":0},{"$f":"SUMIF(Inputs_Rec.!$BC$6:$BC$373,1,Inputs_Rec.!$CY$6:$CY$373)","v":0},{"$f":"SUMIF(Inputs_Rec.!$BC$6:$BC$373,1,Inputs_Rec.!$CZ$6:$CZ$373)","v":0},{"$f":"SUMIF(Inputs_Rec.!$BC$6:$BC$373,1,Inputs_Rec.!$DA$6:$DA$373)","v":0},null,"",{"$f":"IF(OR(SUMIF(Inputs_Rec.!$BC$6:$BC$372,1,Inputs_Rec.!$CI$6:$CI$372)=0,OR(SUMIF(Inputs_Rec.!$BC$6:$BC$372,1,Inputs_Rec.!$CI$6:$CI$372)=\"\")),\"\",SUMIF(Inputs_Rec.!$BC$6:$BC$372,1,Inputs_Rec.!$CI$6:$CI$372))","v":""},{"$f":"IF(OR(SUMIF(Inputs_Rec.!$BC$6:$BC$372,1,Inputs_Rec.!$CJ$6:$CJ$372)=0,OR(SUMIF(Inputs_Rec.!$BC$6:$BC$372,1,Inputs_Rec.!$CJ$6:$CJ$372)=\"\")),\"\",SUMIF(Inputs_Rec.!$BC$6:$BC$372,1,Inputs_Rec.!$CJ$6:$CJ$372))","v":""}]
[null,null,"",{"$f":"SUM(Inputs_Rec.!BD6:'Inputs_Rec.'!BD373)","v":0},{"$f":"SUMIF(Inputs_Rec.!$BD$6:$BD$373,1,Inputs_Rec.!$BI$6:$BI$373)","v":0},{"$f":"SUMIF(Inputs_Rec.!$BD$6:$BD$373,1,Inputs_Rec.!$BJ$6:$BJ$373)","v":0},{"$f":"SUMIF(Inputs_Rec.!$BD$6:$BD$373,1,Inputs_Rec.!$BK$6:$BK$373)","v":0},{"$f":"SUMIF(Inputs_Rec.!$BD$6:$BD$373,1,Inputs_Rec.!$BL$6:$BL$373)","v":0},{"$f":"SUMIF(Inputs_Rec.!$BD$6:$BD$373,1,Inputs_Rec.!$BO$6:$BO$373)","v":0},{"$f":"SUMIF(Inputs_Rec.!$BD$6:$BD$373,1,Inputs_Rec.!$BM$6:$BM$373)","v":0},{"$f":"SUMIF(Inputs_Rec.!$BD$6:$BD$373,1,Inputs_Rec.!$BN$6:$BN$373)","v":0},null,{"$f":"Inputs_Rec.!AN387","v":0},{"$f":"SUMIF(Inputs_Rec.!$BD$6:$BD$373,1,Inputs_Rec.!$CX$6:$CX$373)","v":0},{"$f":"SUMIF(Inputs_Rec.!$BD$6:$BD$373,1,Inputs_Rec.!$CY$6:$CY$373)","v":0},{"$f":"SUMIF(Inputs_Rec.!$BD$6:$BD$373,1,Inputs_Rec.!$CZ$6:$CZ$373)","v":0},{"$f":"SUMIF(Inputs_Rec.!$BD$6:$BD$373,1,Inputs_Rec.!$DA$6:$DA$373)","v":0},null,"",{"$f":"IF(OR(SUMIF(Inputs_Rec.!$BD$6:$BD$372,1,Inputs_Rec.!$CI$6:$CI$372)=0,OR(SUMIF(Inputs_Rec.!$BD$6:$BD$372,1,Inputs_Rec.!$CI$6:$CI$372)=\"\")),\"\",SUMIF(Inputs_Rec.!$BD$6:$BD$372,1,Inputs_Rec.!$CI$6:$CI$372))","v":""},{"$f":"IF(OR(SUMIF(Inputs_Rec.!$BD$6:$BD$372,1,Inputs_Rec.!$CJ$6:$CJ$372)=0,OR(SUMIF(Inputs_Rec.!$BD$6:$BD$372,1,Inputs_Rec.!$CJ$6:$CJ$372)=\"\")),\"\",SUMIF(Inputs_Rec.!$BD$6:$BD$372,1,Inputs_Rec.!$CJ$6:$CJ$372))","v":""}]
[null,null,"",{"$f":"SUM(Inputs_Rec.!BE6:'Inputs_Rec.'!BE373)","v":0},{"$f":"SUMIF(Inputs_Rec.!$BE$6:$BE$373,1,Inputs_Rec.!$BI$6:$BI$373)","v":0},{"$f":"SUMIF(Inputs_Rec.!$BE$6:$BE$373,1,Inputs_Rec.!$BJ$6:$BJ$373)","v":0},{"$f":"SUMIF(Inputs_Rec.!$BE$6:$BE$373,1,Inputs_Rec.!$BK$6:$BK$373)","v":0},{"$f":"SUMIF(Inputs_Rec.!$BE$6:$BE$373,1,Inputs_Rec.!$BL$6:$BL$373)","v":0},{"$f":"SUMIF(Inputs_Rec.!$BE$6:$BE$373,1,Inputs_Rec.!$BO$6:$BO$373)","v":0},{"$f":"SUMIF(Inputs_Rec.!$BE$6:$BE$373,1,Inputs_Rec.!$BM$6:$BM$373)","v":0},{"$f":"SUMIF(Inputs_Rec.!$BE$6:$BE$373,1,Inputs_Rec.!$BN$6:$BN$373)","v":0},null,{"$f":"Inputs_Rec.!AN388","v":0},{"$f":"SUMIF(Inputs_Rec.!$BE$6:$BE$373,1,Inputs_Rec.!$CX$6:$CX$373)","v":0},{"$f":"SUMIF(Inputs_Rec.!$BE$6:$BE$373,1,Inputs_Rec.!$CY$6:$CY$373)","v":0},{"$f":"SUMIF(Inputs_Rec.!$BE$6:$BE$373,1,Inputs_Rec.!$CZ$6:$CZ$373)","v":0},{"$f":"SUMIF(Inputs_Rec.!$BE$6:$BE$373,1,Inputs_Rec.!$DA$6:$DA$373)","v":0},null,"",{"$f":"IF(OR(SUMIF(Inputs_Rec.!$BE$6:$BE$372,1,Inputs_Rec.!$CI$6:$CI$372)=0,OR(SUMIF(Inputs_Rec.!$BE$6:$BE$372,1,Inputs_Rec.!$CI$6:$CI$372)=\"\")),\"\",SUMIF(Inputs_Rec.!$BE$6:$BE$372,1,Inputs_Rec.!$CI$6:$CI$372))","v":""},{"$f":"IF(OR(SUMIF(Inputs_Rec.!$BE$6:$BE$372,1,Inputs_Rec.!$CJ$6:$CJ$372)=0,OR(SUMIF(Inputs_Rec.!$BE$6:$BE$372,1,Inputs_Rec.!$CJ$6:$CJ$372)=\"\")),\"\",SUMIF(Inputs_Rec.!$BE$6:$BE$372,1,Inputs_Rec.!$CJ$6:$CJ$372))","v":""}]
[null,null,"",{"$f":"SUM(Inputs_Rec.!BF6:'Inputs_Rec.'!BF373)","v":0},{"$f":"SUMIF(Inputs_Rec.!$BF$6:$BF$373,1,Inputs_Rec.!$BI$6:$BI$373)","v":0},{"$f":"SUMIF(Inputs_Rec.!$BF$6:$BF$373,1,Inputs_Rec.!$BJ6:$BFH$373)","v":0},{"$f":"SUMIF(Inputs_Rec.!$BF$6:$BF$373,1,Inputs_Rec.!$BK6:$BFI$373)","v":0},{"$f":"SUMIF(Inputs_Rec.!$BF$6:$BF$373,1,Inputs_Rec.!$BL6:$BFJ$373)","v":0},{"$f":"SUMIF(Inputs_Rec.!$BF$6:$BF$373,1,Inputs_Rec.!$BO6:$BO$373)","v":0},{"$f":"SUMIF(Inputs_Rec.!$BF$6:$BF$373,1,Inputs_Rec.!$BM6:$BM$373)","v":0},{"$f":"SUMIF(Inputs_Rec.!$BF$6:$BF$373,1,Inputs_Rec.!$BN6:$BN$373)","v":0},null,{"$f":"Inputs_Rec.!AN389","v":0},{"$f":"SUMIF(Inputs_Rec.!$BF$6:$BF$373,1,Inputs_Rec.!$CX6:$CX$373)","v":0},{"$f":"SUMIF(Inputs_Rec.!$BF$6:$BF$373,1,Inputs_Rec.!$CY6:$CY$373)","v":0},{"$f":"SUMIF(Inputs_Rec.!$BF$6:$BF$373,1,Inputs_Rec.!$CZ6:$CZ$373)","v":0},{"$f":"SUMIF(Inputs_Rec.!$BF$6:$BF$373,1,Inputs_Rec.!$DA6:$DA$373)","v":0},null,"",{"$f":"IF(OR(SUMIF(Inputs_Rec.!$BF$6:$BF$372,1,Inputs_Rec.!$CI$6:$CI$372)=0,OR(SUMIF(Inputs_Rec.!$BF$6:$BF$372,1,Inputs_Rec.!$CI$6:$CI$372)=\"\")),\"\",SUMIF(Inputs_Rec.!$BF$6:$BF$372,1,Inputs_Rec.!$CI$6:$CI$372))","v":""},{"$f":"IF(OR(SUMIF(Inputs_Rec.!$BF$6:$BF$372,1,Inputs_Rec.!$CJ$6:$CJ$372)=0,OR(SUMIF(Inputs_Rec.!$BF$6:$BF$372,1,Inputs_Rec.!$CJ$6:$CJ$372)=\"\")),\"\",SUMIF(Inputs_Rec.!$BF$6:$BF$372,1,Inputs_Rec.!$CJ$6:$CJ$372))","v":""}]
[null,null,"",{"$f":"SUM(Inputs_Rec.!BG6:'Inputs_Rec.'!BG373)","v":0},{"$f":"SUMIF(Inputs_Rec.!$BG$6:$BG$373,1,Inputs_Rec.!$BI$6:$BI$373)","v":0},{"$f":"SUMIF(Inputs_Rec.!$BG$6:$BG$373,1,Inputs_Rec.!$BJ$6:$BJ$373)","v":0},{"$f":"SUMIF(Inputs_Rec.!$BG$6:$BG$373,1,Inputs_Rec.!$BK$6:$BK$373)","v":0},{"$f":"SUMIF(Inputs_Rec.!$BG$6:$BG$373,1,Inputs_Rec.!$BL$6:$BL$373)","v":0},{"$f":"SUMIF(Inputs_Rec.!$BG$6:$BG$373,1,Inputs_Rec.!$BO$6:$BO$373)","v":0},{"$f":"SUMIF(Inputs_Rec.!$BG$6:$BG$373,1,Inputs_Rec.!$BM$6:$BM$373)","v":0},{"$f":"SUMIF(Inputs_Rec.!$BG$6:$BG$373,1,Inputs_Rec.!$BN$6:$BN$373)","v":0},null,{"$f":"Inputs_Rec.!AN390","v":0},{"$f":"SUMIF(Inputs_Rec.!$BG$6:$BG$373,1,Inputs_Rec.!$CX$6:$CX$373)","v":0},{"$f":"SUMIF(Inputs_Rec.!$BG$6:$BG$373,1,Inputs_Rec.!$CY$6:$CY$373)","v":0},{"$f":"SUMIF(Inputs_Rec.!$BG$6:$BG$373,1,Inputs_Rec.!$CZ$6:$CZ$373)","v":0},{"$f":"SUMIF(Inputs_Rec.!$BG$6:$BG$373,1,Inputs_Rec.!$DA$6:$DA$373)","v":0},null,"",{"$f":"IF(OR(SUMIF(Inputs_Rec.!$BG$6:$BG$372,1,Inputs_Rec.!$CI$6:$CI$372)=0,OR(SUMIF(Inputs_Rec.!$BG$6:$BG$372,1,Inputs_Rec.!$CI$6:$CI$372)=\"\")),\"\",SUMIF(Inputs_Rec.!$BG$6:$BG$372,1,Inputs_Rec.!$CI$6:$CI$372))","v":""},{"$f":"IF(OR(SUMIF(Inputs_Rec.!$BG$6:$BG$372,1,Inputs_Rec.!$CJ$6:$CJ$372)=0,OR(SUMIF(Inputs_Rec.!$BG$6:$BG$372,1,Inputs_Rec.!$CJ$6:$CJ$372)=\"\")),\"\",SUMIF(Inputs_Rec.!$BG$6:$BG$372,1,Inputs_Rec.!$CJ$6:$CJ$372))","v":""}]
[null,null,"",{"$f":"SUM(Inputs_Rec.!CL6:'Inputs_Rec.'!CL372)","v":0},{"$f":"SUMIF(Inputs_Rec.!$CL$6:$CL$373,1,Inputs_Rec.!$BI$6:$BI$373)","v":0},{"$f":"SUMIF(Inputs_Rec.!$CL$6:$CL$373,1,Inputs_Rec.!$BJ$6:$BJ$373)","v":0},{"$f":"SUMIF(Inputs_Rec.!$CL$6:$CL$373,1,Inputs_Rec.!$BK$6:$BK$373)","v":0},{"$f":"SUMIF(Inputs_Rec.!$CL$6:$CL$373,1,Inputs_Rec.!$BL$6:$BL$373)","v":0},{"$f":"SUMIF(Inputs_Rec.!$CL$6:$CL$373,1,Inputs_Rec.!$BO$6:$BO$373)","v":0},{"$f":"SUMIF(Inputs_Rec.!$CL$6:$CL$373,1,Inputs_Rec.!$BM$6:$BM$373)","v":0},{"$f":"SUMIF(Inputs_Rec.!$CL$6:$CL$373,1,Inputs_Rec.!$BN$6:$BN$373)","v":0},null,{"$f":"Inputs_Rec.!AN391","v":0},{"$f":"SUMIF(Inputs_Rec.!$CL$6:$CL$373,1,Inputs_Rec.!$CX$6:$CX$373)","v":0},{"$f":"SUMIF(Inputs_Rec.!$CL$6:$CL$373,1,Inputs_Rec.!$CY$6:$CY$373)","v":0},{"$f":"SUMIF(Inputs_Rec.!$CL$6:$CL$373,1,Inputs_Rec.!$CZ$6:$CZ$373)","v":0},{"$f":"SUMIF(Inputs_Rec.!$CL$6:$CL$373,1,Inputs_Rec.!$DA$6:$DA$373)","v":0},null,"",{"$f":"IF(OR(SUMIF(Inputs_Rec.!$CL$6:$CL$372,1,Inputs_Rec.!$CI$6:$CI$372)=0,OR(SUMIF(Inputs_Rec.!$CL$6:$CL$372,1,Inputs_Rec.!$CI$6:$CI$372)=\"\")),\"\",SUMIF(Inputs_Rec.!$CL$6:$CL$372,1,Inputs_Rec.!$CI$6:$CI$372))","v":""},{"$f":"IF(OR(SUMIF(Inputs_Rec.!$CL$6:$CL$372,1,Inputs_Rec.!$CJ$6:$CJ$372)=0,OR(SUMIF(Inputs_Rec.!$CL$6:$CL$372,1,Inputs_Rec.!$CJ$6:$CJ$372)=\"\")),\"\",SUMIF(Inputs_Rec.!$CL$6:$CL$372,1,Inputs_Rec.!$CJ$6:$CJ$372))","v":""}]
[null,null,"",{"$f":"SUM(Inputs_Rec.!CM6:'Inputs_Rec.'!CM372)","v":0},{"$f":"SUMIF(Inputs_Rec.!$CM$6:$CM$373,1,Inputs_Rec.!$BI$6:$BI$373)","v":0},{"$f":"SUMIF(Inputs_Rec.!$CM$6:$CM$373,1,Inputs_Rec.!$BJ$6:$BJ$373)","v":0},{"$f":"SUMIF(Inputs_Rec.!$CM$6:$CM$373,1,Inputs_Rec.!$BK$6:$BK$373)","v":0},{"$f":"SUMIF(Inputs_Rec.!$CM$6:$CM$373,1,Inputs_Rec.!$BL$6:$BL$373)","v":0},{"$f":"SUMIF(Inputs_Rec.!$CM$6:$CM$373,1,Inputs_Rec.!$BO$6:$BO$373)","v":0},{"$f":"SUMIF(Inputs_Rec.!$CM$6:$CM$373,1,Inputs_Rec.!$BM$6:$BM$373)","v":0},{"$f":"SUMIF(Inputs_Rec.!$CM$6:$CM$373,1,Inputs_Rec.!$BN$6:$BN$373)","v":0},null,{"$f":"Inputs_Rec.!AN392","v":0},{"$f":"SUMIF(Inputs_Rec.!$CM$6:$CM$373,1,Inputs_Rec.!$CX$6:$CX$373)","v":0},{"$f":"SUMIF(Inputs_Rec.!$CM$6:$CM$373,1,Inputs_Rec.!$CY$6:$CY$373)","v":0},{"$f":"SUMIF(Inputs_Rec.!$CM$6:$CM$373,1,Inputs_Rec.!$CZ$6:$CZ$373)","v":0},{"$f":"SUMIF(Inputs_Rec.!$CM$6:$CM$373,1,Inputs_Rec.!$DA$6:$DA$373)","v":0},null,"",{"$f":"IF(OR(SUMIF(Inputs_Rec.!$CM$6:$CM$372,1,Inputs_Rec.!$CI$6:$CI$372)=0,OR(SUMIF(Inputs_Rec.!$CM$6:$CM$372,1,Inputs_Rec.!$CI$6:$CI$372)=\"\")),\"\",SUMIF(Inputs_Rec.!$CM$6:$CM$372,1,Inputs_Rec.!$CI$6:$CI$372))","v":""},{"$f":"IF(OR(SUMIF(Inputs_Rec.!$CM$6:$CM$372,1,Inputs_Rec.!$CJ$6:$CJ$372)=0,OR(SUMIF(Inputs_Rec.!$CM$6:$CM$372,1,Inputs_Rec.!$CJ$6:$CJ$372)=\"\")),\"\",SUMIF(Inputs_Rec.!$CM$6:$CM$372,1,Inputs_Rec.!$CJ$6:$CJ$372))","v":""}]
[null,null,"",{"$f":"SUM(Inputs_Rec.!CN6:'Inputs_Rec.'!CN372)","v":0},{"$f":"SUMIF(Inputs_Rec.!$CN$6:$CN$373,1,Inputs_Rec.!$BI$6:$BI$373)","v":0},{"$f":"SUMIF(Inputs_Rec.!$CN$6:$CN$373,1,Inputs_Rec.!$BJ$6:$BJ$373)","v":0},{"$f":"SUMIF(Inputs_Rec.!$CN$6:$CN$373,1,Inputs_Rec.!$BK$6:$BK$373)","v":0},{"$f":"SUMIF(Inputs_Rec.!$CN$6:$CN$373,1,Inputs_Rec.!$BL$6:$BL$373)","v":0},{"$f":"SUMIF(Inputs_Rec.!$CN$6:$CN$373,1,Inputs_Rec.!$BO$6:$BO$373)","v":0},{"$f":"SUMIF(Inputs_Rec.!$CN$6:$CN$373,1,Inputs_Rec.!$BM$6:$BM$373)","v":0},{"$f":"SUMIF(Inputs_Rec.!$CN$6:$CN$373,1,Inputs_Rec.!$BN$6:$BN$373)","v":0},null,{"$f":"Inputs_Rec.!AN393","v":0},{"$f":"SUMIF(Inputs_Rec.!$CN$6:$CN$373,1,Inputs_Rec.!$CX$6:$CX$373)","v":0},{"$f":"SUMIF(Inputs_Rec.!$CN$6:$CN$373,1,Inputs_Rec.!$CY$6:$CY$373)","v":0},{"$f":"SUMIF(Inputs_Rec.!$CN$6:$CN$373,1,Inputs_Rec.!$CZ$6:$CZ$373)","v":0},{"$f":"SUMIF(Inputs_Rec.!$CN$6:$CN$373,1,Inputs_Rec.!$DA$6:$DA$373)","v":0},null,"",{"$f":"IF(OR(SUMIF(Inputs_Rec.!$CN$6:$CN$372,1,Inputs_Rec.!$CI$6:$CI$372)=0,OR(SUMIF(Inputs_Rec.!$CN$6:$CN$372,1,Inputs_Rec.!$CI$6:$CI$372)=\"\")),\"\",SUMIF(Inputs_Rec.!$CN$6:$CN$372,1,Inputs_Rec.!$CI$6:$CI$372))","v":""},{"$f":"IF(OR(SUMIF(Inputs_Rec.!$CN$6:$CN$372,1,Inputs_Rec.!$CJ$6:$CJ$372)=0,OR(SUMIF(Inputs_Rec.!$CN$6:$CN$372,1,Inputs_Rec.!$CJ$6:$CJ$372)=\"\")),\"\",SUMIF(Inputs_Rec.!$CN$6:$CN$372,1,Inputs_Rec.!$CJ$6:$CJ$372))","v":""}]
[null,null,"",{"$f":"SUM(Inputs_Rec.!CO6:'Inputs_Rec.'!CO372)","v":0},{"$f":"SUMIF(Inputs_Rec.!$CO$6:$CO$373,1,Inputs_Rec.!$BI$6:$BI$373)","v":0},{"$f":"SUMIF(Inputs_Rec.!$CO$6:$CO$373,1,Inputs_Rec.!$BJ$6:$BJ$373)","v":0},{"$f":"SUMIF(Inputs_Rec.!$CO$6:$CO$373,1,Inputs_Rec.!$BK$6:$BK$373)","v":0},{"$f":"SUMIF(Inputs_Rec.!$CO$6:$CO$373,1,Inputs_Rec.!$BL$6:$BL$373)","v":0},{"$f":"SUMIF(Inputs_Rec.!$CO$6:$CO$373,1,Inputs_Rec.!$BO$6:$BO$373)","v":0},{"$f":"SUMIF(Inputs_Rec.!$CO$6:$CO$373,1,Inputs_Rec.!$BM$6:$BM$373)","v":0},{"$f":"SUMIF(Inputs_Rec.!$CO$6:$CO$373,1,Inputs_Rec.!$BN$6:$BN$373)","v":0},null,{"$f":"Inputs_Rec.!AN394","v":0},{"$f":"SUMIF(Inputs_Rec.!$CO$6:$CO$373,1,Inputs_Rec.!$CX$6:$CX$373)","v":0},{"$f":"SUMIF(Inputs_Rec.!$CO$6:$CO$373,1,Inputs_Rec.!$CY$6:$CY$373)","v":0},{"$f":"SUMIF(Inputs_Rec.!$CO$6:$CO$373,1,Inputs_Rec.!$CZ$6:$CZ$373)","v":0},{"$f":"SUMIF(Inputs_Rec.!$CO$6:$CO$373,1,Inputs_Rec.!$DA$6:$DA$373)","v":0},null,"",{"$f":"IF(OR(SUMIF(Inputs_Rec.!$CO$6:$CO$372,1,Inputs_Rec.!$CI$6:$CI$372)=0,OR(SUMIF(Inputs_Rec.!$CO$6:$CO$372,1,Inputs_Rec.!$CI$6:$CI$372)=\"\")),\"\",SUMIF(Inputs_Rec.!$CO$6:$CO$372,1,Inputs_Rec.!$CI$6:$CI$372))","v":""},{"$f":"IF(OR(SUMIF(Inputs_Rec.!$CO$6:$CO$372,1,Inputs_Rec.!$CJ$6:$CJ$372)=0,OR(SUMIF(Inputs_Rec.!$CO$6:$CO$372,1,Inputs_Rec.!$CJ$6:$CJ$372)=\"\")),\"\",SUMIF(Inputs_Rec.!$CO$6:$CO$372,1,Inputs_Rec.!$CJ$6:$CJ$372))","v":""}]
[null,null,"",{"$f":"SUM(Inputs_Rec.!CP6:'Inputs_Rec.'!CP372)","v":0},{"$f":"SUMIF(Inputs_Rec.!$CP$6:$CP$373,1,Inputs_Rec.!$BI$6:$BI$373)","v":0},{"$f":"SUMIF(Inputs_Rec.!$CP$6:$CP$373,1,Inputs_Rec.!$BJ$6:$BJ$373)","v":0},{"$f":"SUMIF(Inputs_Rec.!$CP$6:$CP$373,1,Inputs_Rec.!$BK$6:$BK$373)","v":0},{"$f":"SUMIF(Inputs_Rec.!$CP$6:$CP$373,1,Inputs_Rec.!$BL$6:$BL$373)","v":0},{"$f":"SUMIF(Inputs_Rec.!$CP$6:$CP$373,1,Inputs_Rec.!$BO$6:$BO$373)","v":0},{"$f":"SUMIF(Inputs_Rec.!$CP$6:$CP$373,1,Inputs_Rec.!$BM$6:$BM$373)","v":0},{"$f":"SUMIF(Inputs_Rec.!$CP$6:$CP$373,1,Inputs_Rec.!$BN$6:$BN$373)","v":0},null,{"$f":"Inputs_Rec.!AN395","v":0},{"$f":"SUMIF(Inputs_Rec.!$CP$6:$CP$373,1,Inputs_Rec.!$CX$6:$CX$373)","v":0},{"$f":"SUMIF(Inputs_Rec.!$CP$6:$CP$373,1,Inputs_Rec.!$CY$6:$CY$373)","v":0},{"$f":"SUMIF(Inputs_Rec.!$CP$6:$CP$373,1,Inputs_Rec.!$CZ$6:$CZ$373)","v":0},{"$f":"SUMIF(Inputs_Rec.!$CP$6:$CP$373,1,Inputs_Rec.!$DA$6:$DA$373)","v":0},null,"",{"$f":"IF(OR(SUMIF(Inputs_Rec.!$CP$6:$CP$372,1,Inputs_Rec.!$CI$6:$CI$372)=0,OR(SUMIF(Inputs_Rec.!$CP$6:$CP$372,1,Inputs_Rec.!$CI$6:$CI$372)=\"\")),\"\",SUMIF(Inputs_Rec.!$CP$6:$CP$372,1,Inputs_Rec.!$CI$6:$CI$372))","v":""},{"$f":"IF(OR(SUMIF(Inputs_Rec.!$CP$6:$CP$372,1,Inputs_Rec.!$CJ$6:$CJ$372)=0,OR(SUMIF(Inputs_Rec.!$CP$6:$CP$372,1,Inputs_Rec.!$CJ$6:$CJ$372)=\"\")),\"\",SUMIF(Inputs_Rec.!$CP$6:$CP$372,1,Inputs_Rec.!$CJ$6:$CJ$372))","v":""}]
[null,null,"",{"$f":"SUM(Inputs_Rec.!CQ6:'Inputs_Rec.'!CQ372)","v":0},{"$f":"SUMIF(Inputs_Rec.!$CQ$6:$CQ$373,1,Inputs_Rec.!$BI$6:$BI$373)","v":0},{"$f":"SUMIF(Inputs_Rec.!$CQ$6:$CQ$373,1,Inputs_Rec.!$BJ$6:$BJ$373)","v":0},{"$f":"SUMIF(Inputs_Rec.!$CQ$6:$CQ$373,1,Inputs_Rec.!$BK$6:$BK$373)","v":0},{"$f":"SUMIF(Inputs_Rec.!$CQ$6:$CQ$373,1,Inputs_Rec.!$BL$6:$BL$373)","v":0},{"$f":"SUMIF(Inputs_Rec.!$CQ$6:$CQ$373,1,Inputs_Rec.!$BO$6:$BO$373)","v":0},{"$f":"SUMIF(Inputs_Rec.!$CQ$6:$CQ$373,1,Inputs_Rec.!$BM$6:$BM$373)","v":0},{"$f":"SUMIF(Inputs_Rec.!$CQ$6:$CQ$373,1,Inputs_Rec.!$BN$6:$BN$373)","v":0},null,{"$f":"Inputs_Rec.!AN396","v":0},{"$f":"SUMIF(Inputs_Rec.!$CQ$6:$CQ$373,1,Inputs_Rec.!$CX$6:$CX$373)","v":0},{"$f":"SUMIF(Inputs_Rec.!$CQ$6:$CQ$373,1,Inputs_Rec.!$CY$6:$CY$373)","v":0},{"$f":"SUMIF(Inputs_Rec.!$CQ$6:$CQ$373,1,Inputs_Rec.!$CZ$6:$CZ$373)","v":0},{"$f":"SUMIF(Inputs_Rec.!$CQ$6:$CQ$373,1,Inputs_Rec.!$DA$6:$DA$373)","v":0},null,"",{"$f":"IF(OR(SUMIF(Inputs_Rec.!$CQ$6:$CQ$372,1,Inputs_Rec.!$CI$6:$CI$372)=0,OR(SUMIF(Inputs_Rec.!$CQ$6:$CQ$372,1,Inputs_Rec.!$CI$6:$CI$372)=\"\")),\"\",SUMIF(Inputs_Rec.!$CQ$6:$CQ$372,1,Inputs_Rec.!$CI$6:$CI$372))","v":""},{"$f":"IF(OR(SUMIF(Inputs_Rec.!$CQ$6:$CQ$372,1,Inputs_Rec.!$CJ$6:$CJ$372)=0,OR(SUMIF(Inputs_Rec.!$CQ$6:$CQ$372,1,Inputs_Rec.!$CJ$6:$CJ$372)=\"\")),\"\",SUMIF(Inputs_Rec.!$CQ$6:$CQ$372,1,Inputs_Rec.!$CJ$6:$CJ$372))","v":""}]
[null,null,"",{"$f":"SUM(Inputs_Rec.!CR6:'Inputs_Rec.'!CR372)","v":0},{"$f":"SUMIF(Inputs_Rec.!$CR$6:$CR$373,1,Inputs_Rec.!$BI$6:$BI$373)","v":0},{"$f":"SUMIF(Inputs_Rec.!$CR$6:$CR$373,1,Inputs_Rec.!$BJ$6:$BJ$373)","v":0},{"$f":"SUMIF(Inputs_Rec.!$CR$6:$CR$373,1,Inputs_Rec.!$BK$6:$BK$373)","v":0},{"$f":"SUMIF(Inputs_Rec.!$CR$6:$CR$373,1,Inputs_Rec.!$BL$6:$BL$373)","v":0},{"$f":"SUMIF(Inputs_Rec.!$CR$6:$CR$373,1,Inputs_Rec.!$BO$6:$BO$373)","v":0},{"$f":"SUMIF(Inputs_Rec.!$CR$6:$CR$373,1,Inputs_Rec.!$BM$6:$BM$373)","v":0},{"$f":"SUMIF(Inputs_Rec.!$CR$6:$CR$373,1,Inputs_Rec.!$BN$6:$BN$373)","v":0},null,{"$f":"Inputs_Rec.!AN397","v":0},{"$f":"SUMIF(Inputs_Rec.!$CR$6:$CR$373,1,Inputs_Rec.!$CX$6:$CX$373)","v":0},{"$f":"SUMIF(Inputs_Rec.!$CR$6:$CR$373,1,Inputs_Rec.!$CY$6:$CY$373)","v":0},{"$f":"SUMIF(Inputs_Rec.!$CR$6:$CR$373,1,Inputs_Rec.!$CZ$6:$CZ$373)","v":0},{"$f":"SUMIF(Inputs_Rec.!$CR$6:$CR$373,1,Inputs_Rec.!$DA$6:$DA$373)","v":0},null,"",{"$f":"IF(OR(SUMIF(Inputs_Rec.!$CR$6:$CR$372,1,Inputs_Rec.!$CI$6:$CI$372)=0,OR(SUMIF(Inputs_Rec.!$CR$6:$CR$372,1,Inputs_Rec.!$CI$6:$CI$372)=\"\")),\"\",SUMIF(Inputs_Rec.!$CR$6:$CR$372,1,Inputs_Rec.!$CI$6:$CI$372))","v":""},{"$f":"IF(OR(SUMIF(Inputs_Rec.!$CR$6:$CR$372,1,Inputs_Rec.!$CJ$6:$CJ$372)=0,OR(SUMIF(Inputs_Rec.!$CR$6:$CR$372,1,Inputs_Rec.!$CJ$6:$CJ$372)=\"\")),\"\",SUMIF(Inputs_Rec.!$CR$6:$CR$372,1,Inputs_Rec.!$CJ$6:$CJ$372))","v":""}]
[null,null,"",{"$f":"SUM(Inputs_Rec.!CS6:'Inputs_Rec.'!CS372)","v":0},{"$f":"SUMIF(Inputs_Rec.!$CS$6:$CS$373,1,Inputs_Rec.!$BI$6:$BI$373)","v":0},{"$f":"SUMIF(Inputs_Rec.!$CS$6:$CS$373,1,Inputs_Rec.!$BJ$6:$BJ$373)","v":0},{"$f":"SUMIF(Inputs_Rec.!$CS$6:$CS$373,1,Inputs_Rec.!$BK$6:$BK$373)","v":0},{"$f":"SUMIF(Inputs_Rec.!$CS$6:$CS$373,1,Inputs_Rec.!$BL$6:$BL$373)","v":0},{"$f":"SUMIF(Inputs_Rec.!$CS$6:$CS$373,1,Inputs_Rec.!$BO$6:$BO$373)","v":0},{"$f":"SUMIF(Inputs_Rec.!$CS$6:$CS$373,1,Inputs_Rec.!$BM$6:$BM$373)","v":0},{"$f":"SUMIF(Inputs_Rec.!$CS$6:$CS$373,1,Inputs_Rec.!$BN$6:$BN$373)","v":0},null,{"$f":"Inputs_Rec.!AN398","v":0},{"$f":"SUMIF(Inputs_Rec.!$CS$6:$CS$373,1,Inputs_Rec.!$CX$6:$CX$373)","v":0},{"$f":"SUMIF(Inputs_Rec.!$CS$6:$CS$373,1,Inputs_Rec.!$CY$6:$CY$373)","v":0},{"$f":"SUMIF(Inputs_Rec.!$CS$6:$CS$373,1,Inputs_Rec.!$CZ$6:$CZ$373)","v":0},{"$f":"SUMIF(Inputs_Rec.!$CS$6:$CS$373,1,Inputs_Rec.!$DA$6:$DA$373)","v":0},null,"",{"$f":"IF(OR(SUMIF(Inputs_Rec.!$CS$6:$CS$372,1,Inputs_Rec.!$CI$6:$CI$372)=0,OR(SUMIF(Inputs_Rec.!$CS$6:$CS$372,1,Inputs_Rec.!$CI$6:$CI$372)=\"\")),\"\",SUMIF(Inputs_Rec.!$CS$6:$CS$372,1,Inputs_Rec.!$CI$6:$CI$372))","v":""},{"$f":"IF(OR(SUMIF(Inputs_Rec.!$CS$6:$CS$372,1,Inputs_Rec.!$CJ$6:$CJ$372)=0,OR(SUMIF(Inputs_Rec.!$CS$6:$CS$372,1,Inputs_Rec.!$CJ$6:$CJ$372)=\"\")),\"\",SUMIF(Inputs_Rec.!$CS$6:$CS$372,1,Inputs_Rec.!$CJ$6:$CJ$372))","v":""}]
[null,null,"",{"$f":"SUM(Inputs_Rec.!CT6:'Inputs_Rec.'!CT372)","v":0},{"$f":"SUMIF(Inputs_Rec.!$CT$6:$CT$373,1,Inputs_Rec.!$BI$6:$BI$373)","v":0},{"$f":"SUMIF(Inputs_Rec.!$CT$6:$CT$373,1,Inputs_Rec.!$BJ$6:$BJ$373)","v":0},{"$f":"SUMIF(Inputs_Rec.!$CT$6:$CT$373,1,Inputs_Rec.!$BK$6:$BK$373)","v":0},{"$f":"SUMIF(Inputs_Rec.!$CT$6:$CT$373,1,Inputs_Rec.!$BL$6:$BL$373)","v":0},{"$f":"SUMIF(Inputs_Rec.!$CT$6:$CT$373,1,Inputs_Rec.!$BO$6:$BO$373)","v":0},{"$f":"SUMIF(Inputs_Rec.!$CT$6:$CT$373,1,Inputs_Rec.!$BM$6:$BM$373)","v":0},{"$f":"SUMIF(Inputs_Rec.!$CT$6:$CT$373,1,Inputs_Rec.!$BN$6:$BN$373)","v":0},null,{"$f":"Inputs_Rec.!AN399","v":0},{"$f":"SUMIF(Inputs_Rec.!$CT$6:$CT$373,1,Inputs_Rec.!$CX$6:$CX$373)","v":0},{"$f":"SUMIF(Inputs_Rec.!$CT$6:$CT$373,1,Inputs_Rec.!$CY$6:$CY$373)","v":0},{"$f":"SUMIF(Inputs_Rec.!$CT$6:$CT$373,1,Inputs_Rec.!$CZ$6:$CZ$373)","v":0},{"$f":"SUMIF(Inputs_Rec.!$CT$6:$CT$373,1,Inputs_Rec.!$DA$6:$DA$373)","v":0},null,"",{"$f":"IF(OR(SUMIF(Inputs_Rec.!$CT$6:$CT$372,1,Inputs_Rec.!$CI$6:$CI$372)=0,OR(SUMIF(Inputs_Rec.!$CT$6:$CT$372,1,Inputs_Rec.!$CI$6:$CI$372)=\"\")),\"\",SUMIF(Inputs_Rec.!$CT$6:$CT$372,1,Inputs_Rec.!$CI$6:$CI$372))","v":""},{"$f":"IF(OR(SUMIF(Inputs_Rec.!$CT$6:$CT$372,1,Inputs_Rec.!$CJ$6:$CJ$372)=0,OR(SUMIF(Inputs_Rec.!$CT$6:$CT$372,1,Inputs_Rec.!$CJ$6:$CJ$372)=\"\")),\"\",SUMIF(Inputs_Rec.!$CT$6:$CT$372,1,Inputs_Rec.!$CJ$6:$CJ$372))","v":""}]
[null,null,"",{"$f":"SUM(Inputs_Rec.!CU6:'Inputs_Rec.'!CU372)","v":0},{"$f":"SUMIF(Inputs_Rec.!$CU$6:$CU$373,1,Inputs_Rec.!$BI$6:$BI$373)","v":0},{"$f":"SUMIF(Inputs_Rec.!$CU$6:$CU$373,1,Inputs_Rec.!$BJ$6:$BJ$373)","v":0},{"$f":"SUMIF(Inputs_Rec.!$CU$6:$CU$373,1,Inputs_Rec.!$BK$6:$BK$373)","v":0},{"$f":"SUMIF(Inputs_Rec.!$CU$6:$CU$373,1,Inputs_Rec.!$BL$6:$BL$373)","v":0},{"$f":"SUMIF(Inputs_Rec.!$CU$6:$CU$373,1,Inputs_Rec.!$BO$6:$BO$373)","v":0},{"$f":"SUMIF(Inputs_Rec.!$CU$6:$CU$373,1,Inputs_Rec.!$BM$6:$BM$373)","v":0},{"$f":"SUMIF(Inputs_Rec.!$CU$6:$CU$373,1,Inputs_Rec.!$BN$6:$BN$373)","v":0},null,{"$f":"Inputs_Rec.!AN400","v":0},{"$f":"SUMIF(Inputs_Rec.!$CU$6:$CU$373,1,Inputs_Rec.!$CX$6:$CX$373)","v":0},{"$f":"SUMIF(Inputs_Rec.!$CU$6:$CU$373,1,Inputs_Rec.!$CY$6:$CY$373)","v":0},{"$f":"SUMIF(Inputs_Rec.!$CU$6:$CU$373,1,Inputs_Rec.!$CZ$6:$CZ$373)","v":0},{"$f":"SUMIF(Inputs_Rec.!$CU$6:$CU$373,1,Inputs_Rec.!$DA$6:$DA$373)","v":0},null,"",{"$f":"IF(OR(SUMIF(Inputs_Rec.!$CU$6:$CU$372,1,Inputs_Rec.!$CI$6:$CI$372)=0,OR(SUMIF(Inputs_Rec.!$CU$6:$CU$372,1,Inputs_Rec.!$CI$6:$CI$372)=\"\")),\"\",SUMIF(Inputs_Rec.!$CU$6:$CU$372,1,Inputs_Rec.!$CI$6:$CI$372))","v":""},{"$f":"IF(OR(SUMIF(Inputs_Rec.!$CU$6:$CU$372,1,Inputs_Rec.!$CJ$6:$CJ$372)=0,OR(SUMIF(Inputs_Rec.!$CU$6:$CU$372,1,Inputs_Rec.!$CJ$6:$CJ$372)=\"\")),\"\",SUMIF(Inputs_Rec.!$CU$6:$CU$372,1,Inputs_Rec.!$CJ$6:$CJ$372))","v":""}]

{"sheet":"Dashboard_Domains","index":6,"n_rows":11,"n_cols":18,"rows_kept":11,"merged":[[0,0,0,17],[1,1,1,2],[2,1,2,2],[3,1,3,6]]}
["SYNTHESE DES ACTIVITES PAR DOMAINES"]
[{"$nulls":3},"Total",{"$f":"Inputs_Rec.!BI5","v":"Satisfait"},{"$f":"Inputs_Rec.!BJ5","v":"Non satisfaite-en cours"},{"$f":"Inputs_Rec.!BK5","v":"Non satisfaite - Non commencée"},{"$f":"Inputs_Rec.!BL5","v":"Non commencé"},{"$f":"Inputs_Rec.!BO5","v":"Delai depasse"},{"$f":"Inputs_Rec.!BM5","v":"Non applicable/Non valable"},{"$f":"Inputs_Rec.!BN5","v":"Immédiat (réalisé)"},null,{"$f":"Inputs_Rec.!AL374","v":"Select"},null,{"$f":"Inputs_Rec.!CX5","v":"Immédiat (non réalisé)"},{"$f":"Inputs_Rec.!CY5","v":"Sans délai (en cours)"},{"$f":"Inputs_Rec.!CZ5","v":"Sans délai (réalisé)"},{"$f":"Inputs_Rec.!DA5","v":"Sans délai (non réalisé)"}]
[null,{"$f":"IF(Setup!$F$9=1,Translate!B77,Translate!C77)","v":"Nombre total de Recommandations/ Décisions"},null,{"$f":"IF(SUM(Inputs_Rec.!BH6:'Inputs_Rec.'!BH373)=0,\"\",SUM(Inputs_Rec.!BH6:'Inputs_Rec.'!BH373))","v":1},{"$f":"IF(SUM(Inputs_Rec.!BI6:'Inputs_Rec.'!BI373)=0,\"\",SUM(Inputs_Rec.!BI6:'Inputs_Rec.'!BI373))","v":""},{"$f":"IF(SUM(Inputs_Rec.!BJ6:'Inputs_Rec.'!BJ373)=0,\"\",SUM(Inputs_Rec.!BJ6:'Inputs_Rec.'!BJ373))","v":1},{"$f":"IF(SUM(Inputs_Rec.!BK6:'Inputs_Rec.'!BK373)=0,\"\",SUM(Inputs_Rec.!BK6:'Inputs_Rec.'!BK373))","v":""},{"$f":"IF(SUM(Inputs_Rec.!BL6:'Inputs_Rec.'!BL373)=0,\"\",SUM(Inputs_Rec.!BL6:'Inputs_Rec.'!BL373))","v":""},{"$f":"IF(SUM(Inputs_Rec.!BO6:'Inputs_Rec.'!BO373)=0,\"\",SUM(Inputs_Rec.!BO6:'Inputs_Rec.'!BO373))","v":1},{"$f":"IF(SUM(Inputs_Rec.!BM6:'Inputs_Rec.'!BM373)=0,\"\",SUM(Inputs_Rec.!BM6:'Inputs_Rec.'!BM373))","v":""},{"$f":"IF(SUM(Inputs_Rec.!BN6:'Inputs_Rec.'!BN373)=0,\"\",SUM(Inputs_Rec.!BN6:'Inputs_Rec.'!BN373))","v":""},null,{"$f":"Inputs_Rec.!AL375","v":"Gestion du programme"},null,{"$f":"IF(SUM(Inputs_Rec.!CX6:'Inputs_Rec.'!CX373)=0,\"\",SUM(Inputs_Rec.!CX6:'Inputs_Rec.'!CX373))","v":""},{"$f":"IF(SUM(Inputs_Rec.!CY6:'Inputs_Rec.'!CY373)=0,\"\",SUM(Inputs_Rec.!CY6:'Inputs_Rec.'!CY373))","v":""},{"$f":"IF(SUM(Inputs_Rec.!CZ6:'Inputs_Rec.'!CZ373)=0,\"\",SUM(Inputs_Rec.!CZ6:'Inputs_Rec.'!CZ373))","v":""},{"$f":"IF(SUM(Inputs_Rec.!DA6:'Inputs_Rec.'!DA373)=0,\"\",SUM(Inputs_Rec.!DA6:'Inputs_Rec.'!DA373))","v":""}]
[null,{"$f":"IF(Setup!$F$9=1,Translate!B75,Translate!C75)","v":"Nombre de Recommandations/Décisions par structure"},{"$nulls":10},{"$f":"Inputs_Rec.!AL376","v":"Gouvernance nationale"}]
[null,null,{"$f":"IF(Setup!$F$9=1,Translate!B112,Translate!C112)","v":"Gestion du programme"},{"$f":"SUMIF(Inputs_Rec.!$CC$6:$CC$373,1,Inputs_Rec.!$BH$6:$BH$373)","v":0},{"$f":"SUMIF(Inputs_Rec.!$CC$6:$CC$373,1,Inputs_Rec.!$BI$6:$BI$373)","v":0},{"$f":"SUMIF(Inputs_Rec.!$CC$6:$CC$373,1,Inputs_Rec.!$BJ$6:$BJ$373)","v":0},{"$f":"SUMIF(Inputs_Rec.!$CC$6:$CC$373,1,Inputs_Rec.!$BK$6:$BK$373)","v":0},{"$f":"SUMIF(Inputs_Rec.!$CC$6:$CC$373,1,Inputs_Rec.!$BL$6:$BL$373)","v":0},{"$f":"SUMIF(Inputs_Rec.!$CC$6:$CC$373,1,Inputs_Rec.!$BO$6:$BO$373)","v":0},{"$f":"SUMIF(Inputs_Rec.!$CC$6:$CC$373,1,Inputs_Rec.!$BM$6:$BM$373)","v":0},{"$f":"SUMIF(Inputs_Rec.!$CC$6:$CC$373,1,Inputs_Rec.!$BN$6:$BN$373)","v":0},null,{"$f":"Inputs_Rec.!AL377","v":"Suivi evaluation"},null,{"$f":"SUMIF(Inputs_Rec.!$CC$6:$CC$373,1,Inputs_Rec.!$CX$6:$CX$373)","v":0},{"$f":"SUMIF(Inputs_Rec.!$CC$6:$CC$373,1,Inputs_Rec.!$CY$6:$CY$373)","v":0},{"$f":"SUMIF(Inputs_Rec.!$CC$6:$CC$373,1,Inputs_Rec.!$CZ$6:$CZ$373)","v":0},{"$f":"SUMIF(Inputs_Rec.!$CC$6:$CC$373,1,Inputs_Rec.!$DA$6:$DA$373)","v":0}]
[null,null,{"$f":"IF(Setup!$F$9=1,Translate!B113,Translate!C113)","v":"Gouvernance nationale"},{"$f":"SUMIF(Inputs_Rec.!$CD$6:$CD$373,1,Inputs_Rec.!$BH$6:$BH$373)","v":1},{"$f":"SUMIF(Inputs_Rec.!$CD$6:$CD$373,1,Inputs_Rec.!$BI$6:$BI$373)","v":0},{"$f":"SUMIF(Inputs_Rec.!$CD$6:$CD$373,1,Inputs_Rec.!$BJ$6:$BJ$373)","v":1},{"$f":"SUMIF(Inputs_Rec.!$CD$6:$CD$373,1,Inputs_Rec.!$BK$6:$BK$373)","v":0},{"$f":"SUMIF(Inputs_Rec.!$CD$6:$CD$373,1,Inputs_Rec.!$BL$6:$BL$373)","v":0},{"$f":"SUMIF(Inputs_Rec.!$CD$6:$CD$373,1,Inputs_Rec.!$BO$6:$BO$373)","v":1},{"$f":"SUMIF(Inputs_Rec.!$CD$6:$CD$373,1,Inputs_Rec.!$BM$6:$BM$373)","v":0},{"$f":"SUMIF(Inputs_Rec.!$CD$6:$CD$373,1,Inputs_Rec.!$BN$6:$BN$373)","v":0},null,{"$f":"Inputs_Rec.!AL378","v":"Gestion des achats/stocks"},null,{"$f":"SUMIF(Inputs_Rec.!$CD$6:$CD$373,1,Inputs_Rec.!$CX$6:$CX$373)","v":0},{"$f":"SUMIF(Inputs_Rec.!$CD$6:$CD$373,1,Inputs_Rec.!$CY$6:$CY$373)","v":0},{"$f":"SUMIF(Inputs_Rec.!$CD$6:$CD$373,1,Inputs_Rec.!$CZ$6:$CZ$373)","v":0},{"$f":"SUMIF(Inputs_Rec.!$CD$6:$CD$373,1,Inputs_Rec.!$DA$6:$DA$373)","v":0}]
[null,null,{"$f":"IF(Setup!$F$9=1,Translate!B114,Translate!C114)","v":"Suivi evaluation"},{"$f":"SUMIF(Inputs_Rec.!$CE$6:$CE$373,1,Inputs_Rec.!$BH$6:$BH$373)","v":0},{"$f":"SUMIF(Inputs_Rec.!$CE$6:$CE$373,1,Inputs_Rec.!$BI$6:$BI$373)","v":0},{"$f":"SUMIF(Inputs_Rec.!$CE$6:$CE$373,1,Inputs_Rec.!$BJ$6:$BJ$373)","v":0},{"$f":"SUMIF(Inputs_Rec.!$CE$6:$CE$373,1,Inputs_Rec.!$BK$6:$BK$373)","v":0},{"$f":"SUMIF(Inputs_Rec.!$CE$6:$CE$373,1,Inputs_Rec.!$BL$6:$BL$373)","v":0},{"$f":"SUMIF(Inputs_Rec.!$CE$6:$CE$373,1,Inputs_Rec.!$BO$6:$BO$373)","v":0},{"$f":"SUMIF(Inputs_Rec.!$CE$6:$CE$373,1,Inputs_Rec.!$BM$6:$BM$373)","v":0},{"$f":"SUMIF(Inputs_Rec.!$CE$6:$CE$373,1,Inputs_Rec.!$BN$6:$BN$373)","v":0},null,{"$f":"Inputs_Rec.!AL379","v":"Finances"},null,{"$f":"SUMIF(Inputs_Rec.!$CE$6:$CE$373,1,Inputs_Rec.!$CX$6:$CX$373)","v":0},{"$f":"SUMIF(Inputs_Rec.!$CE$6:$CE$373,1,Inputs_Rec.!$CY$6:$CY$373)","v":0},{"$f":"SUMIF(Inputs_Rec.!$CE$6:$CE$373,1,Inputs_Rec.!$CZ$6:$CZ$373)","v":0},{"$f":"SUMIF(Inputs_Rec.!$CE$6:$CE$373,1,Inputs_Rec.!$DA$6:$DA$373)","v":0}]
[null,null,{"$f":"IF(Setup!$F$9=1,Translate!B115,Translate!C115)","v":"Gestion des achats/stocks"},{"$f":"SUMIF(Inputs_Rec.!$CF$6:$CF$373,1,Inputs_Rec.!$BH$6:$BH$373)","v":0},{"$f":"SUMIF(Inputs_Rec.!$CF$6:$CF$373,1,Inputs_Rec.!$BI$6:$BI$373)","v":0},{"$f":"SUMIF(Inputs_Rec.!$CF$6:$CF$373,1,Inputs_Rec.!$BJ$6:$BJ$373)","v":0},{"$f":"SUMIF(Inputs_Rec.!$CF$6:$CF$373,1,Inputs_Rec.!$BK$6:$BK$373)","v":0},{"$f":"SUMIF(Inputs_Rec.!$CF$6:$CF$373,1,Inputs_Rec.!$BL$6:$BL$373)","v":0},{"$f":"SUMIF(Inputs_Rec.!$CF$6:$CF$373,1,Inputs_Rec.!$BO$6:$BO$373)","v":0},{"$f":"SUMIF(Inputs_Rec.!$CF$6:$CF$373,1,Inputs_Rec.!$BM$6:$BM$373)","v":0},{"$f":"SUMIF(Inputs_Rec.!$CF$6:$CF$373,1,Inputs_Rec.!$BN$6:$BN$373)","v":0},null,{"$f":"Inputs_Rec.!AL380","v":"Autres"},null,{"$f":"SUMIF(Inputs_Rec.!$CF$6:$CF$373,1,Inputs_Rec.!$CX$6:$CX$373)","v":0},{"$f":"SUMIF(Inputs_Rec.!$CF$6:$CF$373,1,Inputs_Rec.!$CY$6:$CY$373)","v":0},{"$f":"SUMIF(Inputs_Rec.!$CF$6:$CF$373,1,Inputs_Rec.!$CZ$6:$CZ$373)","v":0},{"$f":"SUMIF(Inputs_Rec.!$CF$6:$CF$373,1,Inputs_Rec.!$DA$6:$DA$373)","v":0}]
[null,null,{"$f":"IF(Setup!$F$9=1,Translate!B116,Translate!C116)","v":"Finances"},{"$f":"SUMIF(Inputs_Rec.!$CG$6:$CG$373,1,Inputs_Rec.!$BH$6:$BH$373)","v":0},{"$f":"SUMIF(Inputs_Rec.!$CG$6:$CG$373,1,Inputs_Rec.!$BI$6:$BI$373)","v":0},{"$f":"SUMIF(Inputs_Rec.!$CG$6:$CG$373,1,Inputs_Rec.!$BJ$6:$BJ$373)","v":0},{"$f":"SUMIF(Inputs_Rec.!$CG$6:$CG$373,1,Inputs_Rec.!$BK$6:$BK$373)","v":0},{"$f":"SUMIF(Inputs_Rec.!$CG$6:$CG$373,1,Inputs_Rec.!$BL$6:$BL$373)","v":0},{"$f":"SUMIF(Inputs_Rec.!$CG$6:$CG$373,1,Inputs_Rec.!$BO$6:$BO$373)","v":0},{"$f":"SUMIF(Inputs_Rec.!$CG$6:$CG$373,1,Inputs_Rec.!$BM$6:$BM$373)","v":0},{"$f":"SUMIF(Inputs_Rec.!$CG$6:$CG$373,1,Inputs_Rec.!$BN$6:$BN$373)","v":0},{"$nulls":3},{"$f":"SUMIF(Inputs_Rec.!$CG$6:$CG$373,1,Inputs_Rec.!$CX$6:$CX$373)","v":0},{"$f":"SUMIF(Inputs_Rec.!$CG$6:$CG$373,1,Inputs_Rec.!$CY$6:$CY$373)","v":0},{"$f":"SUMIF(Inputs_Rec.!$CG$6:$CG$373,1,Inputs_Rec.!$CZ$6:$CZ$373)","v":0},{"$f":"SUMIF(Inputs_Rec.!$CG$6:$CG$373,1,Inputs_Rec.!$DA$6:$DA$373)","v":0}]
[null,null,{"$f":"IF(Setup!$F$9=1,Translate!B117,Translate!C117)","v":"Autres"},{"$f":"SUMIF(Inputs_Rec.!$CH$6:$CH$373,1,Inputs_Rec.!$BH$6:$BH$373)","v":0},{"$f":"SUMIF(Inputs_Rec.!$CH$6:$CH$373,1,Inputs_Rec.!$BI$6:$BI$373)","v":0},{"$f":"SUMIF(Inputs_Rec.!$CH$6:$CH$373,1,Inputs_Rec.!$BJ$6:$BJ$373)","v":0},{"$f":"SUMIF(Inputs_Rec.!$CH$6:$CH$373,1,Inputs_Rec.!$BK$6:$BK$373)","v":0},{"$f":"SUMIF(Inputs_Rec.!$CH$6:$CH$373,1,Inputs_Rec.!$BL$6:$BL$373)","v":0},{"$f":"SUMIF(Inputs_Rec.!$CH$6:$CH$373,1,Inputs_Rec.!$BO$6:$BO$373)","v":0},{"$f":"SUMIF(Inputs_Rec.!$CH$6:$CH$373,1,Inputs_Rec.!$BM$6:$BM$373)","v":0},{"$f":"SUMIF(Inputs_Rec.!$CH$6:$CH$373,1,Inputs_Rec.!$BN$6:$BN$373)","v":0},{"$nulls":3},{"$f":"SUMIF(Inputs_Rec.!$CH$6:$CH$373,1,Inputs_Rec.!$CX$6:$CX$373)","v":0},{"$f":"SUMIF(Inputs_Rec.!$CH$6:$CH$373,1,Inputs_Rec.!$CY$6:$CY$373)","v":0},{"$f":"SUMIF(Inputs_Rec.!$CH$6:$CH$373,1,Inputs_Rec.!$CZ$6:$CZ$373)","v":0},{"$f":"SUMIF(Inputs_Rec.!$CH$6:$CH$373,1,Inputs_Rec.!$DA$6:$DA$373)","v":0}]
[null,null,"Total",{"$f":"IF((SUM(D5:D10))=0,\"\",SUM(D5:D10))","v":1},{"$f":"IF((SUM(E5:E10))=0,\"\",SUM(E5:E10))","v":""},1,"","",1,"","","","","","","","",""]

{"sheet":"Dashboard_Rec","index":7,"n_rows":15,"n_cols":23,"rows_kept":15,"merged":[[0,0,0,14],[0,20,0,22],[1,1,1,2],[2,1,2,2],[3,1,3,10]]}
[{"$f":"IF(Setup!$F$9=1,Translate!B79,Translate!C79)","v":"SYNTHÈSE DES RECOMMANDATIONS/MESURES PAR TYPE"},{"$nulls":19},{"$f":"Dashboard_Structures!S1","v":"Vigilance"}]
[{"$nulls":3},"Total",{"$f":"Inputs_Rec.!BI5","v":"Satisfait"},{"$f":"Inputs_Rec.!BJ5","v":"Non satisfaite-en cours"},{"$f":"Inputs_Rec.!BK5","v":"Non satisfaite - Non commencée"},{"$f":"Inputs_Rec.!BL5","v":"Non commencé"},{"$f":"Inputs_Rec.!BO5","v":"Delai depasse"},{"$f":"Inputs_Rec.!BM5","v":"Non applicable/Non valable"},{"$f":"Inputs_Rec.!BN5","v":"Immédiat (réalisé)"},{"$f":"Inputs_Rec.!CX5","v":"Immédiat (non réalisé)"},{"$f":"Inputs_Rec.!CY5","v":"Sans délai (en cours)"},{"$f":"Inputs_Rec.!CZ5","v":"Sans délai (réalisé)"},{"$f":"Inputs_Rec.!DA5","v":"Sans délai (non réalisé)"},null,{"$f":"Inputs_Rec.!AO377","v":"Select"},{"$nulls":3},{"$f":"Dashboard_Structures!S2","v":"Delai depasse"},{"$f":"Dashboard_Structures!T2","v":"Dans moins de 2 semaines"},{"$f":"Dashboard_Structures!U2","v":"Dans plus de 2 semaines"}]
[null,{"$f":"IF(Setup!$F$9=1,Translate!B77,Translate!C77)","v":"Nombre total de Recommandations/ Décisions"},null,{"$f":"IF(SUM(Inputs_Rec.!BH6:'Inputs_Rec.'!BH373)=0,\"\",SUM(Inputs_Rec.!BH6:'Inputs_Rec.'!BH373))","v":1},{"$f":"IF(SUM(Inputs_Rec.!BI6:'Inputs_Rec.'!BI373)=0,\"\",SUM(Inputs_Rec.!BI6:'Inputs_Rec.'!BI373))","v":""},{"$f":"IF(SUM(Inputs_Rec.!BJ6:'Inputs_Rec.'!BJ373)=0,\"\",SUM(Inputs_Rec.!BJ6:'Inputs_Rec.'!BJ373))","v":1},{"$f":"IF(SUM(Inputs_Rec.!BK6:'Inputs_Rec.'!BK373)=0,\"\",SUM(Inputs_Rec.!BK6:'Inputs_Rec.'!BK373))","v":""},{"$f":"IF(SUM(Inputs_Rec.!BL6:'Inputs_Rec.'!BL373)=0,\"\",SUM(Inputs_Rec.!BL6:'Inputs_Rec.'!BL373))","v":""},{"$f":"IF(SUM(Inputs_Rec.!BO6:'Inputs_Rec.'!BO373)=0,\"\",SUM(Inputs_Rec.!BO6:'Inputs_Rec.'!BO373))","v":1},{"$f":"IF(SUM(Inputs_Rec.!BM6:'Inputs_Rec.'!BM373)=0,\"\",SUM(Inputs_Rec.!BM6:'Inputs_Rec.'!BM373))","v":""},{"$f":"IF(SUM(Inputs_Rec.!BN6:'Inputs_Rec.'!BN373)=0,\"\",SUM(Inputs_Rec.!BN6:'Inputs_Rec.'!BN373))","v":""},{"$f":"IF(SUM(Inputs_Rec.!CX6:'Inputs_Rec.'!CX373)=0,\"\",SUM(Inputs_Rec.!CX6:'Inputs_Rec.'!CX373))","v":""},{"$f":"IF(SUM(Inputs_Rec.!CY6:'Inputs_Rec.'!CY373)=0,\"\",SUM(Inputs_Rec.!CY6:'Inputs_Rec.'!CY373))","v":""},{"$f":"IF(SUM(Inputs_Rec.!CZ6:'Inputs_Rec.'!CZ373)=0,\"\",SUM(Inputs_Rec.!CZ6:'Inputs_Rec.'!CZ373))","v":""},{"$f":"IF(SUM(Inputs_Rec.!DA6:'Inputs_Rec.'!DA373)=0,\"\",SUM(Inputs_Rec.!DA6:'Inputs_Rec.'!DA373))","v":""},null,{"$f":"Inputs_Rec.!AO378","v":"Condition de l'accord "},{"$nulls":3},{"$f":"IF(SUM(Inputs_Rec.!BO6:'Inputs_Rec.'!BO373)=0,\"\",SUM(Inputs_Rec.!BO6:'Inputs_Rec.'!BO373))","v":1},{"$f":"SUM(Inputs_Rec.!CI6:CI373)","v":0},{"$f":"SUM(Inputs_Rec.!CJ6:CJ373)","v":0}]
[null,{"$f":"IF(Setup!$F$9=1,Translate!B74,Translate!C74)","v":"Nombre total de Recommandations/ Décisions par type"},{"$nulls":14},{"$f":"Inputs_Rec.!AO379","v":"Mesures de gestion"}]
[null,null,{"$f":"Q3","v":"Condition de l'accord "},{"$f":"SUMIF(Inputs_Rec.!$C$6:$C$373,Inputs_Rec.!$BS$5,Inputs_Rec.!$BH$6:$BH$373)","v":1},{"$f":"SUMIF(Inputs_Rec.!$C$6:$C$373,Inputs_Rec.!$BS$5,Inputs_Rec.!$BI$6:$BI$373)","v":0},{"$f":"SUMIF(Inputs_Rec.!$C$6:$C$373,Inputs_Rec.!$BS$5,Inputs_Rec.!$BJ$6:$BJ$373)","v":1},{"$f":"SUMIF(Inputs_Rec.!$C$6:$C$373,Inputs_Rec.!$BS$5,Inputs_Rec.!$BK$6:$BK$373)","v":0},{"$f":"SUMIF(Inputs_Rec.!$C$6:$C$373,Inputs_Rec.!$BS$5,Inputs_Rec.!$BL$6:$BL$373)","v":0},{"$f":"SUMIF(Inputs_Rec.!$C$6:$C$373,Inputs_Rec.!$BS$5,Inputs_Rec.!$BO$6:$BO$373)","v":1},{"$f":"SUMIF(Inputs_Rec.!$C$6:$C$373,Inputs_Rec.!$BS$5,Inputs_Rec.!$BM$6:$BM$373)","v":0},{"$f":"SUMIF(Inputs_Rec.!$C$6:$C$373,Inputs_Rec.!$BS$5,Inputs_Rec.!$BN$6:$BN$373)","v":0},{"$f":"SUMIF(Inputs_Rec.!$C$6:$C$373,Inputs_Rec.!$BS$5,Inputs_Rec.!$CX$6:$CX$373)","v":0},{"$f":"SUMIF(Inputs_Rec.!$C$6:$C$373,Inputs_Rec.!$BS$5,Inputs_Rec.!$CY$6:$CY$373)","v":0},{"$f":"SUMIF(Inputs_Rec.!$C$6:$C$373,Inputs_Rec.!$BS$5,Inputs_Rec.!$CZ$6:$CZ$373)","v":0},{"$f":"SUMIF(Inputs_Rec.!$C$6:$C$373,Inputs_Rec.!$BS$5,Inputs_Rec.!$DA$6:$DA$373)","v":0},null,{"$f":"Inputs_Rec.!AO380","v":"Recommandations OIG"},{"$nulls":3},{"$f":"I5","v":1},{"$f":"SUMIF(Inputs_Rec.!$C$6:$C$373,Inputs_Rec.!$BS$5,Inputs_Rec.!$CI$6:$CI$373)","v":0},{"$f":"SUMIF(Inputs_Rec.!$C$6:$C$373,Inputs_Rec.!$BS$5,Inputs_Rec.!$CJ$6:$CJ$373)","v":0}]
[null,null,{"$f":"Q4","v":"Mesures de gestion"},{"$f":"SUMIF(Inputs_Rec.!$C$6:$C$373,Inputs_Rec.!$BT$5,Inputs_Rec.!$BH$6:$BH$373)","v":0},{"$f":"SUMIF(Inputs_Rec.!$C$6:$C$373,Inputs_Rec.!$BT$5,Inputs_Rec.!$BI$6:$BI$373)","v":0},{"$f":"SUMIF(Inputs_Rec.!$C$6:$C$373,Inputs_Rec.!$BT$5,Inputs_Rec.!$BJ$6:$BJ$373)","v":0},{"$f":"SUMIF(Inputs_Rec.!$C$6:$C$373,Inputs_Rec.!$BT$5,Inputs_Rec.!$BK$6:$BK$373)","v":0},{"$f":"SUMIF(Inputs_Rec.!$C$6:$C$373,Inputs_Rec.!$BT$5,Inputs_Rec.!$BL$6:$BL$373)","v":0},{"$f":"SUMIF(Inputs_Rec.!$C$6:$C$373,Inputs_Rec.!$BT$5,Inputs_Rec.!$BO$6:$BO$373)","v":0},{"$f":"SUMIF(Inputs_Rec.!$C$6:$C$373,Inputs_Rec.!$BT$5,Inputs_Rec.!$BM$6:$BM$373)","v":0},{"$f":"SUMIF(Inputs_Rec.!$C$6:$C$373,Inputs_Rec.!$BT$5,Inputs_Rec.!$BN$6:$BN$373)","v":0},{"$f":"SUMIF(Inputs_Rec.!$C$6:$C$373,Inputs_Rec.!$BT$5,Inputs_Rec.!$CX$6:$CX$373)","v":0},{"$f":"SUMIF(Inputs_Rec.!$C$6:$C$373,Inputs_Rec.!$BT$5,Inputs_Rec.!$CY$6:$CY$373)","v":0},{"$f":"SUMIF(Inputs_Rec.!$C$6:$C$373,Inputs_Rec.!$BT$5,Inputs_Rec.!$CZ$6:$CZ$373)","v":0},{"$f":"SUMIF(Inputs_Rec.!$C$6:$C$373,Inputs_Rec.!$BT$5,Inputs_Rec.!$DA$6:$DA$373)","v":0},null,{"$f":"Inputs_Rec.!AO381","v":"Actions/recommandations Equipe pays"},{"$nulls":3},{"$f":"I6","v":0},{"$f":"SUMIF(Inputs_Rec.!$C$6:$C$373,Inputs_Rec.!$BT$5,Inputs_Rec.!$CI$6:$CI$373)","v":0},{"$f":"SUMIF(Inputs_Rec.!$C$6:$C$373,Inputs_Rec.!$BT$5,Inputs_Rec.!$CJ$6:$CJ$373)","v":0}]
[null,null,"Recommandations OIG",{"$f":"SUMIF(Inputs_Rec.!$C$6:$C$373,Inputs_Rec.!$BU$5,Inputs_Rec.!$BH$6:$BH$373)","v":0},{"$f":"SUMIF(Inputs_Rec.!$C$6:$C$373,Inputs_Rec.!$BU$5,Inputs_Rec.!$BI$6:$BI$373)","v":0},{"$f":"SUMIF(Inputs_Rec.!$C$6:$C$373,Inputs_Rec.!$BU$5,Inputs_Rec.!$BJ$6:$BJ$373)","v":0},{"$f":"SUMIF(Inputs_Rec.!$C$6:$C$373,Inputs_Rec.!$BU$5,Inputs_Rec.!$BK$6:$BK$373)","v":0},{"$f":"SUMIF(Inputs_Rec.!$C$6:$C$373,Inputs_Rec.!$BU$5,Inputs_Rec.!$BL$6:$BL$373)","v":0},{"$f":"SUMIF(Inputs_Rec.!$C$6:$C$373,Inputs_Rec.!$BU$5,Inputs_Rec.!$BO$6:$BO$373)","v":0},{"$f":"SUMIF(Inputs_Rec.!$C$6:$C$373,Inputs_Rec.!$BU$5,Inputs_Rec.!$BM$6:$BM$373)","v":0},{"$f":"SUMIF(Inputs_Rec.!$C$6:$C$373,Inputs_Rec.!$BU$5,Inputs_Rec.!$BN$6:$BN$373)","v":0},{"$f":"SUMIF(Inputs_Rec.!$C$6:$C$373,Inputs_Rec.!$BU$5,Inputs_Rec.!$CX$6:$CX$373)","v":0},{"$f":"SUMIF(Inputs_Rec.!$C$6:$C$373,Inputs_Rec.!$BU$5,Inputs_Rec.!$CY$6:$CY$373)","v":0},{"$f":"SUMIF(Inputs_Rec.!$C$6:$C$373,Inputs_Rec.!$BU$5,Inputs_Rec.!$CZ$6:$CZ$373)","v":0},{"$f":"SUMIF(Inputs_Rec.!$C$6:$C$373,Inputs_Rec.!$BU$5,Inputs_Rec.!$DA$6:$DA$373)","v":0},null,{"$f":"Inputs_Rec.!AO382","v":"Actions suite revue PU/PUDR"},{"$nulls":3},{"$f":"I7","v":0},{"$f":"SUMIF(Inputs_Rec.!$C$6:$C$373,Inputs_Rec.!$BU$5,Inputs_Rec.!$CI$6:$CI$373)","v":0},{"$f":"SUMIF(Inputs_Rec.!$C$6:$C$373,Inputs_Rec.!$BU$5,Inputs_Rec.!$CJ$6:$CJ$373)","v":0}]
[null,null,"Actions/recommandations Equipe pays",{"$f":"SUMIF(Inputs_Rec.!$C$6:$C$373,Inputs_Rec.!$BV$5,Inputs_Rec.!$BH$6:$BH$373)","v":0},{"$f":"SUMIF(Inputs_Rec.!$C$6:$C$373,Inputs_Rec.!$BV$5,Inputs_Rec.!$BI$6:$BI$373)","v":0},{"$f":"SUMIF(Inputs_Rec.!$C$6:$C$373,Inputs_Rec.!$BV$5,Inputs_Rec.!$BJ$6:$BJ$373)","v":0},{"$f":"SUMIF(Inputs_Rec.!$C$6:$C$373,Inputs_Rec.!$BV$5,Inputs_Rec.!$BK$6:$BK$373)","v":0},{"$f":"SUMIF(Inputs_Rec.!$C$6:$C$373,Inputs_Rec.!$BV$5,Inputs_Rec.!$BL$6:$BL$373)","v":0},{"$f":"SUMIF(Inputs_Rec.!$C$6:$C$373,Inputs_Rec.!$BV$5,Inputs_Rec.!$BO$6:$BO$373)","v":0},{"$f":"SUMIF(Inputs_Rec.!$C$6:$C$373,Inputs_Rec.!$BV$5,Inputs_Rec.!$BM$6:$BM$373)","v":0},{"$f":"SUMIF(Inputs_Rec.!$C$6:$C$373,Inputs_Rec.!$BV$5,Inputs_Rec.!$BN$6:$BN$373)","v":0},{"$f":"SUMIF(Inputs_Rec.!$C$6:$C$373,Inputs_Rec.!$BV$5,Inputs_Rec.!$CX$6:$CX$373)","v":0},{"$f":"SUMIF(Inputs_Rec.!$C$6:$C$373,Inputs_Rec.!$BV$5,Inputs_Rec.!$CY$6:$CY$373)","v":0},{"$f":"SUMIF(Inputs_Rec.!$C$6:$C$373,Inputs_Rec.!$BV$5,Inputs_Rec.!$CZ$6:$CZ$373)","v":0},{"$f":"SUMIF(Inputs_Rec.!$C$6:$C$373,Inputs_Rec.!$BV$5,Inputs_Rec.!$DA$6:$DA$373)","v":0},null,{"$f":"Inputs_Rec.!AO383","v":"Actions/Recommandations LFA"},{"$nulls":3},{"$f":"I8","v":0},{"$f":"SUMIF(Inputs_Rec.!$C$6:$C$373,Inputs_Rec.!$BV$5,Inputs_Rec.!$CI$6:$CI$373)","v":0},{"$f":"SUMIF(Inputs_Rec.!$C$6:$C$373,Inputs_Rec.!$BV$5,Inputs_Rec.!$CJ$6:$CJ$373)","v":0}]
[null,null,"Actions suite revue PU/PUDR",{"$f":"SUMIF(Inputs_Rec.!$C$6:$C$373,Inputs_Rec.!$BW$5,Inputs_Rec.!$BH$6:$BH$373)","v":0},{"$f":"SUMIF(Inputs_Rec.!$C$6:$C$373,Inputs_Rec.!$BW$5,Inputs_Rec.!$BI$6:$BI$373)","v":0},{"$f":"SUMIF(Inputs_Rec.!$C$6:$C$373,Inputs_Rec.!$BW$5,Inputs_Rec.!$BJ$6:$BJ$373)","v":0},{"$f":"SUMIF(Inputs_Rec.!$C$6:$C$373,Inputs_Rec.!$BW$5,Inputs_Rec.!$BK$6:$BK$373)","v":0},{"$f":"SUMIF(Inputs_Rec.!$C$6:$C$373,Inputs_Rec.!$BW$5,Inputs_Rec.!$BL$6:$BL$373)","v":0},{"$f":"SUMIF(Inputs_Rec.!$C$6:$C$373,Inputs_Rec.!$BW$5,Inputs_Rec.!$BO$6:$BO$373)","v":0},{"$f":"SUMIF(Inputs_Rec.!$C$6:$C$373,Inputs_Rec.!$BW$5,Inputs_Rec.!$BM$6:$BM$373)","v":0},{"$f":"SUMIF(Inputs_Rec.!$C$6:$C$373,Inputs_Rec.!$BW$5,Inputs_Rec.!$BN$6:$BN$373)","v":0},{"$f":"SUMIF(Inputs_Rec.!$C$6:$C$373,Inputs_Rec.!$BW$5,Inputs_Rec.!$CX$6:$CX$373)","v":0},{"$f":"SUMIF(Inputs_Rec.!$C$6:$C$373,Inputs_Rec.!$BW$5,Inputs_Rec.!$CY$6:$CY$373)","v":0},{"$f":"SUMIF(Inputs_Rec.!$C$6:$C$373,Inputs_Rec.!$BW$5,Inputs_Rec.!$CZ$6:$CZ$373)","v":0},{"$f":"SUMIF(Inputs_Rec.!$C$6:$C$373,Inputs_Rec.!$BW$5,Inputs_Rec.!$DA$6:$DA$373)","v":0},null,{"$f":"Inputs_Rec.!AO384","v":"Actions/recommandations ICN"},{"$nulls":3},0,{"$f":"SUMIF(Inputs_Rec.!$C$6:$C$373,Inputs_Rec.!$BW$5,Inputs_Rec.!$CI$6:$CI$373)","v":0},{"$f":"SUMIF(Inputs_Rec.!$C$6:$C$373,Inputs_Rec.!$BW$5,Inputs_Rec.!$CJ$6:$CJ$373)","v":0}]
[null,null,"Actions/Recommandations LFA",{"$f":"SUMIF(Inputs_Rec.!$C$6:$C$373,Inputs_Rec.!$BX$5,Inputs_Rec.!$BH$6:$BH$373)","v":0},{"$f":"SUMIF(Inputs_Rec.!$C$6:$C$373,Inputs_Rec.!$BX$5,Inputs_Rec.!$BI$6:$BI$373)","v":0},{"$f":"SUMIF(Inputs_Rec.!$C$6:$C$373,Inputs_Rec.!$BX$5,Inputs_Rec.!$BJ$6:$BJ$373)","v":0},{"$f":"SUMIF(Inputs_Rec.!$C$6:$C$373,Inputs_Rec.!$BX$5,Inputs_Rec.!$BK$6:$BK$373)","v":0},{"$f":"SUMIF(Inputs_Rec.!$C$6:$C$373,Inputs_Rec.!$BX$5,Inputs_Rec.!$BL$6:$BL$373)","v":0},{"$f":"SUMIF(Inputs_Rec.!$C$6:$C$373,Inputs_Rec.!$BX$5,Inputs_Rec.!$BO$6:$BO$373)","v":0},{"$f":"SUMIF(Inputs_Rec.!$C$6:$C$373,Inputs_Rec.!$BX$5,Inputs_Rec.!$BM$6:$BM$373)","v":0},{"$f":"SUMIF(Inputs_Rec.!$C$6:$C$373,Inputs_Rec.!$BX$5,Inputs_Rec.!$BN$6:$BN$373)","v":0},{"$f":"SUMIF(Inputs_Rec.!$C$6:$C$373,Inputs_Rec.!$BX$5,Inputs_Rec.!$CX$6:$CX$373)","v":0},{"$f":"SUMIF(Inputs_Rec.!$C$6:$C$373,Inputs_Rec.!$BX$5,Inputs_Rec.!$CY$6:$CY$373)","v":0},{"$f":"SUMIF(Inputs_Rec.!$C$6:$C$373,Inputs_Rec.!$BX$5,Inputs_Rec.!$CZ$6:$CZ$373)","v":0},{"$f":"SUMIF(Inputs_Rec.!$C$6:$C$373,Inputs_Rec.!$BX$5,Inputs_Rec.!$DA$6:$DA$373)","v":0},null,{"$f":"Inputs_Rec.!AO385","v":"Recommandations du PR vers les SR"},{"$nulls":3},0,{"$f":"SUMIF(Inputs_Rec.!$C$6:$C$373,Inputs_Rec.!$BX$5,Inputs_Rec.!$CI$6:$CI$373)","v":0},{"$f":"SUMIF(Inputs_Rec.!$C$6:$C$373,Inputs_Rec.!$BX$5,Inputs_Rec.!$CJ$6:$CJ$373)","v":0}]
[null,null,"Actions/recommandations ICN",{"$f":"SUMIF(Inputs_Rec.!$C$6:$C$373,Inputs_Rec.!$BY$5,Inputs_Rec.!$BH$6:$BH$373)","v":0},{"$f":"SUMIF(Inputs_Rec.!$C$6:$C$373,Inputs_Rec.!$BY$5,Inputs_Rec.!$BI$6:$BI$373)","v":0},{"$f":"SUMIF(Inputs_Rec.!$C$6:$C$373,Inputs_Rec.!$BY$5,Inputs_Rec.!$BJ$6:$BJ$373)","v":0},{"$f":"SUMIF(Inputs_Rec.!$C$6:$C$373,Inputs_Rec.!$BY$5,Inputs_Rec.!$BK$6:$BK$373)","v":0},{"$f":"SUMIF(Inputs_Rec.!$C$6:$C$373,Inputs_Rec.!$BY$5,Inputs_Rec.!$BL$6:$BL$373)","v":0},{"$f":"SUMIF(Inputs_Rec.!$C$6:$C$373,Inputs_Rec.!$BY$5,Inputs_Rec.!$BO$6:$BO$373)","v":0},{"$f":"SUMIF(Inputs_Rec.!$C$6:$C$373,Inputs_Rec.!$BY$5,Inputs_Rec.!$BM$6:$BM$373)","v":0},{"$f":"SUMIF(Inputs_Rec.!$C$6:$C$373,Inputs_Rec.!$BY$5,Inputs_Rec.!$BN$6:$BN$373)","v":0},{"$f":"SUMIF(Inputs_Rec.!$C$6:$C$373,Inputs_Rec.!$BY$5,Inputs_Rec.!$CX$6:$CX$373)","v":0},{"$f":"SUMIF(Inputs_Rec.!$C$6:$C$373,Inputs_Rec.!$BY$5,Inputs_Rec.!$CY$6:$CY$373)","v":0},{"$f":"SUMIF(Inputs_Rec.!$C$6:$C$373,Inputs_Rec.!$BY$5,Inputs_Rec.!$CZ$6:$CZ$373)","v":0},{"$f":"SUMIF(Inputs_Rec.!$C$6:$C$373,Inputs_Rec.!$BY$5,Inputs_Rec.!$DA$6:$DA$373)","v":0},null,{"$f":"Inputs_Rec.!AO386","v":"Actions/recommandations d'audit interne"},{"$nulls":3},0,{"$f":"SUMIF(Inputs_Rec.!$C$6:$C$373,Inputs_Rec.!$BY$5,Inputs_Rec.!$CI$6:$CI$373)","v":0},{"$f":"SUMIF(Inputs_Rec.!$C$6:$C$373,Inputs_Rec.!$BY$5,Inputs_Rec.!$CJ$6:$CJ$373)","v":0}]
[null,null,"Recommandations du PR vers les SR",{"$f":"SUMIF(Inputs_Rec.!$C$6:$C$373,Inputs_Rec.!$BZ$5,Inputs_Rec.!$BH$6:$BH$373)","v":0},{"$f":"SUMIF(Inputs_Rec.!$C$6:$C$373,Inputs_Rec.!$BZ$5,Inputs_Rec.!$BI$6:$BI$373)","v":0},{"$f":"SUMIF(Inputs_Rec.!$C$6:$C$373,Inputs_Rec.!$BZ$5,Inputs_Rec.!$BJ$6:$BJ$373)","v":0},{"$f":"SUMIF(Inputs_Rec.!$C$6:$C$373,Inputs_Rec.!$BZ$5,Inputs_Rec.!$BK$6:$BK$373)","v":0},{"$f":"SUMIF(Inputs_Rec.!$C$6:$C$373,Inputs_Rec.!$BZ$5,Inputs_Rec.!$BL$6:$BL$373)","v":0},{"$f":"SUMIF(Inputs_Rec.!$C$6:$C$373,Inputs_Rec.!$BZ$5,Inputs_Rec.!$BO$6:$BO$373)","v":0},{"$f":"SUMIF(Inputs_Rec.!$C$6:$C$373,Inputs_Rec.!$BZ$5,Inputs_Rec.!$BM$6:$BM$373)","v":0},{"$f":"SUMIF(Inputs_Rec.!$C$6:$C$373,Inputs_Rec.!$BZ$5,Inputs_Rec.!$BN$6:$BN$373)","v":0},{"$f":"SUMIF(Inputs_Rec.!$C$6:$C$373,Inputs_Rec.!$BZ$5,Inputs_Rec.!$CX$6:$CX$373)","v":0},{"$f":"SUMIF(Inputs_Rec.!$C$6:$C$373,Inputs_Rec.!$BZ$5,Inputs_Rec.!$CY$6:$CY$373)","v":0},{"$f":"SUMIF(Inputs_Rec.!$C$6:$C$373,Inputs_Rec.!$BZ$5,Inputs_Rec.!$CZ$6:$CZ$373)","v":0},{"$f":"SUMIF(Inputs_Rec.!$C$6:$C$373,Inputs_Rec.!$BZ$5,Inputs_Rec.!$DA$6:$DA$373)","v":0},null,{"$f":"Inputs_Rec.!AO387","v":"Actions/recommandations d'audit externe"},{"$nulls":3},0,{"$f":"SUMIF(Inputs_Rec.!$C$6:$C$373,Inputs_Rec.!$BZ$5,Inputs_Rec.!$CI$6:$CI$373)","v":0},{"$f":"SUMIF(Inputs_Rec.!$C$6:$C$373,Inputs_Rec.!$BZ$5,Inputs_Rec.!$CJ$6:$CJ$373)","v":0}]
[null,null,"Actions/recommandations d'audit interne",{"$f":"SUMIF(Inputs_Rec.!$C$6:$C$373,Inputs_Rec.!$CA$5,Inputs_Rec.!$BH$6:$BH$373)","v":0},{"$f":"SUMIF(Inputs_Rec.!$C$6:$C$373,Inputs_Rec.!$CA$5,Inputs_Rec.!$BI$6:$BI$373)","v":0},{"$f":"SUMIF(Inputs_Rec.!$C$6:$C$373,Inputs_Rec.!$CA$5,Inputs_Rec.!$BJ$6:$BJ$373)","v":0},{"$f":"SUMIF(Inputs_Rec.!$C$6:$C$373,Inputs_Rec.!$CA$5,Inputs_Rec.!$BK$6:$BK$373)","v":0},{"$f":"SUMIF(Inputs_Rec.!$C$6:$C$373,Inputs_Rec.!$CA$5,Inputs_Rec.!$BL$6:$BL$373)","v":0},{"$f":"SUMIF(Inputs_Rec.!$C$6:$C$373,Inputs_Rec.!$CA$5,Inputs_Rec.!$BO$6:$BO$373)","v":0},{"$f":"SUMIF(Inputs_Rec.!$C$6:$C$373,Inputs_Rec.!$CA$5,Inputs_Rec.!$BM$6:$BM$373)","v":0},{"$f":"SUMIF(Inputs_Rec.!$C$6:$C$373,Inputs_Rec.!$CA$5,Inputs_Rec.!$BN$6:$BN$373)","v":0},{"$f":"SUMIF(Inputs_Rec.!$C$6:$C$373,Inputs_Rec.!$CA$5,Inputs_Rec.!$CX$6:$CX$373)","v":0},{"$f":"SUMIF(Inputs_Rec.!$C$6:$C$373,Inputs_Rec.!$CA$5,Inputs_Rec.!$CY$6:$CY$373)","v":0},{"$f":"SUMIF(Inputs_Rec.!$C$6:$C$373,Inputs_Rec.!$CA$5,Inputs_Rec.!$CZ$6:$CZ$373)","v":0},{"$f":"SUMIF(Inputs_Rec.!$C$6:$C$373,Inputs_Rec.!$CA$5,Inputs_Rec.!$DA$6:$DA$373)","v":0},{"$nulls":5},0,{"$f":"SUMIF(Inputs_Rec.!$C$6:$C$373,Inputs_Rec.!$CA$5,Inputs_Rec.!$CI$6:$CI$373)","v":0},{"$f":"SUMIF(Inputs_Rec.!$C$6:$C$373,Inputs_Rec.!$CA$5,Inputs_Rec.!$CJ$6:$CJ$373)","v":0}]
[null,null,"Actions/recommandations d'audit externe",{"$f":"SUMIF(Inputs_Rec.!$C$6:$C$373,Inputs_Rec.!$CB$5,Inputs_Rec.!$BH$6:$BH$373)","v":0},{"$f":"SUMIF(Inputs_Rec.!$C$6:$C$373,Inputs_Rec.!$CB$5,Inputs_Rec.!$BI$6:$BI$373)","v":0},{"$f":"SUMIF(Inputs_Rec.!$C$6:$C$373,Inputs_Rec.!$CB$5,Inputs_Rec.!$BJ$6:$BJ$373)","v":0},{"$f":"SUMIF(Inputs_Rec.!$C$6:$C$373,Inputs_Rec.!$CB$5,Inputs_Rec.!$BK$6:$BK$373)","v":0},{"$f":"SUMIF(Inputs_Rec.!$C$6:$C$373,Inputs_Rec.!$CB$5,Inputs_Rec.!$BL$6:$BL$373)","v":0},{"$f":"SUMIF(Inputs_Rec.!$C$6:$C$373,Inputs_Rec.!$CB$5,Inputs_Rec.!$BO$6:$BO$373)","v":0},{"$f":"SUMIF(Inputs_Rec.!$C$6:$C$373,Inputs_Rec.!$CB$5,Inputs_Rec.!$BM$6:$BM$373)","v":0},{"$f":"SUMIF(Inputs_Rec.!$C$6:$C$373,Inputs_Rec.!$CB$5,Inputs_Rec.!$BN$6:$BN$373)","v":0},{"$f":"SUMIF(Inputs_Rec.!$C$6:$C$373,Inputs_Rec.!$CB$5,Inputs_Rec.!$CX$6:$CX$373)","v":0},{"$f":"SUMIF(Inputs_Rec.!$C$6:$C$373,Inputs_Rec.!$CB$5,Inputs_Rec.!$CY$6:$CY$373)","v":0},{"$f":"SUMIF(Inputs_Rec.!$C$6:$C$373,Inputs_Rec.!$CB$5,Inputs_Rec.!$CZ$6:$CZ$373)","v":0},{"$f":"SUMIF(Inputs_Rec.!$C$6:$C$373,Inputs_Rec.!$CB$5,Inputs_Rec.!$DA$6:$DA$373)","v":0},{"$nulls":5},0,{"$f":"SUMIF(Inputs_Rec.!$C$6:$C$373,Inputs_Rec.!$CB$5,Inputs_Rec.!$CI$6:$CI$373)","v":0},{"$f":"SUMIF(Inputs_Rec.!$C$6:$C$373,Inputs_Rec.!$CB$5,Inputs_Rec.!$CJ$6:$CJ$373)","v":0}]
[null,null,"Total",{"$f":"IF((SUM(D5:D14))=0,\"\",SUM(D5:D14))","v":1},{"$f":"IF((SUM(E5:E14))=0,\"\",SUM(E5:E14))","v":""},1,"","",1,"","","","","","",{"$f":"IF((SUM(P5:P13))=0,\"\",SUM(P5:P13))","v":""},"","","",null,{"$f":"IF((SUM(U5:U14))=0,\"\",SUM(U5:U14))","v":1},{"$f":"IF((SUM(V5:V14))=0,\"\",SUM(V5:V14))","v":""},{"$f":"IF((SUM(W5:W14))=0,\"\",SUM(W5:W14))","v":""}]

{"sheet":"Pendings","index":8,"n_rows":382,"n_cols":5,"rows_kept":382,"merged":[[0,0,0,4]]}
[{"$f":"IF(Setup!$F$9=1,Translate!B67,Translate!C67)","v":"RECOMMANDATIONS ET MESURES NON ENCORE MISES EN ŒUVRE"}]
[]
[{"$f":"IF(Setup!$F$9=1,Translate!B68,Translate!C68)","v":"Numéro"},{"$f":"IF(Setup!$F$9=1,Translate!B69,Translate!C69)","v":"Intitule Recommandations/Mesures"},{"$f":"IF(Setup!$F$9=1,Translate!B70,Translate!C70)","v":"Catégorie"},{"$f":"IF(Setup!$F$9=1,Translate!B71,Translate!C71)","v":"Responsable de la mise en œuvre"},{"$f":"IF(Setup!$F$9=1,Translate!B72,Translate!C72)","v":"Date limite"}]
[{"$f":"Param!B2","v":1},{"$f":"Param!C2","v":"fgyuhijok"},{"$f":"Param!K2","v":"Condition de l'accord "},{"$f":"Param!H2","v":"CNLS"},{"$f":"Param!D2","v":"2018-11-20"}]
[{"$f":"Param!B3","v":""},{"$f":"Param!C3","v":""},{"$f":"Param!K3","v":""},{"$f":"Param!H3","v":""},{"$f":"Param!D3","v":""}]
[{"$f":"Param!B4","v":""},{"$f":"Param!C4","v":""},{"$f":"Param!K4","v":""},{"$f":"Param!H4","v":""},{"$f":"Param!D4","v":""}]
[{"$f":"Param!B5","v":""},{"$f":"Param!C5","v":""},{"$f":"Param!K5","v":""},{"$f":"Param!H5","v":""},{"$f":"Param!D5","v":""}]
[{"$f":"Param!B6","v":""},{"$f":"Param!C6","v":""},{"$f":"Param!K6","v":""},{"$f":"Param!H6","v":""},{"$f":"Param!D6","v":""}]
[{"$f":"Param!B7","v":""},{"$f":"Param!C7","v":""},{"$f":"Param!K7","v":""},{"$f":"Param!H7","v":""},{"$f":"Param!D7","v":""}]
[{"$f":"Param!B8","v":""},{"$f":"Param!C8","v":""},{"$f":"Param!K8","v":""},{"$f":"Param!H8","v":""},{"$f":"Param!D8","v":""}]
[{"$f":"Param!B9","v":""},{"$f":"Param!C9","v":""},{"$f":"Param!K9","v":""},{"$f":"Param!H9","v":""},{"$f":"Param!D9","v":""}]
[{"$f":"Param!B10","v":""},{"$f":"Param!C10","v":""},{"$f":"Param!K10","v":""},{"$f":"Param!H10","v":""},{"$f":"Param!D10","v":""}]
[{"$f":"Param!B11","v":""},{"$f":"Param!C11","v":""},{"$f":"Param!K11","v":""},{"$f":"Param!H11","v":""},{"$f":"Param!D11","v":""}]
[{"$f":"Param!B12","v":""},{"$f":"Param!C12","v":""},{"$f":"Param!K12","v":""},{"$f":"Param!H12","v":""},{"$f":"Param!D12","v":""}]
[{"$f":"Param!B13","v":""},{"$f":"Param!C13","v":""},{"$f":"Param!K13","v":""},{"$f":"Param!H13","v":""},{"$f":"Param!D13","v":""}]
[{"$f":"Param!B14","v":""},{"$f":"Param!C14","v":""},{"$f":"Param!K14","v":""},{"$f":"Param!H14","v":""},{"$f":"Param!D14","v":""}]
[{"$f":"Param!B15","v":""},{"$f":"Param!C15","v":""},{"$f":"Param!K15","v":""},{"$f":"Param!H15","v":""},{"$f":"Param!D15","v":""}]
[{"$f":"Param!B16","v":""},{"$f":"Param!C16","v":""},{"$f":"Param!K16","v":""},{"$f":"Param!H16","v":""},{"$f":"Param!D16","v":""}]
[{"$f":"Param!B17","v":""},{"$f":"Param!C17","v":""},{"$f":"Param!K17","v":""},{"$f":"Param!H17","v":""},{"$f":"Param!D17","v":""}]
[{"$f":"Param!B18","v":""},{"$f":"Param!C18","v":""},{"$f":"Param!K18","v":""},{"$f":"Param!H18","v":""},{"$f":"Param!D18","v":""}]
[{"$f":"Param!B19","v":""},{"$f":"Param!C19","v":""},{"$f":"Param!K19","v":""},{"$f":"Param!H19","v":""},{"$f":"Param!D19","v":""}]
[{"$f":"Param!B20","v":""},{"$f":"Param!C20","v":""},{"$f":"Param!K20","v":""},{"$f":"Param!H20","v":""},{"$f":"Param!D20","v":""}]
[{"$f":"Param!B21","v":""},{"$f":"Param!C21","v":""},{"$f":"Param!K21","v":""},{"$f":"Param!H21","v":""},{"$f":"Param!D21","v":""}]
[{"$f":"Param!B22","v":""},{"$f":"Param!C22","v":""},{"$f":"Param!K22","v":""},{"$f":"Param!H22","v":""},{"$f":"Param!D22","v":""}]
[{"$f":"Param!B23","v":""},{"$f":"Param!C23","v":""},{"$f":"Param!K23","v":""},{"$f":"Param!H23","v":""},{"$f":"Param!D23","v":""}]
[{"$f":"Param!B24","v":""},{"$f":"Param!C24","v":""},{"$f":"Param!K24","v":""},{"$f":"Param!H24","v":""},{"$f":"Param!D24","v":""}]
[{"$f":"Param!B25","v":""},{"$f":"Param!C25","v":""},{"$f":"Param!K25","v":""},{"$f":"Param!H25","v":""},{"$f":"Param!D25","v":""}]
[{"$f":"Param!B26","v":""},{"$f":"Param!C26","v":""},{"$f":"Param!K26","v":""},{"$f":"Param!H26","v":""},{"$f":"Param!D26","v":""}]
[{"$f":"Param!B27","v":""},{"$f":"Param!C27","v":""},{"$f":"Param!K27","v":""},{"$f":"Param!H27","v":""},{"$f":"Param!D27","v":""}]
[{"$f":"Param!B28","v":""},{"$f":"Param!C28","v":""},{"$f":"Param!K28","v":""},{"$f":"Param!H28","v":""},{"$f":"Param!D28","v":""}]
[{"$f":"Param!B29","v":""},{"$f":"Param!C29","v":""},{"$f":"Param!K29","v":""},{"$f":"Param!H29","v":""},{"$f":"Param!D29","v":""}]
[{"$f":"Param!B30","v":""},{"$f":"Param!C30","v":""},{"$f":"Param!K30","v":""},{"$f":"Param!H30","v":""},{"$f":"Param!D30","v":""}]
[{"$f":"Param!B31","v":""},{"$f":"Param!C31","v":""},{"$f":"Param!K31","v":""},{"$f":"Param!H31","v":""},{"$f":"Param!D31","v":""}]
[{"$f":"Param!B32","v":""},{"$f":"Param!C32","v":""},{"$f":"Param!K32","v":""},{"$f":"Param!H32","v":""},{"$f":"Param!D32","v":""}]
[{"$f":"Param!B33","v":""},{"$f":"Param!C33","v":""},{"$f":"Param!K33","v":""},{"$f":"Param!H33","v":""},{"$f":"Param!D33","v":""}]
[{"$f":"Param!B34","v":""},{"$f":"Param!C34","v":""},{"$f":"Param!K34","v":""},{"$f":"Param!H34","v":""},{"$f":"Param!D34","v":""}]
[{"$f":"Param!B35","v":""},{"$f":"Param!C35","v":""},{"$f":"Param!K35","v":""},{"$f":"Param!H35","v":""},{"$f":"Param!D35","v":""}]
[{"$f":"Param!B36","v":""},{"$f":"Param!C36","v":""},{"$f":"Param!K36","v":""},{"$f":"Param!H36","v":""},{"$f":"Param!D36","v":""}]
[{"$f":"Param!B37","v":""},{"$f":"Param!C37","v":""},{"$f":"Param!K37","v":""},{"$f":"Param!H37","v":""},{"$f":"Param!D37","v":""}]
[{"$f":"Param!B38","v":""},{"$f":"Param!C38","v":""},{"$f":"Param!K38","v":""},{"$f":"Param!H38","v":""},{"$f":"Param!D38","v":""}]
[{"$f":"Param!B39","v":""},{"$f":"Param!C39","v":""},{"$f":"Param!K39","v":""},{"$f":"Param!H39","v":""},{"$f":"Param!D39","v":""}]
[{"$f":"Param!B40","v":""},{"$f":"Param!C40","v":""},{"$f":"Param!K40","v":""},{"$f":"Param!H40","v":""},{"$f":"Param!D40","v":""}]
[{"$f":"Param!B41","v":""},{"$f":"Param!C41","v":""},{"$f":"Param!K41","v":""},{"$f":"Param!H41","v":""},{"$f":"Param!D41","v":""}]
[{"$f":"Param!B42","v":""},{"$f":"Param!C42","v":""},{"$f":"Param!K42","v":""},{"$f":"Param!H42","v":""},{"$f":"Param!D42","v":""}]
[{"$f":"Param!B43","v":""},{"$f":"Param!C43","v":""},{"$f":"Param!K43","v":""},{"$f":"Param!H43","v":""},{"$f":"Param!D43","v":""}]
[{"$f":"Param!B44","v":""},{"$f":"Param!C44","v":""},{"$f":"Param!K44","v":""},{"$f":"Param!H44","v":""},{"$f":"Param!D44","v":""}]
[{"$f":"Param!B45","v":""},{"$f":"Param!C45","v":""},{"$f":"Param!K45","v":""},{"$f":"Param!H45","v":""},{"$f":"Param!D45","v":""}]
[{"$f":"Param!B46","v":""},{"$f":"Param!C46","v":""},{"$f":"Param!K46","v":""},{"$f":"Param!H46","v":""},{"$f":"Param!D46","v":""}]
[{"$f":"Param!B47","v":""},{"$f":"Param!C47","v":""},{"$f":"Param!K47","v":""},{"$f":"Param!H47","v":""},{"$f":"Param!D47","v":""}]
[{"$f":"Param!B48","v":""},{"$f":"Param!C48","v":""},{"$f":"Param!K48","v":""},{"$f":"Param!H48","v":""},{"$f":"Param!D48","v":""}]
[{"$f":"Param!B49","v":""},{"$f":"Param!C49","v":""},{"$f":"Param!K49","v":""},{"$f":"Param!H49","v":""},{"$f":"Param!D49","v":""}]
[{"$f":"Param!B50","v":""},{"$f":"Param!C50","v":""},{"$f":"Param!K50","v":""},{"$f":"Param!H50","v":""},{"$f":"Param!D50","v":""}]
[{"$f":"Param!B51","v":""},{"$f":"Param!C51","v":""},{"$f":"Param!K51","v":""},{"$f":"Param!H51","v":""},{"$f":"Param!D51","v":""}]
[{"$f":"Param!B52","v":""},{"$f":"Param!C52","v":""},{"$f":"Param!K52","v":""},{"$f":"Param!H52","v":""},{"$f":"Param!D52","v":""}]
[{"$f":"Param!B53","v":""},{"$f":"Param!C53","v":""},{"$f":"Param!K53","v":""},{"$f":"Param!H53","v":""},{"$f":"Param!D53","v":""}]
[{"$f":"Param!B54","v":""},{"$f":"Param!C54","v":""},{"$f":"Param!K54","v":""},{"$f":"Param!H54","v":""},{"$f":"Param!D54","v":""}]
[{"$f":"Param!B55","v":""},{"$f":"Param!C55","v":""},{"$f":"Param!K55","v":""},{"$f":"Param!H55","v":""},{"$f":"Param!D55","v":""}]
[{"$f":"Param!B56","v":""},{"$f":"Param!C56","v":""},{"$f":"Param!K56","v":""},{"$f":"Param!H56","v":""},{"$f":"Param!D56","v":""}]
[{"$f":"Param!B57","v":""},{"$f":"Param!C57","v":""},{"$f":"Param!K57","v":""},{"$f":"Param!H57","v":""},{"$f":"Param!D57","v":""}]
[{"$f":"Param!B58","v":""},{"$f":"Param!C58","v":""},{"$f":"Param!K58","v":""},{"$f":"Param!H58","v":""},{"$f":"Param!D58","v":""}]
[{"$f":"Param!B59","v":""},{"$f":"Param!C59","v":""},{"$f":"Param!K59","v":""},{"$f":"Param!H59","v":""},{"$f":"Param!D59","v":""}]
[{"$f":"Param!B60","v":""},{"$f":"Param!C60","v":""},{"$f":"Param!K60","v":""},{"$f":"Param!H60","v":""},{"$f":"Param!D60","v":""}]
[{"$f":"Param!B61","v":""},{"$f":"Param!C61","v":""},{"$f":"Param!K61","v":""},{"$f":"Param!H61","v":""},{"$f":"Param!D61","v":""}]
[{"$f":"Param!B62","v":""},{"$f":"Param!C62","v":""},{"$f":"Param!K62","v":""},{"$f":"Param!H62","v":""},{"$f":"Param!D62","v":""}]
[{"$f":"Param!B63","v":""},{"$f":"Param!C63","v":""},{"$f":"Param!K63","v":""},{"$f":"Param!H63","v":""},{"$f":"Param!D63","v":""}]
[{"$f":"Param!B64","v":""},{"$f":"Param!C64","v":""},{"$f":"Param!K64","v":""},{"$f":"Param!H64","v":""},{"$f":"Param!D64","v":""}]
[{"$f":"Param!B65","v":""},{"$f":"Param!C65","v":""},{"$f":"Param!K65","v":""},{"$f":"Param!H65","v":""},{"$f":"Param!D65","v":""}]
[{"$f":"Param!B66","v":""},{"$f":"Param!C66","v":""},{"$f":"Param!K66","v":""},{"$f":"Param!H66","v":""},{"$f":"Param!D66","v":""}]
[{"$f":"Param!B67","v":""},{"$f":"Param!C67","v":""},{"$f":"Param!K67","v":""},{"$f":"Param!H67","v":""},{"$f":"Param!D67","v":""}]
[{"$f":"Param!B68","v":""},{"$f":"Param!C68","v":""},{"$f":"Param!K68","v":""},{"$f":"Param!H68","v":""},{"$f":"Param!D68","v":""}]
[{"$f":"Param!B69","v":""},{"$f":"Param!C69","v":""},{"$f":"Param!K69","v":""},{"$f":"Param!H69","v":""},{"$f":"Param!D69","v":""}]
[{"$f":"Param!B70","v":""},{"$f":"Param!C70","v":""},{"$f":"Param!K70","v":""},{"$f":"Param!H70","v":""},{"$f":"Param!D70","v":""}]
[{"$f":"Param!B71","v":""},{"$f":"Param!C71","v":""},{"$f":"Param!K71","v":""},{"$f":"Param!H71","v":""},{"$f":"Param!D71","v":""}]
[{"$f":"Param!B72","v":""},{"$f":"Param!C72","v":""},{"$f":"Param!K72","v":""},{"$f":"Param!H72","v":""},{"$f":"Param!D72","v":""}]
[{"$f":"Param!B73","v":""},{"$f":"Param!C73","v":""},{"$f":"Param!K73","v":""},{"$f":"Param!H73","v":""},{"$f":"Param!D73","v":""}]
[{"$f":"Param!B74","v":""},{"$f":"Param!C74","v":""},{"$f":"Param!K74","v":""},{"$f":"Param!H74","v":""},{"$f":"Param!D74","v":""}]
[{"$f":"Param!B75","v":""},{"$f":"Param!C75","v":""},{"$f":"Param!K75","v":""},{"$f":"Param!H75","v":""},{"$f":"Param!D75","v":""}]
[{"$f":"Param!B76","v":""},{"$f":"Param!C76","v":""},{"$f":"Param!K76","v":""},{"$f":"Param!H76","v":""},{"$f":"Param!D76","v":""}]
[{"$f":"Param!B77","v":""},{"$f":"Param!C77","v":""},{"$f":"Param!K77","v":""},{"$f":"Param!H77","v":""},{"$f":"Param!D77","v":""}]
[{"$f":"Param!B78","v":""},{"$f":"Param!C78","v":""},{"$f":"Param!K78","v":""},{"$f":"Param!H78","v":""},{"$f":"Param!D78","v":""}]
[{"$f":"Param!B79","v":""},{"$f":"Param!C79","v":""},{"$f":"Param!K79","v":""},{"$f":"Param!H79","v":""},{"$f":"Param!D79","v":""}]
[{"$f":"Param!B80","v":""},{"$f":"Param!C80","v":""},{"$f":"Param!K80","v":""},{"$f":"Param!H80","v":""},{"$f":"Param!D80","v":""}]
[{"$f":"Param!B81","v":""},{"$f":"Param!C81","v":""},{"$f":"Param!K81","v":""},{"$f":"Param!H81","v":""},{"$f":"Param!D81","v":""}]
[{"$f":"Param!B82","v":""},{"$f":"Param!C82","v":""},{"$f":"Param!K82","v":""},{"$f":"Param!H82","v":""},{"$f":"Param!D82","v":""}]
[{"$f":"Param!B83","v":""},{"$f":"Param!C83","v":""},{"$f":"Param!K83","v":""},{"$f":"Param!H83","v":""},{"$f":"Param!D83","v":""}]
[{"$f":"Param!B84","v":""},{"$f":"Param!C84","v":""},{"$f":"Param!K84","v":""},{"$f":"Param!H84","v":""},{"$f":"Param!D84","v":""}]
[{"$f":"Param!B85","v":""},{"$f":"Param!C85","v":""},{"$f":"Param!K85","v":""},{"$f":"Param!H85","v":""},{"$f":"Param!D85","v":""}]
[{"$f":"Param!B86","v":""},{"$f":"Param!C86","v":""},{"$f":"Param!K86","v":""},{"$f":"Param!H86","v":""},{"$f":"Param!D86","v":""}]
[{"$f":"Param!B87","v":""},{"$f":"Param!C87","v":""},{"$f":"Param!K87","v":""},{"$f":"Param!H87","v":""},{"$f":"Param!D87","v":""}]
[{"$f":"Param!B88","v":""},{"$f":"Param!C88","v":""},{"$f":"Param!K88","v":""},{"$f":"Param!H88","v":""},{"$f":"Param!D88","v":""}]
[{"$f":"Param!B89","v":""},{"$f":"Param!C89","v":""},{"$f":"Param!K89","v":""},{"$f":"Param!H89","v":""},{"$f":"Param!D89","v":""}]
[{"$f":"Param!B90","v":""},{"$f":"Param!C90","v":""},{"$f":"Param!K90","v":""},{"$f":"Param!H90","v":""},{"$f":"Param!D90","v":""}]
[{"$f":"Param!B91","v":""},{"$f":"Param!C91","v":""},{"$f":"Param!K91","v":""},{"$f":"Param!H91","v":""},{"$f":"Param!D91","v":""}]
[{"$f":"Param!B92","v":""},{"$f":"Param!C92","v":""},{"$f":"Param!K92","v":""},{"$f":"Param!H92","v":""},{"$f":"Param!D92","v":""}]
[{"$f":"Param!B93","v":""},{"$f":"Param!C93","v":""},{"$f":"Param!K93","v":""},{"$f":"Param!H93","v":""},{"$f":"Param!D93","v":""}]
[{"$f":"Param!B94","v":""},{"$f":"Param!C94","v":""},{"$f":"Param!K94","v":""},{"$f":"Param!H94","v":""},{"$f":"Param!D94","v":""}]
[{"$f":"Param!B95","v":""},{"$f":"Param!C95","v":""},{"$f":"Param!K95","v":""},{"$f":"Param!H95","v":""},{"$f":"Param!D95","v":""}]
[{"$f":"Param!B96","v":""},{"$f":"Param!C96","v":""},{"$f":"Param!K96","v":""},{"$f":"Param!H96","v":""},{"$f":"Param!D96","v":""}]
[{"$f":"Param!B97","v":""},{"$f":"Param!C97","v":""},{"$f":"Param!K97","v":""},{"$f":"Param!H97","v":""},{"$f":"Param!D97","v":""}]
[{"$f":"Param!B98","v":""},{"$f":"Param!C98","v":""},{"$f":"Param!K98","v":""},{"$f":"Param!H98","v":""},{"$f":"Param!D98","v":""}]
[{"$f":"Param!B99","v":""},{"$f":"Param!C99","v":""},{"$f":"Param!K99","v":""},{"$f":"Param!H99","v":""},{"$f":"Param!D99","v":""}]
[{"$f":"Param!B100","v":""},{"$f":"Param!C100","v":""},{"$f":"Param!K100","v":""},{"$f":"Param!H100","v":""},{"$f":"Param!D100","v":""}]
[{"$f":"Param!B101","v":""},{"$f":"Param!C101","v":""},{"$f":"Param!K101","v":""},{"$f":"Param!H101","v":""},{"$f":"Param!D101","v":""}]
[{"$f":"Param!B102","v":""},{"$f":"Param!C102","v":""},{"$f":"Param!K102","v":""},{"$f":"Param!H102","v":""},{"$f":"Param!D102","v":""}]
[{"$f":"Param!B103","v":""},{"$f":"Param!C103","v":""},{"$f":"Param!K103","v":""},{"$f":"Param!H103","v":""},{"$f":"Param!D103","v":""}]
[{"$f":"Param!B104","v":""},{"$f":"Param!C104","v":""},{"$f":"Param!K104","v":""},{"$f":"Param!H104","v":""},{"$f":"Param!D104","v":""}]
[{"$f":"Param!B105","v":""},{"$f":"Param!C105","v":""},{"$f":"Param!K105","v":""},{"$f":"Param!H105","v":""},{"$f":"Param!D105","v":""}]
[{"$f":"Param!B106","v":""},{"$f":"Param!C106","v":""},{"$f":"Param!K106","v":""},{"$f":"Param!H106","v":""},{"$f":"Param!D106","v":""}]
[{"$f":"Param!B107","v":""},{"$f":"Param!C107","v":""},{"$f":"Param!K107","v":""},{"$f":"Param!H107","v":""},{"$f":"Param!D107","v":""}]
[{"$f":"Param!B108","v":""},{"$f":"Param!C108","v":""},{"$f":"Param!K108","v":""},{"$f":"Param!H108","v":""},{"$f":"Param!D108","v":""}]
[{"$f":"Param!B109","v":""},{"$f":"Param!C109","v":""},{"$f":"Param!K109","v":""},{"$f":"Param!H109","v":""},{"$f":"Param!D109","v":""}]
[{"$f":"Param!B110","v":""},{"$f":"Param!C110","v":""},{"$f":"Param!K110","v":""},{"$f":"Param!H110","v":""},{"$f":"Param!D110","v":""}]
[{"$f":"Param!B111","v":""},{"$f":"Param!C111","v":""},{"$f":"Param!K111","v":""},{"$f":"Param!H111","v":""},{"$f":"Param!D111","v":""}]
[{"$f":"Param!B112","v":""},{"$f":"Param!C112","v":""},{"$f":"Param!K112","v":""},{"$f":"Param!H112","v":""},{"$f":"Param!D112","v":""}]
[{"$f":"Param!B113","v":""},{"$f":"Param!C113","v":""},{"$f":"Param!K113","v":""},{"$f":"Param!H113","v":""},{"$f":"Param!D113","v":""}]
[{"$f":"Param!B114","v":""},{"$f":"Param!C114","v":""},{"$f":"Param!K114","v":""},{"$f":"Param!H114","v":""},{"$f":"Param!D114","v":""}]
[{"$f":"Param!B115","v":""},{"$f":"Param!C115","v":""},{"$f":"Param!K115","v":""},{"$f":"Param!H115","v":""},{"$f":"Param!D115","v":""}]
[{"$f":"Param!B116","v":""},{"$f":"Param!C116","v":""},{"$f":"Param!K116","v":""},{"$f":"Param!H116","v":""},{"$f":"Param!D116","v":""}]
[{"$f":"Param!B117","v":""},{"$f":"Param!C117","v":""},{"$f":"Param!K117","v":""},{"$f":"Param!H117","v":""},{"$f":"Param!D117","v":""}]
[{"$f":"Param!B118","v":""},{"$f":"Param!C118","v":""},{"$f":"Param!K118","v":""},{"$f":"Param!H118","v":""},{"$f":"Param!D118","v":""}]
[{"$f":"Param!B119","v":""},{"$f":"Param!C119","v":""},{"$f":"Param!K119","v":""},{"$f":"Param!H119","v":""},{"$f":"Param!D119","v":""}]
[{"$f":"Param!B120","v":""},{"$f":"Param!C120","v":""},{"$f":"Param!K120","v":""},{"$f":"Param!H120","v":""},{"$f":"Param!D120","v":""}]
[{"$f":"Param!B121","v":""},{"$f":"Param!C121","v":""},{"$f":"Param!K121","v":""},{"$f":"Param!H121","v":""},{"$f":"Param!D121","v":""}]
[{"$f":"Param!B122","v":""},{"$f":"Param!C122","v":""},{"$f":"Param!K122","v":""},{"$f":"Param!H122","v":""},{"$f":"Param!D122","v":""}]
[{"$f":"Param!B123","v":""},{"$f":"Param!C123","v":""},{"$f":"Param!K123","v":""},{"$f":"Param!H123","v":""},{"$f":"Param!D123","v":""}]
[{"$f":"Param!B124","v":""},{"$f":"Param!C124","v":""},{"$f":"Param!K124","v":""},{"$f":"Param!H124","v":""},{"$f":"Param!D124","v":""}]
[{"$f":"Param!B125","v":""},{"$f":"Param!C125","v":""},{"$f":"Param!K125","v":""},{"$f":"Param!H125","v":""},{"$f":"Param!D125","v":""}]
[{"$f":"Param!B126","v":""},{"$f":"Param!C126","v":""},{"$f":"Param!K126","v":""},{"$f":"Param!H126","v":""},{"$f":"Param!D126","v":""}]
[{"$f":"Param!B127","v":""},{"$f":"Param!C127","v":""},{"$f":"Param!K127","v":""},{"$f":"Param!H127","v":""},{"$f":"Param!D127","v":""}]
[{"$f":"Param!B128","v":""},{"$f":"Param!C128","v":""},{"$f":"Param!K128","v":""},{"$f":"Param!H128","v":""},{"$f":"Param!D128","v":""}]
[{"$f":"Param!B129","v":""},{"$f":"Param!C129","v":""},{"$f":"Param!K129","v":""},{"$f":"Param!H129","v":""},{"$f":"Param!D129","v":""}]
[{"$f":"Param!B130","v":""},{"$f":"Param!C130","v":""},{"$f":"Param!K130","v":""},{"$f":"Param!H130","v":""},{"$f":"Param!D130","v":""}]
[{"$f":"Param!B131","v":""},{"$f":"Param!C131","v":""},{"$f":"Param!K131","v":""},{"$f":"Param!H131","v":""},{"$f":"Param!D131","v":""}]
[{"$f":"Param!B132","v":""},{"$f":"Param!C132","v":""},{"$f":"Param!K132","v":""},{"$f":"Param!H132","v":""},{"$f":"Param!D132","v":""}]
[{"$f":"Param!B133","v":""},{"$f":"Param!C133","v":""},{"$f":"Param!K133","v":""},{"$f":"Param!H133","v":""},{"$f":"Param!D133","v":""}]
[{"$f":"Param!B134","v":""},{"$f":"Param!C134","v":""},{"$f":"Param!K134","v":""},{"$f":"Param!H134","v":""},{"$f":"Param!D134","v":""}]
[{"$f":"Param!B135","v":""},{"$f":"Param!C135","v":""},{"$f":"Param!K135","v":""},{"$f":"Param!H135","v":""},{"$f":"Param!D135","v":""}]
[{"$f":"Param!B136","v":""},{"$f":"Param!C136","v":""},{"$f":"Param!K136","v":""},{"$f":"Param!H136","v":""},{"$f":"Param!D136","v":""}]
[{"$f":"Param!B137","v":""},{"$f":"Param!C137","v":""},{"$f":"Param!K137","v":""},{"$f":"Param!H137","v":""},{"$f":"Param!D137","v":""}]
[{"$f":"Param!B138","v":""},{"$f":"Param!C138","v":""},{"$f":"Param!K138","v":""},{"$f":"Param!H138","v":""},{"$f":"Param!D138","v":""}]
[{"$f":"Param!B139","v":""},{"$f":"Param!C139","v":""},{"$f":"Param!K139","v":""},{"$f":"Param!H139","v":""},{"$f":"Param!D139","v":""}]
[{"$f":"Param!B140","v":""},{"$f":"Param!C140","v":""},{"$f":"Param!K140","v":""},{"$f":"Param!H140","v":""},{"$f":"Param!D140","v":""}]
[{"$f":"Param!B141","v":""},{"$f":"Param!C141","v":""},{"$f":"Param!K141","v":""},{"$f":"Param!H141","v":""},{"$f":"Param!D141","v":""}]
[{"$f":"Param!B142","v":""},{"$f":"Param!C142","v":""},{"$f":"Param!K142","v":""},{"$f":"Param!H142","v":""},{"$f":"Param!D142","v":""}]
[{"$f":"Param!B143","v":""},{"$f":"Param!C143","v":""},{"$f":"Param!K143","v":""},{"$f":"Param!H143","v":""},{"$f":"Param!D143","v":""}]
[{"$f":"Param!B144","v":""},{"$f":"Param!C144","v":""},{"$f":"Param!K144","v":""},{"$f":"Param!H144","v":""},{"$f":"Param!D144","v":""}]
[{"$f":"Param!B145","v":""},{"$f":"Param!C145","v":""},{"$f":"Param!K145","v":""},{"$f":"Param!H145","v":""},{"$f":"Param!D145","v":""}]
[{"$f":"Param!B146","v":""},{"$f":"Param!C146","v":""},{"$f":"Param!K146","v":""},{"$f":"Param!H146","v":""},{"$f":"Param!D146","v":""}]
[{"$f":"Param!B147","v":""},{"$f":"Param!C147","v":""},{"$f":"Param!K147","v":""},{"$f":"Param!H147","v":""},{"$f":"Param!D147","v":""}]
[{"$f":"Param!B148","v":""},{"$f":"Param!C148","v":""},{"$f":"Param!K148","v":""},{"$f":"Param!H148","v":""},{"$f":"Param!D148","v":""}]
[{"$f":"Param!B149","v":""},{"$f":"Param!C149","v":""},{"$f":"Param!K149","v":""},{"$f":"Param!H149","v":""},{"$f":"Param!D149","v":""}]
[{"$f":"Param!B150","v":""},{"$f":"Param!C150","v":""},{"$f":"Param!K150","v":""},{"$f":"Param!H150","v":""},{"$f":"Param!D150","v":""}]
[{"$f":"Param!B151","v":""},{"$f":"Param!C151","v":""},{"$f":"Param!K151","v":""},{"$f":"Param!H151","v":""},{"$f":"Param!D151","v":""}]
[{"$f":"Param!B152","v":""},{"$f":"Param!C152","v":""},{"$f":"Param!K152","v":""},{"$f":"Param!H152","v":""},{"$f":"Param!D152","v":""}]
[{"$f":"Param!B153","v":""},{"$f":"Param!C153","v":""},{"$f":"Param!K153","v":""},{"$f":"Param!H153","v":""},{"$f":"Param!D153","v":""}]
[{"$f":"Param!B154","v":""},{"$f":"Param!C154","v":""},{"$f":"Param!K154","v":""},{"$f":"Param!H154","v":""},{"$f":"Param!D154","v":""}]
[{"$f":"Param!B155","v":""},{"$f":"Param!C155","v":""},{"$f":"Param!K155","v":""},{"$f":"Param!H155","v":""},{"$f":"Param!D155","v":""}]
[{"$f":"Param!B156","v":""},{"$f":"Param!C156","v":""},{"$f":"Param!K156","v":""},{"$f":"Param!H156","v":""},{"$f":"Param!D156","v":""}]
[{"$f":"Param!B157","v":""},{"$f":"Param!C157","v":""},{"$f":"Param!K157","v":""},{"$f":"Param!H157","v":""},{"$f":"Param!D157","v":""}]
[{"$f":"Param!B158","v":""},{"$f":"Param!C158","v":""},{"$f":"Param!K158","v":""},{"$f":"Param!H158","v":""},{"$f":"Param!D158","v":""}]
[{"$f":"Param!B159","v":""},{"$f":"Param!C159","v":""},{"$f":"Param!K159","v":""},{"$f":"Param!H159","v":""},{"$f":"Param!D159","v":""}]
[{"$f":"Param!B160","v":""},{"$f":"Param!C160","v":""},{"$f":"Param!K160","v":""},{"$f":"Param!H160","v":""},{"$f":"Param!D160","v":""}]
[{"$f":"Param!B161","v":""},{"$f":"Param!C161","v":""},{"$f":"Param!K161","v":""},{"$f":"Param!H161","v":""},{"$f":"Param!D161","v":""}]
[{"$f":"Param!B162","v":""},{"$f":"Param!C162","v":""},{"$f":"Param!K162","v":""},{"$f":"Param!H162","v":""},{"$f":"Param!D162","v":""}]
[{"$f":"Param!B163","v":""},{"$f":"Param!C163","v":""},{"$f":"Param!K163","v":""},{"$f":"Param!H163","v":""},{"$f":"Param!D163","v":""}]
[{"$f":"Param!B164","v":""},{"$f":"Param!C164","v":""},{"$f":"Param!K164","v":""},{"$f":"Param!H164","v":""},{"$f":"Param!D164","v":""}]
[{"$f":"Param!B165","v":""},{"$f":"Param!C165","v":""},{"$f":"Param!K165","v":""},{"$f":"Param!H165","v":""},{"$f":"Param!D165","v":""}]
[{"$f":"Param!B166","v":""},{"$f":"Param!C166","v":""},{"$f":"Param!K166","v":""},{"$f":"Param!H166","v":""},{"$f":"Param!D166","v":""}]
[{"$f":"Param!B167","v":""},{"$f":"Param!C167","v":""},{"$f":"Param!K167","v":""},{"$f":"Param!H167","v":""},{"$f":"Param!D167","v":""}]
[{"$f":"Param!B168","v":""},{"$f":"Param!C168","v":""},{"$f":"Param!K168","v":""},{"$f":"Param!H168","v":""},{"$f":"Param!D168","v":""}]
[{"$f":"Param!B169","v":""},{"$f":"Param!C169","v":""},{"$f":"Param!K169","v":""},{"$f":"Param!H169","v":""},{"$f":"Param!D169","v":""}]
[{"$f":"Param!B170","v":""},{"$f":"Param!C170","v":""},{"$f":"Param!K170","v":""},{"$f":"Param!H170","v":""},{"$f":"Param!D170","v":""}]
[{"$f":"Param!B171","v":""},{"$f":"Param!C171","v":""},{"$f":"Param!K171","v":""},{"$f":"Param!H171","v":""},{"$f":"Param!D171","v":""}]
[{"$f":"Param!B172","v":""},{"$f":"Param!C172","v":""},{"$f":"Param!K172","v":""},{"$f":"Param!H172","v":""},{"$f":"Param!D172","v":""}]
[{"$f":"Param!B173","v":""},{"$f":"Param!C173","v":""},{"$f":"Param!K173","v":""},{"$f":"Param!H173","v":""},{"$f":"Param!D173","v":""}]
[{"$f":"Param!B174","v":""},{"$f":"Param!C174","v":""},{"$f":"Param!K174","v":""},{"$f":"Param!H174","v":""},{"$f":"Param!D174","v":""}]
[{"$f":"Param!B175","v":""},{"$f":"Param!C175","v":""},{"$f":"Param!K175","v":""},{"$f":"Param!H175","v":""},{"$f":"Param!D175","v":""}]
[{"$f":"Param!B176","v":""},{"$f":"Param!C176","v":""},{"$f":"Param!K176","v":""},{"$f":"Param!H176","v":""},{"$f":"Param!D176","v":""}]
[{"$f":"Param!B177","v":""},{"$f":"Param!C177","v":""},{"$f":"Param!K177","v":""},{"$f":"Param!H177","v":""},{"$f":"Param!D177","v":""}]
[{"$f":"Param!B178","v":""},{"$f":"Param!C178","v":""},{"$f":"Param!K178","v":""},{"$f":"Param!H178","v":""},{"$f":"Param!D178","v":""}]
[{"$f":"Param!B179","v":""},{"$f":"Param!C179","v":""},{"$f":"Param!K179","v":""},{"$f":"Param!H179","v":""},{"$f":"Param!D179","v":""}]
[{"$f":"Param!B180","v":""},{"$f":"Param!C180","v":""},{"$f":"Param!K180","v":""},{"$f":"Param!H180","v":""},{"$f":"Param!D180","v":""}]
[{"$f":"Param!B181","v":""},{"$f":"Param!C181","v":""},{"$f":"Param!K181","v":""},{"$f":"Param!H181","v":""},{"$f":"Param!D181","v":""}]
[{"$f":"Param!B182","v":""},{"$f":"Param!C182","v":""},{"$f":"Param!K182","v":""},{"$f":"Param!H182","v":""},{"$f":"Param!D182","v":""}]
[{"$f":"Param!B183","v":""},{"$f":"Param!C183","v":""},{"$f":"Param!K183","v":""},{"$f":"Param!H183","v":""},{"$f":"Param!D183","v":""}]
[{"$f":"Param!B184","v":""},{"$f":"Param!C184","v":""},{"$f":"Param!K184","v":""},{"$f":"Param!H184","v":""},{"$f":"Param!D184","v":""}]
[{"$f":"Param!B185","v":""},{"$f":"Param!C185","v":""},{"$f":"Param!K185","v":""},{"$f":"Param!H185","v":""},{"$f":"Param!D185","v":""}]
[{"$f":"Param!B186","v":""},{"$f":"Param!C186","v":""},{"$f":"Param!K186","v":""},{"$f":"Param!H186","v":""},{"$f":"Param!D186","v":""}]
[{"$f":"Param!B187","v":""},{"$f":"Param!C187","v":""},{"$f":"Param!K187","v":""},{"$f":"Param!H187","v":""},{"$f":"Param!D187","v":""}]
[{"$f":"Param!B188","v":""},{"$f":"Param!C188","v":""},{"$f":"Param!K188","v":""},{"$f":"Param!H188","v":""},{"$f":"Param!D188","v":""}]
[{"$f":"Param!B189","v":""},{"$f":"Param!C189","v":""},{"$f":"Param!K189","v":""},{"$f":"Param!H189","v":""},{"$f":"Param!D189","v":""}]
[{"$f":"Param!B190","v":""},{"$f":"Param!C190","v":""},{"$f":"Param!K190","v":""},{"$f":"Param!H190","v":""},{"$f":"Param!D190","v":""}]
[{"$f":"Param!B191","v":""},{"$f":"Param!C191","v":""},{"$f":"Param!K191","v":""},{"$f":"Param!H191","v":""},{"$f":"Param!D191","v":""}]
[{"$f":"Param!B192","v":""},{"$f":"Param!C192","v":""},{"$f":"Param!K192","v":""},{"$f":"Param!H192","v":""},{"$f":"Param!D192","v":""}]
[{"$f":"Param!B193","v":""},{"$f":"Param!C193","v":""},{"$f":"Param!K193","v":""},{"$f":"Param!H193","v":""},{"$f":"Param!D193","v":""}]
[{"$f":"Param!B194","v":""},{"$f":"Param!C194","v":""},{"$f":"Param!K194","v":""},{"$f":"Param!H194","v":""},{"$f":"Param!D194","v":""}]
[{"$f":"Param!B195","v":""},{"$f":"Param!C195","v":""},{"$f":"Param!K195","v":""},{"$f":"Param!H195","v":""},{"$f":"Param!D195","v":""}]
[{"$f":"Param!B196","v":""},{"$f":"Param!C196","v":""},{"$f":"Param!K196","v":""},{"$f":"Param!H196","v":""},{"$f":"Param!D196","v":""}]
[{"$f":"Param!B197","v":""},{"$f":"Param!C197","v":""},{"$f":"Param!K197","v":""},{"$f":"Param!H197","v":""},{"$f":"Param!D197","v":""}]
[{"$f":"Param!B198","v":""},{"$f":"Param!C198","v":""},{"$f":"Param!K198","v":""},{"$f":"Param!H198","v":""},{"$f":"Param!D198","v":""}]
[{"$f":"Param!B199","v":""},{"$f":"Param!C199","v":""},{"$f":"Param!K199","v":""},{"$f":"Param!H199","v":""},{"$f":"Param!D199","v":""}]
[{"$f":"Param!B200","v":""},{"$f":"Param!C200","v":""},{"$f":"Param!K200","v":""},{"$f":"Param!H200","v":""},{"$f":"Param!D200","v":""}]
[{"$f":"Param!B201","v":""},{"$f":"Param!C201","v":""},{"$f":"Param!K201","v":""},{"$f":"Param!H201","v":""},{"$f":"Param!D201","v":""}]
[{"$f":"Param!B202","v":""},{"$f":"Param!C202","v":""},{"$f":"Param!K202","v":""},{"$f":"Param!H202","v":""},{"$f":"Param!D202","v":""}]
[{"$f":"Param!B203","v":""},{"$f":"Param!C203","v":""},{"$f":"Param!K203","v":""},{"$f":"Param!H203","v":""},{"$f":"Param!D203","v":""}]
[{"$f":"Param!B204","v":""},{"$f":"Param!C204","v":""},{"$f":"Param!K204","v":""},{"$f":"Param!H204","v":""},{"$f":"Param!D204","v":""}]
[{"$f":"Param!B205","v":""},{"$f":"Param!C205","v":""},{"$f":"Param!K205","v":""},{"$f":"Param!H205","v":""},{"$f":"Param!D205","v":""}]
[{"$f":"Param!B206","v":""},{"$f":"Param!C206","v":""},{"$f":"Param!K206","v":""},{"$f":"Param!H206","v":""},{"$f":"Param!D206","v":""}]
[{"$f":"Param!B207","v":""},{"$f":"Param!C207","v":""},{"$f":"Param!K207","v":""},{"$f":"Param!H207","v":""},{"$f":"Param!D207","v":""}]
[{"$f":"Param!B208","v":""},{"$f":"Param!C208","v":""},{"$f":"Param!K208","v":""},{"$f":"Param!H208","v":""},{"$f":"Param!D208","v":""}]
[{"$f":"Param!B209","v":""},{"$f":"Param!C209","v":""},{"$f":"Param!K209","v":""},{"$f":"Param!H209","v":""},{"$f":"Param!D209","v":""}]
[{"$f":"Param!B210","v":""},{"$f":"Param!C210","v":""},{"$f":"Param!K210","v":""},{"$f":"Param!H210","v":""},{"$f":"Param!D210","v":""}]
[{"$f":"Param!B211","v":""},{"$f":"Param!C211","v":""},{"$f":"Param!K211","v":""},{"$f":"Param!H211","v":""},{"$f":"Param!D211","v":""}]
[{"$f":"Param!B212","v":""},{"$f":"Param!C212","v":""},{"$f":"Param!K212","v":""},{"$f":"Param!H212","v":""},{"$f":"Param!D212","v":""}]
[{"$f":"Param!B213","v":""},{"$f":"Param!C213","v":""},{"$f":"Param!K213","v":""},{"$f":"Param!H213","v":""},{"$f":"Param!D213","v":""}]
[{"$f":"Param!B214","v":""},{"$f":"Param!C214","v":""},{"$f":"Param!K214","v":""},{"$f":"Param!H214","v":""},{"$f":"Param!D214","v":""}]
[{"$f":"Param!B215","v":""},{"$f":"Param!C215","v":""},{"$f":"Param!K215","v":""},{"$f":"Param!H215","v":""},{"$f":"Param!D215","v":""}]
[{"$f":"Param!B216","v":""},{"$f":"Param!C216","v":""},{"$f":"Param!K216","v":""},{"$f":"Param!H216","v":""},{"$f":"Param!D216","v":""}]
[{"$f":"Param!B217","v":""},{"$f":"Param!C217","v":""},{"$f":"Param!K217","v":""},{"$f":"Param!H217","v":""},{"$f":"Param!D217","v":""}]
[{"$f":"Param!B218","v":""},{"$f":"Param!C218","v":""},{"$f":"Param!K218","v":""},{"$f":"Param!H218","v":""},{"$f":"Param!D218","v":""}]
[{"$f":"Param!B219","v":""},{"$f":"Param!C219","v":""},{"$f":"Param!K219","v":""},{"$f":"Param!H219","v":""},{"$f":"Param!D219","v":""}]
[{"$f":"Param!B220","v":""},{"$f":"Param!C220","v":""},{"$f":"Param!K220","v":""},{"$f":"Param!H220","v":""},{"$f":"Param!D220","v":""}]
[{"$f":"Param!B221","v":""},{"$f":"Param!C221","v":""},{"$f":"Param!K221","v":""},{"$f":"Param!H221","v":""},{"$f":"Param!D221","v":""}]
[{"$f":"Param!B222","v":""},{"$f":"Param!C222","v":""},{"$f":"Param!K222","v":""},{"$f":"Param!H222","v":""},{"$f":"Param!D222","v":""}]
[{"$f":"Param!B223","v":""},{"$f":"Param!C223","v":""},{"$f":"Param!K223","v":""},{"$f":"Param!H223","v":""},{"$f":"Param!D223","v":""}]
[{"$f":"Param!B224","v":""},{"$f":"Param!C224","v":""},{"$f":"Param!K224","v":""},{"$f":"Param!H224","v":""},{"$f":"Param!D224","v":""}]
[{"$f":"Param!B225","v":""},{"$f":"Param!C225","v":""},{"$f":"Param!K225","v":""},{"$f":"Param!H225","v":""},{"$f":"Param!D225","v":""}]
[{"$f":"Param!B226","v":""},{"$f":"Param!C226","v":""},{"$f":"Param!K226","v":""},{"$f":"Param!H226","v":""},{"$f":"Param!D226","v":""}]
[{"$f":"Param!B227","v":""},{"$f":"Param!C227","v":""},{"$f":"Param!K227","v":""},{"$f":"Param!H227","v":""},{"$f":"Param!D227","v":""}]
[{"$f":"Param!B228","v":""},{"$f":"Param!C228","v":""},{"$f":"Param!K228","v":""},{"$f":"Param!H228","v":""},{"$f":"Param!D228","v":""}]
[{"$f":"Param!B229","v":""},{"$f":"Param!C229","v":""},{"$f":"Param!K229","v":""},{"$f":"Param!H229","v":""},{"$f":"Param!D229","v":""}]
[{"$f":"Param!B230","v":""},{"$f":"Param!C230","v":""},{"$f":"Param!K230","v":""},{"$f":"Param!H230","v":""},{"$f":"Param!D230","v":""}]
[{"$f":"Param!B231","v":""},{"$f":"Param!C231","v":""},{"$f":"Param!K231","v":""},{"$f":"Param!H231","v":""},{"$f":"Param!D231","v":""}]
[{"$f":"Param!B232","v":""},{"$f":"Param!C232","v":""},{"$f":"Param!K232","v":""},{"$f":"Param!H232","v":""},{"$f":"Param!D232","v":""}]
[{"$f":"Param!B233","v":""},{"$f":"Param!C233","v":""},{"$f":"Param!K233","v":""},{"$f":"Param!H233","v":""},{"$f":"Param!D233","v":""}]
[{"$f":"Param!B234","v":""},{"$f":"Param!C234","v":""},{"$f":"Param!K234","v":""},{"$f":"Param!H234","v":""},{"$f":"Param!D234","v":""}]
[{"$f":"Param!B235","v":""},{"$f":"Param!C235","v":""},{"$f":"Param!K235","v":""},{"$f":"Param!H235","v":""},{"$f":"Param!D235","v":""}]
[{"$f":"Param!B236","v":""},{"$f":"Param!C236","v":""},{"$f":"Param!K236","v":""},{"$f":"Param!H236","v":""},{"$f":"Param!D236","v":""}]
[{"$f":"Param!B237","v":""},{"$f":"Param!C237","v":""},{"$f":"Param!K237","v":""},{"$f":"Param!H237","v":""},{"$f":"Param!D237","v":""}]
[{"$f":"Param!B238","v":""},{"$f":"Param!C238","v":""},{"$f":"Param!K238","v":""},{"$f":"Param!H238","v":""},{"$f":"Param!D238","v":""}]
[{"$f":"Param!B239","v":""},{"$f":"Param!C239","v":""},{"$f":"Param!K239","v":""},{"$f":"Param!H239","v":""},{"$f":"Param!D239","v":""}]
[{"$f":"Param!B240","v":""},{"$f":"Param!C240","v":""},{"$f":"Param!K240","v":""},{"$f":"Param!H240","v":""},{"$f":"Param!D240","v":""}]
[{"$f":"Param!B241","v":""},{"$f":"Param!C241","v":""},{"$f":"Param!K241","v":""},{"$f":"Param!H241","v":""},{"$f":"Param!D241","v":""}]
[{"$f":"Param!B242","v":""},{"$f":"Param!C242","v":""},{"$f":"Param!K242","v":""},{"$f":"Param!H242","v":""},{"$f":"Param!D242","v":""}]
[{"$f":"Param!B243","v":""},{"$f":"Param!C243","v":""},{"$f":"Param!K243","v":""},{"$f":"Param!H243","v":""},{"$f":"Param!D243","v":""}]
[{"$f":"Param!B244","v":""},{"$f":"Param!C244","v":""},{"$f":"Param!K244","v":""},{"$f":"Param!H244","v":""},{"$f":"Param!D244","v":""}]
[{"$f":"Param!B245","v":""},{"$f":"Param!C245","v":""},{"$f":"Param!K245","v":""},{"$f":"Param!H245","v":""},{"$f":"Param!D245","v":""}]
[{"$f":"Param!B246","v":""},{"$f":"Param!C246","v":""},{"$f":"Param!K246","v":""},{"$f":"Param!H246","v":""},{"$f":"Param!D246","v":""}]
[{"$f":"Param!B247","v":""},{"$f":"Param!C247","v":""},{"$f":"Param!K247","v":""},{"$f":"Param!H247","v":""},{"$f":"Param!D247","v":""}]
[{"$f":"Param!B248","v":""},{"$f":"Param!C248","v":""},{"$f":"Param!K248","v":""},{"$f":"Param!H248","v":""},{"$f":"Param!D248","v":""}]
[{"$f":"Param!B249","v":""},{"$f":"Param!C249","v":""},{"$f":"Param!K249","v":""},{"$f":"Param!H249","v":""},{"$f":"Param!D249","v":""}]
[{"$f":"Param!B250","v":""},{"$f":"Param!C250","v":""},{"$f":"Param!K250","v":""},{"$f":"Param!H250","v":""},{"$f":"Param!D250","v":""}]
[{"$f":"Param!B251","v":""},{"$f":"Param!C251","v":""},{"$f":"Param!K251","v":""},{"$f":"Param!H251","v":""},{"$f":"Param!D251","v":""}]
[{"$f":"Param!B252","v":""},{"$f":"Param!C252","v":""},{"$f":"Param!K252","v":""},{"$f":"Param!H252","v":""},{"$f":"Param!D252","v":""}]
[{"$f":"Param!B253","v":""},{"$f":"Param!C253","v":""},{"$f":"Param!K253","v":""},{"$f":"Param!H253","v":""},{"$f":"Param!D253","v":""}]
[{"$f":"Param!B254","v":""},{"$f":"Param!C254","v":""},{"$f":"Param!K254","v":""},{"$f":"Param!H254","v":""},{"$f":"Param!D254","v":""}]
[{"$f":"Param!B255","v":""},{"$f":"Param!C255","v":""},{"$f":"Param!K255","v":""},{"$f":"Param!H255","v":""},{"$f":"Param!D255","v":""}]
[{"$f":"Param!B256","v":""},{"$f":"Param!C256","v":""},{"$f":"Param!K256","v":""},{"$f":"Param!H256","v":""},{"$f":"Param!D256","v":""}]
[{"$f":"Param!B257","v":""},{"$f":"Param!C257","v":""},{"$f":"Param!K257","v":""},{"$f":"Param!H257","v":""},{"$f":"Param!D257","v":""}]
[{"$f":"Param!B258","v":""},{"$f":"Param!C258","v":""},{"$f":"Param!K258","v":""},{"$f":"Param!H258","v":""},{"$f":"Param!D258","v":""}]
[{"$f":"Param!B259","v":""},{"$f":"Param!C259","v":""},{"$f":"Param!K259","v":""},{"$f":"Param!H259","v":""},{"$f":"Param!D259","v":""}]
[{"$f":"Param!B260","v":""},{"$f":"Param!C260","v":""},{"$f":"Param!K260","v":""},{"$f":"Param!H260","v":""},{"$f":"Param!D260","v":""}]
[{"$f":"Param!B261","v":""},{"$f":"Param!C261","v":""},{"$f":"Param!K261","v":""},{"$f":"Param!H261","v":""},{"$f":"Param!D261","v":""}]
[{"$f":"Param!B262","v":""},{"$f":"Param!C262","v":""},{"$f":"Param!K262","v":""},{"$f":"Param!H262","v":""},{"$f":"Param!D262","v":""}]
[{"$f":"Param!B263","v":""},{"$f":"Param!C263","v":""},{"$f":"Param!K263","v":""},{"$f":"Param!H263","v":""},{"$f":"Param!D263","v":""}]
[{"$f":"Param!B264","v":""},{"$f":"Param!C264","v":""},{"$f":"Param!K264","v":""},{"$f":"Param!H264","v":""},{"$f":"Param!D264","v":""}]
[{"$f":"Param!B265","v":""},{"$f":"Param!C265","v":""},{"$f":"Param!K265","v":""},{"$f":"Param!H265","v":""},{"$f":"Param!D265","v":""}]
[{"$f":"Param!B266","v":""},{"$f":"Param!C266","v":""},{"$f":"Param!K266","v":""},{"$f":"Param!H266","v":""},{"$f":"Param!D266","v":""}]
[{"$f":"Param!B267","v":""},{"$f":"Param!C267","v":""},{"$f":"Param!K267","v":""},{"$f":"Param!H267","v":""},{"$f":"Param!D267","v":""}]
[{"$f":"Param!B268","v":""},{"$f":"Param!C268","v":""},{"$f":"Param!K268","v":""},{"$f":"Param!H268","v":""},{"$f":"Param!D268","v":""}]
[{"$f":"Param!B269","v":""},{"$f":"Param!C269","v":""},{"$f":"Param!K269","v":""},{"$f":"Param!H269","v":""},{"$f":"Param!D269","v":""}]
[{"$f":"Param!B270","v":""},{"$f":"Param!C270","v":""},{"$f":"Param!K270","v":""},{"$f":"Param!H270","v":""},{"$f":"Param!D270","v":""}]
[{"$f":"Param!B271","v":""},{"$f":"Param!C271","v":""},{"$f":"Param!K271","v":""},{"$f":"Param!H271","v":""},{"$f":"Param!D271","v":""}]
[{"$f":"Param!B272","v":""},{"$f":"Param!C272","v":""},{"$f":"Param!K272","v":""},{"$f":"Param!H272","v":""},{"$f":"Param!D272","v":""}]
[{"$f":"Param!B273","v":""},{"$f":"Param!C273","v":""},{"$f":"Param!K273","v":""},{"$f":"Param!H273","v":""},{"$f":"Param!D273","v":""}]
[{"$f":"Param!B274","v":""},{"$f":"Param!C274","v":""},{"$f":"Param!K274","v":""},{"$f":"Param!H274","v":""},{"$f":"Param!D274","v":""}]
[{"$f":"Param!B275","v":""},{"$f":"Param!C275","v":""},{"$f":"Param!K275","v":""},{"$f":"Param!H275","v":""},{"$f":"Param!D275","v":""}]
[{"$f":"Param!B276","v":""},{"$f":"Param!C276","v":""},{"$f":"Param!K276","v":""},{"$f":"Param!H276","v":""},{"$f":"Param!D276","v":""}]
[{"$f":"Param!B277","v":""},{"$f":"Param!C277","v":""},{"$f":"Param!K277","v":""},{"$f":"Param!H277","v":""},{"$f":"Param!D277","v":""}]
[{"$f":"Param!B278","v":""},{"$f":"Param!C278","v":""},{"$f":"Param!K278","v":""},{"$f":"Param!H278","v":""},{"$f":"Param!D278","v":""}]
[{"$f":"Param!B279","v":""},{"$f":"Param!C279","v":""},{"$f":"Param!K279","v":""},{"$f":"Param!H279","v":""},{"$f":"Param!D279","v":""}]
[{"$f":"Param!B280","v":""},{"$f":"Param!C280","v":""},{"$f":"Param!K280","v":""},{"$f":"Param!H280","v":""},{"$f":"Param!D280","v":""}]
[{"$f":"Param!B281","v":""},{"$f":"Param!C281","v":""},{"$f":"Param!K281","v":""},{"$f":"Param!H281","v":""},{"$f":"Param!D281","v":""}]
[{"$f":"Param!B282","v":""},{"$f":"Param!C282","v":""},{"$f":"Param!K282","v":""},{"$f":"Param!H282","v":""},{"$f":"Param!D282","v":""}]
[{"$f":"Param!B283","v":""},{"$f":"Param!C283","v":""},{"$f":"Param!K283","v":""},{"$f":"Param!H283","v":""},{"$f":"Param!D283","v":""}]
[{"$f":"Param!B284","v":""},{"$f":"Param!C284","v":""},{"$f":"Param!K284","v":""},{"$f":"Param!H284","v":""},{"$f":"Param!D284","v":""}]
[{"$f":"Param!B285","v":""},{"$f":"Param!C285","v":""},{"$f":"Param!K285","v":""},{"$f":"Param!H285","v":""},{"$f":"Param!D285","v":""}]
[{"$f":"Param!B286","v":""},{"$f":"Param!C286","v":""},{"$f":"Param!K286","v":""},{"$f":"Param!H286","v":""},{"$f":"Param!D286","v":""}]
[{"$f":"Param!B287","v":""},{"$f":"Param!C287","v":""},{"$f":"Param!K287","v":""},{"$f":"Param!H287","v":""},{"$f":"Param!D287","v":""}]
[{"$f":"Param!B288","v":""},{"$f":"Param!C288","v":""},{"$f":"Param!K288","v":""},{"$f":"Param!H288","v":""},{"$f":"Param!D288","v":""}]
[{"$f":"Param!B289","v":""},{"$f":"Param!C289","v":""},{"$f":"Param!K289","v":""},{"$f":"Param!H289","v":""},{"$f":"Param!D289","v":""}]
[{"$f":"Param!B290","v":""},{"$f":"Param!C290","v":""},{"$f":"Param!K290","v":""},{"$f":"Param!H290","v":""},{"$f":"Param!D290","v":""}]
[{"$f":"Param!B291","v":""},{"$f":"Param!C291","v":""},{"$f":"Param!K291","v":""},{"$f":"Param!H291","v":""},{"$f":"Param!D291","v":""}]
[{"$f":"Param!B292","v":""},{"$f":"Param!C292","v":""},{"$f":"Param!K292","v":""},{"$f":"Param!H292","v":""},{"$f":"Param!D292","v":""}]
[{"$f":"Param!B293","v":""},{"$f":"Param!C293","v":""},{"$f":"Param!K293","v":""},{"$f":"Param!H293","v":""},{"$f":"Param!D293","v":""}]
[{"$f":"Param!B294","v":""},{"$f":"Param!C294","v":""},{"$f":"Param!K294","v":""},{"$f":"Param!H294","v":""},{"$f":"Param!D294","v":""}]
[{"$f":"Param!B295","v":""},{"$f":"Param!C295","v":""},{"$f":"Param!K295","v":""},{"$f":"Param!H295","v":""},{"$f":"Param!D295","v":""}]
[{"$f":"Param!B296","v":""},{"$f":"Param!C296","v":""},{"$f":"Param!K296","v":""},{"$f":"Param!H296","v":""},{"$f":"Param!D296","v":""}]
[{"$f":"Param!B297","v":""},{"$f":"Param!C297","v":""},{"$f":"Param!K297","v":""},{"$f":"Param!H297","v":""},{"$f":"Param!D297","v":""}]
[{"$f":"Param!B298","v":""},{"$f":"Param!C298","v":""},{"$f":"Param!K298","v":""},{"$f":"Param!H298","v":""},{"$f":"Param!D298","v":""}]
[{"$f":"Param!B299","v":""},{"$f":"Param!C299","v":""},{"$f":"Param!K299","v":""},{"$f":"Param!H299","v":""},{"$f":"Param!D299","v":""}]
[{"$f":"Param!B300","v":""},{"$f":"Param!C300","v":""},{"$f":"Param!K300","v":""},{"$f":"Param!H300","v":""},{"$f":"Param!D300","v":""}]
[{"$f":"Param!B301","v":""},{"$f":"Param!C301","v":""},{"$f":"Param!K301","v":""},{"$f":"Param!H301","v":""},{"$f":"Param!D301","v":""}]
[{"$f":"Param!B302","v":""},{"$f":"Param!C302","v":""},{"$f":"Param!K302","v":""},{"$f":"Param!H302","v":""},{"$f":"Param!D302","v":""}]
[{"$f":"Param!B303","v":""},{"$f":"Param!C303","v":""},{"$f":"Param!K303","v":""},{"$f":"Param!H303","v":""},{"$f":"Param!D303","v":""}]
[{"$f":"Param!B304","v":""},{"$f":"Param!C304","v":""},{"$f":"Param!K304","v":""},{"$f":"Param!H304","v":""},{"$f":"Param!D304","v":""}]
[{"$f":"Param!B305","v":""},{"$f":"Param!C305","v":""},{"$f":"Param!K305","v":""},{"$f":"Param!H305","v":""},{"$f":"Param!D305","v":""}]
[{"$f":"Param!B306","v":""},{"$f":"Param!C306","v":""},{"$f":"Param!K306","v":""},{"$f":"Param!H306","v":""},{"$f":"Param!D306","v":""}]
[{"$f":"Param!B307","v":""},{"$f":"Param!C307","v":""},{"$f":"Param!K307","v":""},{"$f":"Param!H307","v":""},{"$f":"Param!D307","v":""}]
[{"$f":"Param!B308","v":""},{"$f":"Param!C308","v":""},{"$f":"Param!K308","v":""},{"$f":"Param!H308","v":""},{"$f":"Param!D308","v":""}]
[{"$f":"Param!B309","v":""},{"$f":"Param!C309","v":""},{"$f":"Param!K309","v":""},{"$f":"Param!H309","v":""},{"$f":"Param!D309","v":""}]
[{"$f":"Param!B310","v":""},{"$f":"Param!C310","v":""},{"$f":"Param!K310","v":""},{"$f":"Param!H310","v":""},{"$f":"Param!D310","v":""}]
[{"$f":"Param!B311","v":""},{"$f":"Param!C311","v":""},{"$f":"Param!K311","v":""},{"$f":"Param!H311","v":""},{"$f":"Param!D311","v":""}]
[{"$f":"Param!B312","v":""},{"$f":"Param!C312","v":""},{"$f":"Param!K312","v":""},{"$f":"Param!H312","v":""},{"$f":"Param!D312","v":""}]
[{"$f":"Param!B313","v":""},{"$f":"Param!C313","v":""},{"$f":"Param!K313","v":""},{"$f":"Param!H313","v":""},{"$f":"Param!D313","v":""}]
[{"$f":"Param!B314","v":""},{"$f":"Param!C314","v":""},{"$f":"Param!K314","v":""},{"$f":"Param!H314","v":""},{"$f":"Param!D314","v":""}]
[{"$f":"Param!B315","v":""},{"$f":"Param!C315","v":""},{"$f":"Param!K315","v":""},{"$f":"Param!H315","v":""},{"$f":"Param!D315","v":""}]
[{"$f":"Param!B316","v":""},{"$f":"Param!C316","v":""},{"$f":"Param!K316","v":""},{"$f":"Param!H316","v":""},{"$f":"Param!D316","v":""}]
[{"$f":"Param!B317","v":""},{"$f":"Param!C317","v":""},{"$f":"Param!K317","v":""},{"$f":"Param!H317","v":""},{"$f":"Param!D317","v":""}]
[{"$f":"Param!B318","v":""},{"$f":"Param!C318","v":""},{"$f":"Param!K318","v":""},{"$f":"Param!H318","v":""},{"$f":"Param!D318","v":""}]
[{"$f":"Param!B319","v":""},{"$f":"Param!C319","v":""},{"$f":"Param!K319","v":""},{"$f":"Param!H319","v":""},{"$f":"Param!D319","v":""}]
[{"$f":"Param!B320","v":""},{"$f":"Param!C320","v":""},{"$f":"Param!K320","v":""},{"$f":"Param!H320","v":""},{"$f":"Param!D320","v":""}]
[{"$f":"Param!B321","v":""},{"$f":"Param!C321","v":""},{"$f":"Param!K321","v":""},{"$f":"Param!H321","v":""},{"$f":"Param!D321","v":""}]
[{"$f":"Param!B322","v":""},{"$f":"Param!C322","v":""},{"$f":"Param!K322","v":""},{"$f":"Param!H322","v":""},{"$f":"Param!D322","v":""}]
[{"$f":"Param!B323","v":""},{"$f":"Param!C323","v":""},{"$f":"Param!K323","v":""},{"$f":"Param!H323","v":""},{"$f":"Param!D323","v":""}]
[{"$f":"Param!B324","v":""},{"$f":"Param!C324","v":""},{"$f":"Param!K324","v":""},{"$f":"Param!H324","v":""},{"$f":"Param!D324","v":""}]
[{"$f":"Param!B325","v":""},{"$f":"Param!C325","v":""},{"$f":"Param!K325","v":""},{"$f":"Param!H325","v":""},{"$f":"Param!D325","v":""}]
[{"$f":"Param!B326","v":""},{"$f":"Param!C326","v":""},{"$f":"Param!K326","v":""},{"$f":"Param!H326","v":""},{"$f":"Param!D326","v":""}]
[{"$f":"Param!B327","v":""},{"$f":"Param!C327","v":""},{"$f":"Param!K327","v":""},{"$f":"Param!H327","v":""},{"$f":"Param!D327","v":""}]
[{"$f":"Param!B328","v":""},{"$f":"Param!C328","v":""},{"$f":"Param!K328","v":""},{"$f":"Param!H328","v":""},{"$f":"Param!D328","v":""}]
[{"$f":"Param!B329","v":""},{"$f":"Param!C329","v":""},{"$f":"Param!K329","v":""},{"$f":"Param!H329","v":""},{"$f":"Param!D329","v":""}]
[{"$f":"Param!B330","v":""},{"$f":"Param!C330","v":""},{"$f":"Param!K330","v":""},{"$f":"Param!H330","v":""},{"$f":"Param!D330","v":""}]
[{"$f":"Param!B331","v":""},{"$f":"Param!C331","v":""},{"$f":"Param!K331","v":""},{"$f":"Param!H331","v":""},{"$f":"Param!D331","v":""}]
[{"$f":"Param!B332","v":""},{"$f":"Param!C332","v":""},{"$f":"Param!K332","v":""},{"$f":"Param!H332","v":""},{"$f":"Param!D332","v":""}]
[{"$f":"Param!B333","v":""},{"$f":"Param!C333","v":""},{"$f":"Param!K333","v":""},{"$f":"Param!H333","v":""},{"$f":"Param!D333","v":""}]
[{"$f":"Param!B334","v":""},{"$f":"Param!C334","v":""},{"$f":"Param!K334","v":""},{"$f":"Param!H334","v":""},{"$f":"Param!D334","v":""}]
[{"$f":"Param!B335","v":""},{"$f":"Param!C335","v":""},{"$f":"Param!K335","v":""},{"$f":"Param!H335","v":""},{"$f":"Param!D335","v":""}]
[{"$f":"Param!B336","v":""},{"$f":"Param!C336","v":""},{"$f":"Param!K336","v":""},{"$f":"Param!H336","v":""},{"$f":"Param!D336","v":""}]
[{"$f":"Param!B337","v":""},{"$f":"Param!C337","v":""},{"$f":"Param!K337","v":""},{"$f":"Param!H337","v":""},{"$f":"Param!D337","v":""}]
[{"$f":"Param!B338","v":""},{"$f":"Param!C338","v":""},{"$f":"Param!K338","v":""},{"$f":"Param!H338","v":""},{"$f":"Param!D338","v":""}]
[{"$f":"Param!B339","v":""},{"$f":"Param!C339","v":""},{"$f":"Param!K339","v":""},{"$f":"Param!H339","v":""},{"$f":"Param!D339","v":""}]
[{"$f":"Param!B340","v":""},{"$f":"Param!C340","v":""},{"$f":"Param!K340","v":""},{"$f":"Param!H340","v":""},{"$f":"Param!D340","v":""}]
[{"$f":"Param!B341","v":""},{"$f":"Param!C341","v":""},{"$f":"Param!K341","v":""},{"$f":"Param!H341","v":""},{"$f":"Param!D341","v":""}]
[{"$f":"Param!B342","v":""},{"$f":"Param!C342","v":""},{"$f":"Param!K342","v":""},{"$f":"Param!H342","v":""},{"$f":"Param!D342","v":""}]
[{"$f":"Param!B343","v":""},{"$f":"Param!C343","v":""},{"$f":"Param!K343","v":""},{"$f":"Param!H343","v":""},{"$f":"Param!D343","v":""}]
[{"$f":"Param!B344","v":""},{"$f":"Param!C344","v":""},{"$f":"Param!K344","v":""},{"$f":"Param!H344","v":""},{"$f":"Param!D344","v":""}]
[{"$f":"Param!B345","v":""},{"$f":"Param!C345","v":""},{"$f":"Param!K345","v":""},{"$f":"Param!H345","v":""},{"$f":"Param!D345","v":""}]
[{"$f":"Param!B346","v":""},{"$f":"Param!C346","v":""},{"$f":"Param!K346","v":""},{"$f":"Param!H346","v":""},{"$f":"Param!D346","v":""}]
[{"$f":"Param!B347","v":""},{"$f":"Param!C347","v":""},{"$f":"Param!K347","v":""},{"$f":"Param!H347","v":""},{"$f":"Param!D347","v":""}]
[{"$f":"Param!B348","v":""},{"$f":"Param!C348","v":""},{"$f":"Param!K348","v":""},{"$f":"Param!H348","v":""},{"$f":"Param!D348","v":""}]
[{"$f":"Param!B349","v":""},{"$f":"Param!C349","v":""},{"$f":"Param!K349","v":""},{"$f":"Param!H349","v":""},{"$f":"Param!D349","v":""}]
[{"$f":"Param!B350","v":""},{"$f":"Param!C350","v":""},{"$f":"Param!K350","v":""},{"$f":"Param!H350","v":""},{"$f":"Param!D350","v":""}]
[{"$f":"Param!B351","v":""},{"$f":"Param!C351","v":""},{"$f":"Param!K351","v":""},{"$f":"Param!H351","v":""},{"$f":"Param!D351","v":""}]
[{"$f":"Param!B352","v":""},{"$f":"Param!C352","v":""},{"$f":"Param!K352","v":""},{"$f":"Param!H352","v":""},{"$f":"Param!D352","v":""}]
[{"$f":"Param!B353","v":""},{"$f":"Param!C353","v":""},{"$f":"Param!K353","v":""},{"$f":"Param!H353","v":""},{"$f":"Param!D353","v":""}]
[{"$f":"Param!B354","v":""},{"$f":"Param!C354","v":""},{"$f":"Param!K354","v":""},{"$f":"Param!H354","v":""},{"$f":"Param!D354","v":""}]
[{"$f":"Param!B355","v":""},{"$f":"Param!C355","v":""},{"$f":"Param!K355","v":""},{"$f":"Param!H355","v":""},{"$f":"Param!D355","v":""}]
[{"$f":"Param!B356","v":""},{"$f":"Param!C356","v":""},{"$f":"Param!K356","v":""},{"$f":"Param!H356","v":""},{"$f":"Param!D356","v":""}]
[{"$f":"Param!B357","v":""},{"$f":"Param!C357","v":""},{"$f":"Param!K357","v":""},{"$f":"Param!H357","v":""},{"$f":"Param!D357","v":""}]
[{"$f":"Param!B358","v":""},{"$f":"Param!C358","v":""},{"$f":"Param!K358","v":""},{"$f":"Param!H358","v":""},{"$f":"Param!D358","v":""}]
[{"$f":"Param!B359","v":""},{"$f":"Param!C359","v":""},{"$f":"Param!K359","v":""},{"$f":"Param!H359","v":""},{"$f":"Param!D359","v":""}]
[{"$f":"Param!B360","v":""},{"$f":"Param!C360","v":""},{"$f":"Param!K360","v":""},{"$f":"Param!H360","v":""},{"$f":"Param!D360","v":""}]
[{"$f":"Param!B361","v":""},{"$f":"Param!C361","v":""},{"$f":"Param!K361","v":""},{"$f":"Param!H361","v":""},{"$f":"Param!D361","v":""}]
[{"$f":"Param!B362","v":""},{"$f":"Param!C362","v":""},{"$f":"Param!K362","v":""},{"$f":"Param!H362","v":""},{"$f":"Param!D362","v":""}]
[{"$f":"Param!B363","v":""},{"$f":"Param!C363","v":""},{"$f":"Param!K363","v":""},{"$f":"Param!H363","v":""},{"$f":"Param!D363","v":""}]
[{"$f":"Param!B364","v":""},{"$f":"Param!C364","v":""},{"$f":"Param!K364","v":""},{"$f":"Param!H364","v":""},{"$f":"Param!D364","v":""}]
[{"$f":"Param!B365","v":""},{"$f":"Param!C365","v":""},{"$f":"Param!K365","v":""},{"$f":"Param!H365","v":""},{"$f":"Param!D365","v":""}]
[{"$f":"Param!B366","v":""},{"$f":"Param!C366","v":""},{"$f":"Param!K366","v":""},{"$f":"Param!H366","v":""},{"$f":"Param!D366","v":""}]
[{"$f":"Param!B367","v":""},{"$f":"Param!C367","v":""},{"$f":"Param!K367","v":""},{"$f":"Param!H367","v":""},{"$f":"Param!D367","v":""}]
[{"$f":"Param!B368","v":""},{"$f":"Param!C368","v":""},{"$f":"Param!K368","v":""},{"$f":"Param!H368","v":""},{"$f":"Param!D368","v":""}]
[{"$f":"Param!B369","v":""},{"$f":"Param!C369","v":""},{"$f":"Param!K369","v":""},{"$f":"Param!H369","v":""},{"$f":"Param!D369","v":""}]
[{"$f":"Param!B370","v":""},{"$f":"Param!C370","v":""},{"$f":"Param!K370","v":""},{"$f":"Param!H370","v":""},{"$f":"Param!D370","v":""}]
[{"$f":"Param!B371","v":""},{"$f":"Param!C371","v":""},{"$f":"Param!K371","v":""},{"$f":"Param!H371","v":""},{"$f":"Param!D371","v":""}]
[{"$f":"Param!B372","v":""},{"$f":"Param!C372","v":""},{"$f":"Param!K372","v":""},{"$f":"Param!H372","v":""},{"$f":"Param!D372","v":""}]
[{"$f":"Param!B373","v":""},{"$f":"Param!C373","v":""},{"$f":"Param!K373","v":""},{"$f":"Param!H373","v":""},{"$f":"Param!D373","v":""}]
[{"$f":"Param!B374","v":""},{"$f":"Param!C374","v":""},{"$f":"Param!K374","v":""},{"$f":"Param!H374","v":""},{"$f":"Param!D374","v":""}]
[{"$f":"Param!B375","v":""},{"$f":"Param!C375","v":""},{"$f":"Param!K375","v":""},{"$f":"Param!H375","v":""},{"$f":"Param!D375","v":""}]
[{"$f":"Param!B376","v":""},{"$f":"Param!C376","v":""},{"$f":"Param!K376","v":""},{"$f":"Param!H376","v":""},{"$f":"Param!D376","v":""}]
[{"$f":"Param!B377","v":""},{"$f":"Param!C377","v":""},{"$f":"Param!K377","v":""},{"$f":"Param!H377","v":""},{"$f":"Param!D377","v":""}]
[{"$f":"Param!B378","v":""},{"$f":"Param!C378","v":""},{"$f":"Param!K378","v":""},{"$f":"Param!H378","v":""},{"$f":"Param!D378","v":""}]
[{"$f":"Param!B379","v":""},{"$f":"Param!C379","v":""},{"$f":"Param!K379","v":""},{"$f":"Param!H379","v":""},{"$f":"Param!D379","v":""}]
[{"$f":"Param!B380","v":""},{"$f":"Param!C380","v":""},{"$f":"Param!K380","v":""},{"$f":"Param!H380","v":""},{"$f":"Param!D380","v":""}]