{"text_format":"3","workbook":"xlsx","n_sheets":13,"sheets":["Setup","1-Reception & Dedouanement","2-Stockage & Gestion","3-Distribution","4-Rapportage & SIGL","5-Controle qualite & Paiement","6-Normes stockage","Calc","Orientations","Dashboard","Questionnaire","Feuil1","Plan_Actions"],"not_rendered":{"charts":2,"images":1,"macros":1,"external_links":15,"defined_names":287},"read":"whole","date_system":"1900"}

{"sheet":"Setup","index":0,"n_rows":186,"n_cols":35,"rows_kept":186,"merged":[[0,5,1,20],[1,31,1,35],[2,31,2,35],[4,31,4,36],[10,11,11,14],[12,10,12,12],[17,6,17,7],[17,31,17,35],[19,7,19,10],[20,7,20,10],[21,7,21,10],[21,31,21,35],[25,5,25,10],[25,11,25,13],[26,5,26,10],[26,11,26,13],[27,5,27,10],[27,11,27,13],[28,5,28,10],[28,11,28,13],[29,5,29,10],[29,11,29,13],[29,32,29,35],[30,5,30,10],[30,11,30,13],[30,31,32,35],[31,5,31,10],[31,11,31,13],[32,5,32,10],[32,11,32,13],[33,5,33,10],[33,11,33,13],[34,5,34,10],[34,11,34,13]]}
[{"$nulls":5},{"$f":"UPPER(IF(L8=1,\"Document-type hors ligne pour l'evaluation des centrales d'achat & distribution\",\"Standard offline tool for the evaluation of Procurement & distribution agency\"))","v":"DOCUMENT-TYPE HORS LIGNE POUR L'EVALUATION DES CENTRALES D'ACHAT & DISTRIBUTION"}]
[{"$nulls":31},{"$f":"IF(L8=1,\"Cliquer ci-dessous pour acceder\",\"Click below to access\")","v":"Cliquer ci-dessous pour acceder"}]
[{"$nulls":31},""]
[]
[null,null,"DOCUMENT-TYPE HORS LIGNE POUR EVALUATION DES CAPACITES DES SRS DU SECTEUR PUBLIC","STANDARD OFFLINE TOOL FOR PUBLIC SRS CAPACITY EVALUATION",{"$nulls":27},{"$f":"UPPER(IF(L8=1,\"Modules Evaluation\",\"Evaluation Modules\"))","v":"MODULES EVALUATION"}]
[{"$nulls":4},"Liste"]
[null,null,"Francais",1]
[null,null,"Anglais",2,{"$nulls":5},{"$f":"UPPER(IF(L8=1,C19,D19))","v":"LANGUE:"},"Francais",{"$f":"IF(K8=\"Francais\",1,2)","v":1}]
{"$rows_left_out":179}
{"sheet":"1-Reception & Dedouanement","index":1,"n_rows":19,"n_cols":9,"rows_kept":19,"merged":[[0,0,0,5]]}
[{"$f":"UPPER(IF(Setup!L8=1,\"1-Reception & dedouanement\",\"1-reception & customs\"))","v":"1-RECEPTION & DEDOUANEMENT"}]
[]
[]
[{"$f":"UPPER(IF(Setup!L8=1,\"1-Reception & dedouanement\",\"1-reception & customs\"))","v":"1-RECEPTION & DEDOUANEMENT"},{"$f":"UPPER(IF(Setup!L8=1,\"Source/Details\",\"Source/Details\"))","v":"SOURCE/DETAILS"},{"$f":"UPPER(IF(Setup!L8=1,\"Reponse\",\"Response\"))","v":"REPONSE"},{"$f":"IFERROR(SUM(D6:D11)/E4,\"\")","v":""},{"$f":"SUM(E6:E11)","v":0},{"$f":"UPPER(IF(Setup!L8=1,\"Observations/commentaires\",\"Notes/commentaries\"))","v":"OBSERVATIONS/COMMENTAIRES"}]
[]
["1.1-le Délai entre l'arrivée des produits à l'aérport et fla in dédouanement / arrivée des produits à la centrale d’achat et de stockage est-il adequat ?","Voir délais sur 12 ders mois","Select",{"$f":"IF(C6=\"Select\",\"\",IF(VLOOKUP(C6,Calc!$C$34:$D$39,2,FALSE)=\"\",\"\",VLOOKUP(C6,Calc!$C$34:$D$39,2,FALSE)))","v":""},{"$f":"IF(OR(C6=\"Select\",OR(C6=\"Non/Not applicable\")),0,1)","v":0}]
["1.2-Existe-t-il un outil permettant de mesurer la performance de la centrale d’achat et de stockage en matière de dédouanement des produits (date d'arrivée à l'aéroport, date de livraison dans les entrepôts CAMEG, date de réception provisoire)?","Voir outil","Select",{"$f":"IF(C7=\"Select\",\"\",IF(VLOOKUP(C7,Calc!$C$34:$D$39,2,FALSE)=\"\",\"\",VLOOKUP(C7,Calc!$C$34:$D$39,2,FALSE)))","v":""},{"$f":"IF(OR(C7=\"Select\",OR(C7=\"Non/Not applicable\")),0,1)","v":0}]
["1.3- Y a-t-il une réception provisoire (avec mise en quarantaine) puis une réception définitive, avec des délais  satisfaisants ?","Voir bons réception provisoire et bons réception définitive","Select",{"$f":"IF(C8=\"Select\",\"\",IF(VLOOKUP(C8,Calc!$C$34:$D$39,2,FALSE)=\"\",\"\",VLOOKUP(C8,Calc!$C$34:$D$39,2,FALSE)))","v":""},0]
{"$rows_left_out":12}
{"sheet":"2-Stockage & Gestion","index":2,"n_rows":32,"n_cols":9,"rows_kept":32,"merged":[[0,0,0,6]]}
[{"$f":"UPPER(IF(Setup!L8=1,\"2-Stokage & Gestion\",\"2-storage and management\"))","v":"2-STOKAGE & GESTION"}]
[]
[null,{"$f":"UPPER(IF(Setup!L8=1,\"2.1-Stokage\",\"2.1-Storage\"))","v":"2.1-STOKAGE"},{"$f":"UPPER(IF(Setup!L8=1,\"Source/Details\",\"Source/Details\"))","v":"SOURCE/DETAILS"},{"$f":"UPPER(IF(Setup!L8=1,\"Reponse\",\"Response\"))","v":"REPONSE"},{"$f":"IFERROR(SUM(E5:E18)/F3,\"\")","v":""},{"$f":"SUM(F5:F18)","v":0},{"$f":"UPPER(IF(Setup!L8=1,\"Observations\",\"Notes\"))","v":"OBSERVATIONS"}]
[null,"Tous les produits de la subvention sont-ils stockés à  la centrale d’achat et de stockage?","Quels intrants encore stockés au niveaus PRs ou Programmes?","Select",{"$f":"IF(D4=\"Select\",\"\",IF(VLOOKUP(D4,Calc!$C$34:$D$39,2,FALSE)=\"\",\"\",VLOOKUP(D4,Calc!$C$34:$D$39,2,FALSE)))","v":""},{"$f":"IF(OR(D4=\"Select\",OR(D4=\"Non/Not applicable\")),0,1)","v":0},null,"Select"]
[null,"Des procédures pour le stockage et la gestion de stock sont-elles disponibles?","Visite entrepôts centraux (médicaments, réactifs, TDRs, préservatifs), Voir fiches température sur 12 ders mois","Select",{"$f":"IF(D5=\"Select\",\"\",IF(VLOOKUP(D5,Calc!$C$34:$D$39,2,FALSE)=\"\",\"\",VLOOKUP(D5,Calc!$C$34:$D$39,2,FALSE)))","v":""},{"$f":"IF(OR(D5=\"Select\",OR(D5=\"Non/Not applicable\")),0,1)","v":0},null,"Oui, satisfaisant",1]
[null,"L'espace de stockage est-il suffisant pour permettre un entreposage ordonné?","Veirifier l'etta du magasin et la situation de rangement des colis dans les enttrepots","Select",{"$f":"IF(D6=\"Select\",\"\",IF(VLOOKUP(D6,Calc!$C$34:$D$39,2,FALSE)=\"\",\"\",VLOOKUP(D6,Calc!$C$34:$D$39,2,FALSE)))","v":""},{"$f":"IF(OR(D6=\"Select\",OR(D6=\"Non/Not applicable\")),0,1)","v":0},null,"En partie,Peu satisfaisant",0.5]
[null,"L’entrepôt ou le magasin sont-ils nettoyes et desinfectes regulierement?\n","Verifier de visu l'etat de proprete des locaux et les alentours","Select",{"$f":"IF(D7=\"Select\",\"\",IF(VLOOKUP(D7,Calc!$C$34:$D$39,2,FALSE)=\"\",\"\",VLOOKUP(D7,Calc!$C$34:$D$39,2,FALSE)))","v":""},0,null,"En partie,tres peu satisfaisant",0.25]
[null,"Entreposez-vous les produits dans un local sans humidité, bien éclairé et bien ventilé, à l’abri d’une exposition directe aux rayons du soleil?",null,"Select",{"$f":"IF(D8=\"Select\",\"\",IF(VLOOKUP(D8,Calc!$C$34:$D$39,2,FALSE)=\"\",\"\",VLOOKUP(D8,Calc!$C$34:$D$39,2,FALSE)))","v":""},0,null,"Non",0]
{"$rows_left_out":25}
{"sheet":"3-Distribution","index":3,"n_rows":22,"n_cols":24,"rows_kept":22,"merged":[[0,0,0,6]]}
[{"$f":"UPPER(IF(Setup!L8=1,\"3-Distribution\",\"3-Distribution\"))","v":"3-DISTRIBUTION"},{"$nulls":22},"Select"]
[]
[null,{"$f":"UPPER(\"3.1- Procedures et dispositifs\")","v":"3.1- PROCEDURES ET DISPOSITIFS"},{"$f":"UPPER(IF(Setup!L8=1,\"Source/Details\",\"Source/Details\"))","v":"SOURCE/DETAILS"},{"$f":"UPPER(IF(Setup!L8=1,\"Reponse\",\"Response\"))","v":"REPONSE"},{"$f":"IF((SUM(E4:E10))=0,\"\",SUM(E4:E10))","v":""},{"$f":"SUM(F4:F10)","v":0},{"$f":"UPPER(IF(Setup!L8=1,\"Observations\",\"Notes\"))","v":"OBSERVATIONS"}]
[null,"Existe t-il des procédures pour la distribution?",null,"Select",{"$f":"IF(VLOOKUP(D4,$H$4:$I$9,2,FALSE)=\"\",\"\",VLOOKUP(D4,$H$4:$I$9,2,FALSE))","v":""},{"$f":"IF(OR(D4=\"Select\",OR(D4=\"Non/Not applicable\")),0,1)","v":0},null,"Select"]
[null,"Existe t-il des procédures pour les distributions d'urgence?",null,"Select","",{"$f":"IF(OR(D5=\"Select\",OR(D5=\"Non/Not applicable\")),0,1)","v":0},null,"Oui, satisfaisant",1]
[null,"Les plans de distribution sont-ils transmis régulièrement par les PRs? A quelle fréquence?","Voir plans de distribution fournis par les PRs sur 12 ders mois","Select","",0,null,"En partie,Peu satisfaisant",0.5]
[null,"Des planning de distribution détaillés ont-ils été élaborés?","Voir planning distribution","Select","",0,null,"En partie,tres peu satisfaisant",0.25]
[null,"Les distributions faites par la Centrale d'achat/stockage sont-elles faites en accord avec les plans de distribution?","Voir bons de distribution sur 2 trimestres versus plans distribution","Select","",0,null,"Non",0]
{"$rows_left_out":15}
{"sheet":"4-Rapportage & SIGL","index":4,"n_rows":15,"n_cols":25,"rows_kept":15,"merged":[[0,0,0,7]]}
[{"$f":"UPPER(IF(Setup!L8=1,\"4-Rapportage et SGIL\",\"4-Reports & LMIS\"))","v":"4-RAPPORTAGE ET SGIL"},{"$nulls":23},"Select"]
[]
[null,"4.1- SIGL",{"$f":"UPPER(IF(Setup!L8=1,\"Source/Details\",\"Source/Details\"))","v":"SOURCE/DETAILS"},{"$f":"UPPER(IF(Setup!L8=1,\"Reponse\",\"Response\"))","v":"REPONSE"},{"$f":"IF((SUM(E4:E7))=0,\"\",SUM(E4:E7))","v":""},{"$f":"SUM(F4:F7)","v":0},{"$f":"UPPER(IF(Setup!L8=1,\"Observations\",\"Notes\"))","v":"OBSERVATIONS"},"Select"]
[null,"Les donnees rapportées par les services déconcentrés  de la centrale(region/procince/..) contiennent -elles les informations necessaires (qu. distribuées, CMM, niveaux de stock…)?","Voir rapports agences régionales au niveau central","Select",{"$f":"IF(D4=\"Select\",\"\",IF(VLOOKUP(D4,Calc!$C$34:$D$39,2,FALSE)=\"\",\"\",VLOOKUP(D4,Calc!$C$34:$D$39,2,FALSE)))","v":""},{"$f":"IF(OR(D4=\"Select\",OR(D4=\"Non/Not applicable\")),0,1)","v":0},null,"Oui, satisfaisant",1]
[null,"Constatez vous souvent des ecarts entre stocks reels et stocks dans les logiciels?",null,"Select",{"$f":"IF(D5=\"Select\",\"\",IF(VLOOKUP(D5,Calc!$C$34:$D$39,2,FALSE)=\"\",\"\",VLOOKUP(D5,Calc!$C$34:$D$39,2,FALSE)))","v":""},{"$f":"IF(OR(D5=\"Select\",OR(D5=\"Non/Not applicable\")),0,1)","v":0},null,"En partie,Peu satisfaisant",0.5]
[null,"Les données de distribution sont-elles compilées par la Centrale d'achat et de stockage? Par les agences?","Voir outil de compilation / données compilées","Select",{"$f":"IF(D6=\"Select\",\"\",IF(VLOOKUP(D6,Calc!$C$34:$D$39,2,FALSE)=\"\",\"\",VLOOKUP(D6,Calc!$C$34:$D$39,2,FALSE)))","v":""},{"$f":"IF(OR(D6=\"Select\",OR(D6=\"Non/Not applicable\")),0,1)","v":0},null,"En partie,tres peu satisfaisant",0.25]
[null,"Le SIGL fonctionne t-il de maniere optimale (en recevant, enregistrant, traitant et avertissant des evenements/incidents)?",null,"Select",{"$f":"IF(D7=\"Select\",\"\",IF(VLOOKUP(D7,Calc!$C$34:$D$39,2,FALSE)=\"\",\"\",VLOOKUP(D7,Calc!$C$34:$D$39,2,FALSE)))","v":""},{"$f":"IF(OR(D7=\"Select\",OR(D7=\"Non/Not applicable\")),0,1)","v":0},null,"Non",0]
[null,"4.2- Rapportage",{"$f":"UPPER(IF(Setup!L8=1,\"Source/Details\",\"Source/Details\"))","v":"SOURCE/DETAILS"},{"$f":"UPPER(IF(Setup!L8=1,\"Reponse\",\"Response\"))","v":"REPONSE"},{"$f":"IF((SUM(E9:E15))=0,\"\",SUM(E9:E15))","v":""},{"$f":"SUM(F9:F15)","v":0},{"$f":"UPPER(IF(Setup!L8=1,\"Observations\",\"Notes\"))","v":"OBSERVATIONS"},"Non applicable"]
{"$rows_left_out":8}
{"sheet":"5-Controle qualite & Paiement","index":5,"n_rows":11,"n_cols":25,"rows_kept":11,"merged":[[0,0,0,7]]}
[{"$f":"UPPER(IF(Setup!L8=1,\"5-Controle qualite & Paiement\",\"5-Quality control & Clearence\"))","v":"5-CONTROLE QUALITE & PAIEMENT"},{"$nulls":23},"Select"]
[]
[null,"5.1- Contrôle Qualité",{"$f":"UPPER(IF(Setup!L8=1,\"Source/Details\",\"Source/Details\"))","v":"SOURCE/DETAILS"},{"$f":"UPPER(IF(Setup!L8=1,\"Reponse\",\"Response\"))","v":"REPONSE"},{"$f":"IF(SUM(E4:E7)=0,\"\",SUM(E4:E7))","v":""},{"$f":"SUM(F4:F7)","v":0},{"$f":"UPPER(IF(Setup!L8=1,\"Observations\",\"Notes\"))","v":"OBSERVATIONS"},"Select"]
[null,"La Centrale d'achat/stockage dispose-t-elle de procédures pour le contrôle de qualité prémarketing (allant du prélèvement jusqu'à la réception et transmission des résultats aux PRs). Cette procédure est-elle appliquée?","Voir procédure","Select",{"$f":"IF(D4=\"Select\",\"\",IF(VLOOKUP(D4,Calc!$C$34:$D$39,2,FALSE)=\"\",\"\",VLOOKUP(D4,Calc!$C$34:$D$39,2,FALSE)))","v":""},{"$f":"IF(OR(D4=\"Select\",OR(D4=\"Non/Not applicable\")),0,1)","v":0},null,"Oui, satisfaisant",1]
[null,"Des contrôle qualité ont-ils été réalisés dans le cadre de la précédente convention?","Voir résultats tests CQ","Select",{"$f":"IF(D5=\"Select\",\"\",IF(VLOOKUP(D5,Calc!$C$34:$D$39,2,FALSE)=\"\",\"\",VLOOKUP(D5,Calc!$C$34:$D$39,2,FALSE)))","v":""},{"$f":"IF(OR(D5=\"Select\",OR(D5=\"Non/Not applicable\")),0,1)","v":0},null,"En partie,Peu satisfaisant",0.5]
[null,"Un laboratoire conforme aux exigences FM a-t-il été sélectionné? Si oui selon quelle procédure?","Voir processus sélection labo","Select",{"$f":"IF(D6=\"Select\",\"\",IF(VLOOKUP(D6,Calc!$C$34:$D$39,2,FALSE)=\"\",\"\",VLOOKUP(D6,Calc!$C$34:$D$39,2,FALSE)))","v":""},0,null,"En partie,tres peu satisfaisant",0.25]
[null,"Les documents de qualité ont-ils été transmis aux PRs (certificats d'analyse fournisseurs, fiche de notification CQ prémarketing, résultats tests CQ)?",null,"Select",{"$f":"IF(D7=\"Select\",\"\",IF(VLOOKUP(D7,Calc!$C$34:$D$39,2,FALSE)=\"\",\"\",VLOOKUP(D7,Calc!$C$34:$D$39,2,FALSE)))","v":""},0,null,"Non",0]
[null,"5.2- Modalités de paiement",{"$f":"UPPER(IF(Setup!L8=1,\"Source/Details\",\"Source/Details\"))","v":"SOURCE/DETAILS"},{"$f":"UPPER(IF(Setup!L8=1,\"Reponse\",\"Response\"))","v":"REPONSE"},{"$f":"IF(SUM(E9:E11)=0,\"\",SUM(E9:E11))","v":""},{"$f":"SUM(F9:F11)","v":0},{"$f":"UPPER(IF(Setup!L8=1,\"Observations\",\"Notes\"))","v":"OBSERVATIONS"},"Non applicable"]
{"$rows_left_out":4}
{"sheet":"6-Normes stockage","index":6,"n_rows":37,"n_cols":9,"rows_kept":37,"merged":[[0,0,0,7]]}
[{"$f":"UPPER(IF(Setup!L8=1,\"normes de stockage\",\"storage standards\"))","v":"NORMES DE STOCKAGE"}]
[]
[null,"6.1 Sécurité incendie",{"$f":"UPPER(IF(Setup!L22=1,\"Source/Details\",\"Source/Details\"))","v":"SOURCE/DETAILS"},{"$f":"UPPER(IF(Setup!L22=1,\"Reponse\",\"Response\"))","v":"RESPONSE"},{"$f":"IF(SUM(E4:E14)=0,\"\",SUM(E4:E14))","v":""},{"$f":"SUM(F4:F14)","v":0},{"$f":"'5-Controle qualite & Paiement'!I3","v":0}]
["6.1.1","Il existe un document de politique et de procedures de lutte contre les incendies","Demander à voir le document (existence, ventilation/ diffusion)","Select",{"$f":"IF(D4=\"Select\",\"\",IF(VLOOKUP(D4,Calc!$C$34:$D$39,2,FALSE)=\"\",\"\",VLOOKUP(D4,Calc!$C$34:$D$39,2,FALSE)))","v":""},{"$f":"IF(OR(D4=\"Select\",OR(D4=\"Non/Not applicable\")),0,1)","v":0}]
["6.1.2","Il existe un point focal lutte contre les incendies ","Voire l'acte de nomination/ désignation","Select",{"$f":"IF(D5=\"Select\",\"\",IF(VLOOKUP(D5,Calc!$C$34:$D$39,2,FALSE)=\"\",\"\",VLOOKUP(D5,Calc!$C$34:$D$39,2,FALSE)))","v":""},{"$f":"IF(OR(D5=\"Select\",OR(D5=\"Non/Not applicable\")),0,1)","v":0}]
["6.1.3","Le personnel de la Centrale d'achat a été formé aux techniques de lutte anti-incendie (procédures, utilisation du matériel, documentation)","Vérifier si des exercices sont régulièrement conduits","Select",{"$f":"IF(D6=\"Select\",\"\",IF(VLOOKUP(D6,Calc!$C$34:$D$39,2,FALSE)=\"\",\"\",VLOOKUP(D6,Calc!$C$34:$D$39,2,FALSE)))","v":""},{"$f":"IF(OR(D6=\"Select\",OR(D6=\"Non/Not applicable\")),0,1)","v":0}]
["6.1.4","Le personnel de la société de gardiennage ont été formés à  la lutte anti-incendie (procédures, utilisation du matériel, documentation)","Vérifier si des exercices sont régulièrement conduits","Select",{"$f":"IF(D7=\"Select\",\"\",IF(VLOOKUP(D7,Calc!$C$34:$D$39,2,FALSE)=\"\",\"\",VLOOKUP(D7,Calc!$C$34:$D$39,2,FALSE)))","v":""},0]
["6.1.5","Il existe des dispositifs sonore d'alerte anti-incendie fonctionnels","Vérifier que les dispoitifs sont sonores et sont autonomes et non branchés au courant électrique","Select",{"$f":"IF(D8=\"Select\",\"\",IF(VLOOKUP(D8,Calc!$C$34:$D$39,2,FALSE)=\"\",\"\",VLOOKUP(D8,Calc!$C$34:$D$39,2,FALSE)))","v":""},0]
{"$rows_left_out":30}
{"sheet":"Calc","index":7,"n_rows":71,"n_cols":20,"rows_kept":71,"hidden":true}
[]
["Recapitulatif"]
["1. Recepetion & Dedouanement",{"$nulls":18},"somme"]
[null,null,"1. Arrivee des produits",{"$f":"T4","v":""},{"$f":"IFERROR(D4*20/('1-Reception & Dedouanement'!E6+'1-Reception & Dedouanement'!E8),\"\")","v":""},{"$f":"'1-Reception & Dedouanement'!D6","v":""},{"$f":"'1-Reception & Dedouanement'!D8","v":""},{"$nulls":12},{"$f":"IF(AND(F4=\"\",AND(G4=\"\")),\"\",SUM(F4:S4))","v":""}]
[null,null,"2. Dedouanement des produits",{"$f":"T5","v":""},{"$f":"IFERROR(D5*20/('1-Reception & Dedouanement'!E7+'1-Reception & Dedouanement'!E10),\"\")","v":""},{"$f":"'1-Reception & Dedouanement'!D7","v":""},{"$f":"'1-Reception & Dedouanement'!D10","v":""},{"$nulls":12},{"$f":"IF(AND(F5=\"\",AND(G5=\"\")),\"\",SUM(F5:S5))","v":""}]
[null,null,"3. Suivi et conformite","",{"$f":"IFERROR(D6*20/('1-Reception & Dedouanement'!E11+'1-Reception & Dedouanement'!E9),\"\")","v":""},{"$f":"'1-Reception & Dedouanement'!D11","v":""},{"$f":"'1-Reception & Dedouanement'!D9","v":""},{"$nulls":12},{"$f":"IF(AND(F6=\"\",AND(G6=\"\")),\"\",SUM(F6:S6))","v":""}]
["2. Stockage et gestion"]
[null,null,"procedures de stockage",{"$f":"T8","v":""},{"$f":"IFERROR((D8*20/('2-Stockage & Gestion'!F4+'2-Stockage & Gestion'!F5)),\"\")","v":""},"b3-4",{"$f":"'2-Stockage & Gestion'!E4","v":""},{"$f":"'2-Stockage & Gestion'!E5","v":""},{"$nulls":11},{"$f":"IF(AND(H8=\"\",AND(G8=\"\")),\"\",SUM(G8:S8))","v":""}]
{"$rows_left_out":64}
{"sheet":"Orientations","index":8,"n_rows":30,"n_cols":18,"rows_kept":30,"merged":[[0,0,0,10],[2,0,2,1],[2,6,2,7],[6,6,6,7],[9,0,9,1],[10,6,10,7],[14,6,14,7],[16,0,16,1],[17,6,17,7],[20,6,20,7],[21,0,21,1],[25,0,25,1],[26,6,26,7]]}
[{"$f":"UPPER(IF(Setup!L8=1,\"Orientations pour le plan d'amelioration\",\"orientations for the improvement actions plan\"))","v":"ORIENTATIONS POUR LE PLAN D'AMELIORATION"}]
[]
["1-Conditions de reception et de deduanement",null,"Notes","Quest","Notes pond",null,"3-Distribution des produits",null,"Notes","Quest","Notes pond",null,null,{"$f":"A3","v":"1-Conditions de reception et de deduanement"}]
[null,"Arrivee des produits a l'aeroport",{"$f":"'1-Reception & Dedouanement'!D6","v":""},5,{"$f":"IFERROR(C4*20/1,\"\")","v":""},null,null,"Procedures et dispositifs",{"$f":"'3-Distribution'!E3","v":""},"e2",{"$f":"IFERROR(I4*20/1,\"\")","v":""},null,null,{"$f":"A10","v":"2.1-Stockage des produits"}]
[null,"Performance en matiere de reception/dedouanement",{"$f":"'1-Reception & Dedouanement'!D7","v":""},6,"",null,null,"Conditions de transport lors de la distribution",{"$f":"'3-Distribution'!E11","v":""},"e10",{"$f":"IFERROR(I5*20/1,\"\")","v":""},null,null,{"$f":"A17","v":"2.2--Gestion des produits"}]
[null,"Reception provisoire",{"$f":"'1-Reception & Dedouanement'!D8","v":""},7,"",null,null,"Enregistrement des livraisons",{"$f":"'3-Distribution'!E17","v":""},"e16",{"$f":"IFERROR(I6*20/1,\"\")","v":""},null,null,{"$f":"G3","v":"3-Distribution des produits"}]
[null,"Conformite des produits recus",{"$f":"'1-Reception & Dedouanement'!D9","v":""},8,"",null,"4-1-SIGL",{"$nulls":6},{"$f":"G7","v":"4-1-SIGL"}]
[null,"Suivi des receptions des produits PPM",{"$f":"'1-Reception & Dedouanement'!D10","v":""},9,"",null,null,"Completude des informations",{"$f":"'4-Rapportage & SIGL'!E4","v":""},4,{"$f":"IFERROR(I8*20/1,\"\")","v":""},null,null,{"$f":"G11","v":"4.2- Stockage"}]
{"$rows_left_out":23}
{"sheet":"Dashboard","index":9,"n_rows":82,"n_cols":11,"rows_kept":82,"merged":[[0,0,0,12],[16,6,17,9],[16,10,17,10],[18,6,18,12],[33,6,33,12]]}
[{"$f":"UPPER(IF(Setup!L8=1,\"tableau de bord\",\"dashboard\"))","v":"TABLEAU DE BORD"}]
{"$rows_empty":14}
["Situation des principaux aspects de l'evaluation"]
[{"$nulls":6},"NIVEAU GLOBAL DU RISQUE",{"$nulls":3},{"$f":"IF(F44>=0.9,\"Faible\",IF(F44<0.59,\"Elevé\",IF(0.9<F44>0.59,\"Moyen\")))","v":"Moyen"}]
[]
["A-Reception & dedouanement",{"$nulls":4},"Score","Global"]
["1. Arrivee des produits",{"$nulls":4},{"$f":"IFERROR(Calc!E4,\"\")","v":""}]
["2. Dedouanement des produits",{"$nulls":4},{"$f":"IFERROR(Calc!E5,\"\")","v":""}]
{"$rows_left_out":54}
{"sheet":"Questionnaire","index":10,"n_rows":49,"n_cols":7,"rows_kept":49,"hidden":true,"merged":[[2,2,7,2],[2,3,7,3],[9,2,12,2],[9,3,11,3],[14,2,21,2],[14,3,21,3],[23,2,27,2],[23,3,27,3],[29,2,30,2],[29,3,30,3],[33,2,38,2],[33,3,38,3],[41,2,44,2],[41,3,44,3],[46,2,48,2],[46,3,48,3]]}
["Questions","Visites / Docs à collecter (CAMEG)","Grille complémentaire","Indicateur clé"]
["1. Réception/Dédouanement"]
["Délai entre arrivée des produits à l'aérport et fin dédouanement / arrivée des produits à la CAMEG ?","Voir délais sur 12 ders mois",null,"Dédouanement: Nombre moyen de jour entre l'arrivée à l'aéroport et la date du dédouanement"]
["Existe-t-il un outil permettant de mesurer la performance de la CAMEG en matière de dédouanement des produits (date d'arrivée à l'aéroport, date de livraison dans les entrepôts CAMEG, date de réception provisoire)?","Voir outil"]
["Y a-t-il une réception provisoire (avec mise en quarantaine) puis une réception définitive? Délais à chaque étape?","Voir bons réception provisoire et bons réception définitive"]
["Y a-t-il eu des cas de non conformité? Si oui qu'est-ce qui a été fait?"]
["Le document de suivi des réceptions du PPM a-t-il été rempli?","Voir documents de suivi de réception du PPM sur 12 ders mois"]
["La liste des produits réceptionnés (avec numéro de lot, péremption, quantité) a-t-elle été transmise au PR après chaque réception?"]
{"$rows_left_out":42}
{"sheet":"Feuil1","index":11,"n_rows":49,"n_cols":2,"rows_kept":49,"hidden":true}
["Questions PRs","Observations PRs"]
[]
[]
["Existe-t-il un outil permettant de mesurer la performance de la CAMEG en matière de dédouanement?"]
[]
[]
["Les documents de suivi de réception des produits PPM ont-ils été reçus sur les 12 derniers mois?"]
{"$rows_empty":8}
{"$rows_left_out":19}
{"sheet":"Plan_Actions","index":12,"n_rows":100,"n_cols":28,"rows_kept":100,"merged":[[0,0,0,15],[2,0,3,0],[2,1,3,1],[2,3,3,3],[2,4,3,5],[2,6,3,6],[2,7,3,7],[2,8,2,11],[2,12,2,15],[4,4,4,5],[5,4,5,5],[6,4,6,5],[7,4,7,5],[8,4,8,5],[9,4,9,5],[10,4,10,5],[11,4,11,5],[12,4,12,5],[13,4,13,5],[14,4,14,5],[15,4,15,5],[16,4,16,5],[17,4,17,5],[18,4,18,5],[19,4,19,5],[20,4,20,5],[21,4,21,5],[22,4,22,5],[23,4,23,5],[24,4,24,5],[54,4,54,5],[74,4,74,5]]}
[{"$f":"UPPER(IF(Setup!L8=1,\"plan d'amelioration\",\"improvement actions plan\"))","v":"PLAN D'AMELIORATION"}]
[{"$nulls":17},"Select"]
["N°","Domaine d'evaluation",null,"Types d'action","Mésures de prévention ou d'attenuation",null,"Responsible mise en oeuvre","Partenaires de realisation","Select \"année\"",{"$nulls":3},"Select \"année\"",{"$nulls":4},"1-Conditions de reception et de deduanement",1,1,{"$f":"R3","v":"1-Conditions de reception et de deduanement"},{"$f":"R4","v":"2.1-Stockage des produits"},{"$f":"R5","v":"2.2--Gestion des produits"},{"$f":"R6","v":"3-Distribution des produits"},{"$f":"R7","v":"4-1-SIGL"},{"$f":"R8","v":"4.2- Stockage"},{"$f":"R9","v":"5.1- Controle qualite"},{"$f":"R10","v":"5.2- Modalites de paiement"}]
[{"$nulls":8},"T1","T2","T3","T4","T1","T2","T3","T4",null,"2.1-Stockage des produits",2,2,"Arrivee des produits a l'aeroport","Qualite du stockage","Systeme de gestion","Procedures et dispositifs","Completude des informations","Canevas de rapportage","Procedures de controle qualite","Emission des paiements"]
[1,"Select",{"$f":"IF(VLOOKUP(B5,$R$2:$S$10,2,FALSE)=\"\",\"\",VLOOKUP(B5,$R$2:$S$10,2,FALSE))","v":""},"Select",{"$nulls":4},"Select","Select","Select","Select","Select","Select","Select","Select",null,"2.2--Gestion des produits",3,3,"Performance en matiere de reception/dedouanement","Thermometre","Gestion des mouvements","Conditions de transport lors de la distribution","Gestion des ecarts d'information","Transmission des etats de stocks aux PRs","Realisation du controle qualite","Justificatifs des paiements"]
[2,"Select",{"$f":"IF(VLOOKUP(B6,$R$2:$S$10,2,FALSE)=\"\",\"\",VLOOKUP(B6,$R$2:$S$10,2,FALSE))","v":""},"Select",{"$nulls":4},"Select","Select","Select","Select","Select","Select","Select","Select",null,"3-Distribution des produits",4,4,"Reception provisoire","Mesures anti-incendie","Inventaires","Enregistrement des livraisons","Fonctionnement du SIGL","Inventaire et gestion des peremptions"]
[3,"Select","","Select",{"$nulls":4},"Select","Select","Select","Select","Select","Select","Select","Select",null,"4-1-SIGL",5,5,"Conformite des produits recus","lieu et qualite de rangement/entreposage","Outils de gestion"]
[4,"Select","","Select",{"$nulls":4},"Select","Select","Select","Select","Select","Select","Select","Select",null,"4.2- Stockage",6,6,"Suivi des receptions des produits PPM","Gestion des produits perimes"]
{"$rows_left_out":92}