{"text_format":"3","workbook":"xlsx","n_sheets":11,"sheets":["Setup","1_Epid-SuiviEval","2_SocEcoParticipation","3_Politiques","4_Programme","5_Coordination","6_Eval-CSN","Dashboard","Calc","Orientations","Priorites"],"not_rendered":{"charts":1,"images":1,"macros":1,"external_links":1},"read":"whole","date_system":"1900"}

{"sheet":"Setup","index":0,"n_rows":186,"n_cols":35,"rows_kept":186,"merged":[[0,5,1,20],[1,31,1,35],[2,31,2,35],[4,31,4,36],[10,11,11,14],[12,10,12,12],[17,6,17,7],[17,31,17,35],[19,11,19,13],[20,5,20,10],[20,11,20,13],[21,5,21,10],[21,11,21,13],[21,31,21,35],[23,5,23,10],[23,11,23,13],[24,5,24,10],[24,11,24,13],[25,5,25,10],[25,11,25,13],[26,5,26,10],[26,11,26,13],[27,5,27,10],[27,11,27,13],[28,5,28,10],[28,11,28,13],[29,5,29,10],[29,11,29,13],[29,32,29,35],[30,5,30,10],[30,11,30,13],[30,31,32,35],[31,5,31,10],[31,11,31,13],[32,5,32,10],[32,11,32,13],[33,5,33,10],[33,11,33,13],[33,31,34,35],[34,5,34,10],[34,11,34,13]]}
[{"$nulls":5},"TEMPLATE D'EVALUATION DE LA PRISE EN COMPTE DU GENRE ET DROITS HUMAINS LES PLANS STRATEGIQUES"]
[{"$nulls":31},{"$f":"IF(L8=1,\"Cliquer ci-dessous pour acceder\",\"Click below to access\")","v":"Cliquer ci-dessous pour acceder"}]
[{"$nulls":31},""]
[]
[null,null,"DOCUMENT-TYPE HORS LIGNE POUR EVALUATION DES CAPACITES DES SRS DU SECTEUR PUBLIC","STANDARD OFFLINE TOOL FOR PUBLIC SRS CAPACITY EVALUATION",{"$nulls":27},{"$f":"UPPER(IF(L8=1,\"Modules Evaluation\",\"Evaluation Modules\"))","v":"MODULES EVALUATION"}]
[{"$nulls":4},"Liste"]
[null,null,"Francais",1]
[null,null,"Anglais",2,{"$nulls":5},{"$f":"UPPER(IF(L8=1,C19,D19))","v":"LANGUE:"},"Francais",{"$f":"IF(K8=\"Francais\",1,2)","v":1}]
[]
[null,null,"<== Il faut s'assurer de mettre a jour la composante si vous changez de langue"]
{"$rows_left_out":177}
{"sheet":"1_Epid-SuiviEval","index":1,"n_rows":52,"n_cols":7,"rows_kept":52,"merged":[[0,0,0,5],[17,1,17,2],[29,1,29,2],[31,0,33,0],[35,0,43,0],[45,0,47,0],[49,0,51,0]]}
["EPIDEMIOLOGIE & SUIVI EVALUATION"]
{"$rows_empty":15}
[null,"QUESTION","REPONSE",null,null,"CONSTATS/EVIDENCES"]
[null,"EPIDEMIOLOGIE",null,{"$f":"IFERROR(SUM(D19:D29)/E18,\"\")","v":""},{"$f":"SUM(G19:G29)","v":0}]
["EP.1","Existe-t-il des données récentes concernant le taux de prévalence du VIH, ventilé par sexe et par âge, chez la population générale ? Si oui, donnez les chiffres; Indiquer l’évolution dans le temps, des données sur la prévalence (ventilées par sexe et âge). ","Sélectionner",{"$f":"VLOOKUP(C19,Calc!$F$19:$G$23,2,FALSE)","v":""},{"$f":"IF(OR(C19=\"Sélectionner\",C19=\"Non applicable\"),0,1)","v":0},null,{"$f":"E19*2","v":0}]
["EP.2","Existe-t-il un  récent taux national d’incidence du VIH, ventilé par sexe et par âge, chez la popula­tion générale ? Si oui, donnez les précisions","Sélectionner",{"$f":"VLOOKUP(C20,Calc!$C$5:$D$9,2,FALSE)","v":""},{"$f":"IF(OR(C20=\"Sélectionner\",C20=\"Non applicable\"),0,1)","v":0},null,{"$f":"E20*2","v":0}]
["EP.3","Des estimations de la taille pour les populations clés existent-elles ? Veuillez fournir les détails","Sélectionner",{"$f":"VLOOKUP(C21,Calc!$C$5:$D$9,2,FALSE)","v":""},0,null,0]
["EP.4","Le taux de prévalence du VIH chez les populations clés existe t-il? Donnez les précisions","Sélectionner",{"$f":"VLOOKUP(C22,Calc!$C$49:$D$53,2,FALSE)","v":""},0,null,0]
["EP.5","Le taux de prévalence du VIH chez les populations clés sont-elles  ventilées par sexe et par âge? Veuillez donner les précisions; Préciser l’évolution dans le temps des taux de prévalence chez les populations clés (ventilés par sexe et par âge). ","Sélectionner",{"$f":"VLOOKUP(C23,Calc!$C$5:$D$9,2,FALSE)","v":""},{"$f":"IF(OR(C23=\"Sélectionner\",C23=\"Non applicable\"),0,1)","v":0},null,0]
["EP.6","Existe-t-il une étude des modes de transmission ? Si oui veuillez donner les modes de transmission du VIH pour les femmes, les filles, les hommes, les garçons et les transgenres ? ","Sélectionner",{"$f":"VLOOKUP(C24,Calc!$C$55:$D$58,2,FALSE)","v":""},{"$f":"IF(OR(C24=\"Sélectionner\",C24=\"Non applicable\"),0,1)","v":0},null,{"$f":"E24*1","v":0}]
{"$rows_left_out":29}
{"sheet":"2_SocEcoParticipation","index":2,"n_rows":30,"n_cols":7,"rows_kept":30,"merged":[[0,0,0,5],[17,1,17,2],[24,1,24,2]]}
["FACTEURS SOCIOECONOMIQUES, CULTURELS & PARICIPATION"]
{"$rows_empty":15}
[null,"QUESTION","REPONSE",null,null,"CONSTATS/EVIDENCES"]
["FECP.1",{"$f":"+UPPER(\"Facteurs sociaux, culturels et économiques\")","v":"FACTEURS SOCIAUX, CULTURELS ET ÉCONOMIQUES"},null,{"$f":"IFERROR(SUM(D19:D24)/E18,\"\")","v":""},{"$f":"SUM(G19:G24)","v":0},{"$f":"IFERROR(D18*é,\"\")","v":""}]
[null,"Quelles sont les normes et les pratiques socio‑culturelles qui peuvent contribuer à accroître le risque de transmission du VIH chez les femmes et les filles, les hommes et les garçons, et les transgenres, sont-elles prises en compte","Sélectionner",{"$f":"VLOOKUP(C19,Calc!$C$5:$D$9,2,FALSE)","v":""},{"$f":"IF(OR(C19=\"Sélectionner\",C19=\"Non applicable\"),0,1)","v":0},null,{"$f":"E19*2","v":0}]
[null,"Les normes et les pratiques socio‑culturelles contribuent‑elles à augmenter le risque de transmission du VIH ? Si oui, de quelle manière?","Sélectionner",{"$f":"VLOOKUP(C20,Calc!$C$5:$D$9,2,FALSE)","v":""},{"$f":"IF(OR(C20=\"Sélectionner\",C20=\"Non applicable\"),0,1)","v":0},null,{"$f":"E20*2","v":0}]
[null,"Certaines normes et pratiques socio‑culturelles contribuent‑elles à accroître le risque de transmission du VIH dans d’autres populations clés ? Si oui, quelles sont ces normes et pratiques ? ","Sélectionner",{"$f":"VLOOKUP(C21,Calc!$C$5:$D$9,2,FALSE)","v":""},0,null,0]
[null,"Les normes et pratiques socioculturelles contribuent‑elles à réduire le risque de transmission du VIH ? ","Sélectionner",{"$f":"VLOOKUP(C22,Calc!$C$5:$D$9,2,FALSE)","v":""},0,null,0]
[null,"Existent-ils des normes et des pratiques socio‑culturelles qui peuvent contribuer à réduire les écarts entre les sexes dans l’un des domaines évoqués (connaissances, utilisation du préservatif, stigmatisation, discrimination, grossesses précoces ou non désirées) ? Si oui lesquelles","Sélectionner",{"$f":"VLOOKUP(C23,Calc!$C$5:$D$9,2,FALSE)","v":""},0,null,0]
[null,"De quelle manière contribuent‑elles à augmenter le risque de transmission du VIH ? ","Sélectionner",{"$f":"VLOOKUP(C24,Calc!$F$11:$G$16,2,FALSE)","v":""},0,null,{"$f":"E24*3","v":0}]
{"$rows_left_out":7}
{"sheet":"3_Politiques","index":3,"n_rows":62,"n_cols":11,"rows_kept":62,"merged":[[0,0,0,6],[18,1,18,2],[19,0,27,0],[28,1,28,2],[29,0,37,0],[39,1,39,2],[40,0,48,0]]}
["EVALUATION DES FACTEURS POLITIQUES ET JURIDIQUES"]
{"$rows_empty":15}
[null,"QUESTION","REPONSE",{"$nulls":3},"CONSTATS/EVIDENCES"]
[null,"FACTEURS POLITIQUES ET JURIDIQUES",null,{"$f":"IFERROR((SUM(I19:I53)/SUM(J19:J53)),\"\")","v":""}]
["FP.1","Existe t il un cadre juridique ou politique pouvant avoir un impact direct sur les femmes et les filles, les hommes et les garçons, et les populations clés en ce qui concerne le VIH/SIDA, ce en s'attaquant aux points suivants:",null,{"$f":"IFERROR(SUM(D20:D28)/F19,\"\")","v":""},{"$f":"IFERROR(F19/F19,\"\")","v":""},{"$f":"SUM(F20:F28)","v":0},{"$f":"IFERROR(E19*2,\"\")","v":""},null,{"$f":"IF(D19=\"\",0,D19)","v":0},{"$f":"IF(D19=\"\",0,1)","v":0}]
[null,"La criminalisation de la transmission ou de l’exposition au VIH, notamment de la transmission verticale (de la mère à l’enfant) (selon la base de données des lois sur les droits humains) ","Sélectionner",{"$f":"VLOOKUP(C20,Calc!$C$5:$D$9,2,FALSE)","v":""},{"$f":"IF(OR(C20=\"Sélectionner\",C20=\"Non applicable\"),0,1)","v":0},{"$f":"E20*2","v":0}]
[null,"La criminalisation de l’orientation sexuelle et/ou de l’identité de genre (selon la base de données des lois sur les droits humains) ","Sélectionner",{"$f":"VLOOKUP(C21,Calc!$C$5:$D$9,2,FALSE)","v":""},{"$f":"IF(OR(C21=\"Sélectionner\",C21=\"Non applicable\"),0,1)","v":0},0]
[null,"La criminalisation de la consommation de drogues (selon la base de données des lois sur les droits humains) ","Sélectionner",{"$f":"VLOOKUP(C22,Calc!$C$5:$D$9,2,FALSE)","v":""},0,0]
[null,"La criminalisation du commerce du sexe (selon la base de données des lois sur les droits humains) ","Sélectionner",{"$f":"VLOOKUP(C23,Calc!$C$5:$D$9,2,FALSE)","v":""},0,0]
[null,"Aux violences ou discrimination basée sur le genre au sein du mariage ","Sélectionner",{"$f":"VLOOKUP(C24,Calc!$C$5:$D$9,2,FALSE)","v":""},0,0]
{"$rows_left_out":39}
{"sheet":"4_Programme","index":4,"n_rows":34,"n_cols":11,"rows_kept":34,"merged":[[0,0,0,6],[18,1,18,2],[21,1,21,2],[22,0,27,0]]}
["EVALUATION DES PROGRAMMES"]
{"$rows_empty":15}
[null,"QUESTION","REPONSE",{"$nulls":3},"CONSTATS/EVIDENCES"]
[null,"PROGRAMME",null,{"$f":"IFERROR(H18/I18,0)","v":{"v":0,"d":"0.0"}},{"$f":"SUM(E19:E34)","v":0},{"$f":"SUM(F23:F34)+F20+F21","v":{"$error":"#VALUE!"}},{"$f":"SUM(G19:G26)","v":0},{"$f":"SUM(H19:H34)","v":{"$error":"#VALUE!"}},{"$f":"SUM(I19:I34)","v":{"$error":"#VALUE!"}},{"$f":"IF(D18=\"\",0,1)","v":1}]
["P.1","Quelles populations les interventions nationales de lutte contre le VIH/SIDA visent elles ? Veuillez ventiler les données par âge, par sexe, par identité de genre ou orientation sexuelle, le cas échéant",null,{"$f":"IFERROR(SUM(D20:D21)/E19,\"\")","v":""},{"$f":"SUM(E20:E21)*2","v":0},{"$f":"IFERROR(D19*2,0)","v":0},null,{"$f":"IF(D19=\"\",0,D19)","v":0},{"$f":"IF(D19=\"\",0,D19)","v":0},0]
[null,"Les interventions nationales de lutte contre le VIH/SIDA incluent‑elles les personnes handicapées ? Si oui, y a‑t‑il des programmes spécifiquement conçus pour les personnes handicapées ? Ces interventions répondent‑elles différemment aux besoins des hommes/garçons et à ceux des femmes/filles ? ","Sélectionner",{"$f":"VLOOKUP(C20,Calc!$F$5:$G$9,2,FALSE)","v":""},{"$f":"IF(OR(C20=\"Sélectionner\",C20=\"Non applicable\"),0,1)","v":0},{"$f":"IF(OR(C20=\"Sélectionner\",D20=\"Non applicable\"),0,1)","v":0}]
[null,"Les interventions nationales de lutte contre le VIH/SIDA incluent‑elles les personnes âgées, en particulier les femmes âgées ","Sélectionner",{"$f":"VLOOKUP(C21,Calc!$F$5:$G$9,2,FALSE)","v":""},{"$f":"IF(OR(C21=\"Sélectionner\",C21=\"Non applicable\"),0,1)","v":0},{"$f":"IF(OR(C21=\"Sélectionner\",D21=\"Non applicable\"),0,1)","v":0}]
["P.2","Les interventions de lutte contre le VIH/SIDA reconnaissent elles, prennent elles en compte et abordent elles les questions de genre liées aux éléments suivants ",null,{"$f":"IFERROR(SUM(D23:D28)/F22,\"\")","v":""},null,{"$f":"SUM(F23:F28)","v":0},{"$f":"IFERROR((SUM(D23:D28)/SUM(F23:F28))*2,\"\")","v":""},{"$f":"IF(D22=\"\",0,D22)","v":0},{"$f":"IF(D22=\"\",0,D22)","v":0},{"$f":"IF(D22=\"\",0,1)","v":0}]
[null,"Spécificités rurales/urbaines ","Sélectionner",{"$f":"VLOOKUP(C23,Calc!$C$5:$D$9,2,FALSE)","v":""},{"$f":"IF(OR(C23=\"Sélectionner\",C23=\"Non applicable\"),0,1)","v":0},{"$f":"IF(OR(C23=\"Sélectionner\",D23=\"Non applicable\"),0,1)*2","v":0}]
[null,"Statut socio‑économique ","Sélectionner",{"$f":"VLOOKUP(C24,Calc!$C$5:$D$9,2,FALSE)","v":""},0,0]
{"$rows_left_out":11}
{"sheet":"5_Coordination","index":5,"n_rows":29,"n_cols":10,"rows_kept":29,"merged":[[0,0,0,6]]}
["COORDINATION & PARTICIPATION"]
{"$rows_empty":15}
[null,"QUESTION","REPONSE",{"$nulls":3},"CONSTATS/EVIDENCES"]
[null,"COORDINATION DES PROGRAMMES GENRE ET DROITS HUMAINS",null,{"$f":"IFERROR(SUM(D19:D24)/E18,\"\")","v":""},{"$f":"SUM(E19:E24)","v":0},{"$f":"SUM(F19:F24)","v":0},null,{"$f":"F18*2","v":0},{"$f":"IF(D18=\"\",0,D18)","v":0},{"$f":"IF(D18=\"\",0,1)","v":0}]
[null,"Existe un groupe genre et VIH","Sélectionner",{"$f":"VLOOKUP(C19,Calc!$F$5:$G$9,2,FALSE)","v":""},{"$f":"IF(OR(C19=\"Sélectionner\",C19=\"Non applicable\"),0,1)*2","v":0},{"$f":"IF(OR(C19=\"Sélectionner\",D19=\"Non applicable\"),0,1)*2","v":0}]
[null,"Ce groupe prend t-il en compte les droits humains","Sélectionner",{"$f":"VLOOKUP(C20,Calc!$F$5:$G$9,2,FALSE)","v":""},0,{"$f":"IF(OR(C20=\"Sélectionner\",D20=\"Non applicable\"),0,1)*2","v":0}]
[null,"Les capacités des membres de ce groupe ont-elles été renforcées","Sélectionner",{"$f":"VLOOKUP(C21,Calc!$C$5:$D$9,2,FALSE)","v":""},0,0]
[null,"Le groupe fonctionne t-il régulièrement","Sélectionner",{"$f":"VLOOKUP(C22,Calc!$C$5:$D$9,2,FALSE)","v":""},0,0]
[null,"Le groupe genre et droits humains produit-il des rapports périodiques?","Sélectionner",{"$f":"VLOOKUP(C23,Calc!$C$5:$D$9,2,FALSE)","v":""},0,0]
[null,"Le groupe genre et droits humainsfait-il une analyse des rapports périodiques sous l'angle du genre et des droits humains,","Sélectionner",{"$f":"VLOOKUP(C24,Calc!$C$5:$D$9,2,FALSE)","v":""},0,0]
{"$rows_left_out":6}
{"sheet":"6_Eval-CSN","index":6,"n_rows":40,"n_cols":10,"rows_kept":40,"merged":[[0,0,0,6],[18,0,24,0],[26,0,38,0]]}
["PLANIFICATION ET MISE EN ŒUVRE"]
{"$rows_empty":15}
[{"$nulls":3},"Prévision dans le CSN",{"$f":"E18*2","v":1.5},null,null,"Niveau de réalisation",{"$f":"I18*2","v":{"$error":"#VALUE!"}}]
["Planification/ realisation concernant les Droits humains, prennent en compte les points suivants ? (prévision du CSN et dans les réalisations)",{"$nulls":3},{"$f":"IFERROR(SUM(E19:E25)/F18,\"\")","v":0.75},{"$f":"SUM(F19:F25)*2","v":4},null,null,{"$f":"IFERROR(SUM(I19:I25)/J18,\"\")","v":""},{"$f":"SUM(J19:J25)*3","v":0}]
[null,"Réduction de la stigmatisation et de la discrimination ",null,"Oui, en partie seulement",{"$f":"VLOOKUP(D19,Calc!$F$26:$G$30,2,FALSE)","v":1},{"$f":"IF(OR(D19=\"Sélectionner\",D19=\"Non applicable\"),0,1)","v":1},null,"Sélectionner",{"$f":"VLOOKUP(H19,Calc!$F$32:$G$37,2,FALSE)","v":""},{"$f":"IF(OR(H19=\"Sélectionner\",H19=\"Non applicable\"),0,1)","v":0}]
[null,"Services juridiques liés au VIH ",null,"Sélectionner",{"$f":"VLOOKUP(D20,Calc!$F$26:$G$30,2,FALSE)","v":""},{"$f":"IF(OR(D20=\"Sélectionner\",D20=\"Non applicable\"),0,1)","v":0},null,"Sélectionner",{"$f":"VLOOKUP(H20,Calc!$F$32:$G$37,2,FALSE)","v":""},{"$f":"IF(OR(H20=\"Sélectionner\",H20=\"Non applicable\"),0,1)","v":0}]
[null,"Contrôle et réforme des lois, règlements et politiques liés au VIH 8",null,"Sélectionner",{"$f":"VLOOKUP(D21,Calc!$F$26:$G$30,2,FALSE)","v":""},0,null,"Sélectionner",{"$f":"VLOOKUP(H21,Calc!$F$32:$G$37,2,FALSE)","v":""},0]
[null,"Education juridique (“connaître ses droits”) ",null,"Sélectionner",{"$f":"VLOOKUP(D22,Calc!$F$26:$G$30,2,FALSE)","v":""},0,null,"Sélectionner",{"$f":"VLOOKUP(H22,Calc!$F$32:$G$37,2,FALSE)","v":""},0]
[null,"Sensibilisation des législateurs et agents des forces de l’ordre ",null,"Sélectionner",{"$f":"VLOOKUP(D23,Calc!$F$26:$G$30,2,FALSE)","v":""},0,null,"Sélectionner",{"$f":"VLOOKUP(H23,Calc!$F$32:$G$37,2,FALSE)","v":""},0]
[null,"Formation des personnels de santé aux droits de l’homme et à l’éthique médicale liée au VIH ",null,"Oui, en intégralité",{"$f":"VLOOKUP(D24,Calc!$F$26:$G$30,2,FALSE)","v":2},1,null,"Sélectionner",{"$f":"VLOOKUP(H24,Calc!$F$32:$G$37,2,FALSE)","v":""},0]
{"$rows_left_out":17}
{"sheet":"Dashboard","index":7,"n_rows":82,"n_cols":16,"rows_kept":82,"merged":[[0,0,0,12]]}
[{"$f":"UPPER(IF([1]Setup!L8=1,\"tableau de bord\",\"dashboard\"))","v":"TABLEAU DE BORD"}]
{"$rows_empty":14}
["Situation des principaux aspects de l'evaluation"]
[]
[]
["A-Epidémiologie et suivi évaluation",{"$nulls":4},"Score"]
["1. Epidémiologie",{"$nulls":4},{"$f":"IFERROR('1_Epid-SuiviEval'!D18,\"\")","v":""},{"$nulls":9},{"$f":"IF(F20=\"\",0,1)","v":0}]
["2. Indicateurs",{"$nulls":4},{"$f":"IFERROR('1_Epid-SuiviEval'!D31,\"\")","v":""},{"$nulls":9},{"$f":"IF(F21=\"\",0,1)","v":0}]
["3. Outils de planification",{"$nulls":4},{"$f":"IFERROR('1_Epid-SuiviEval'!D35,\"\")","v":""},{"$nulls":9},0]
["4. Canevas de rapportage",{"$nulls":4},{"$f":"IFERROR('1_Epid-SuiviEval'!D45,\"\")","v":""},{"$nulls":9},0]
{"$rows_left_out":46}
{"sheet":"Calc","index":8,"n_rows":73,"n_cols":10,"rows_kept":73,"hidden":true}
[]
[]
["Facteurs politiques",{"$nulls":3},"Programme"]
[null,"FP.1",null,null,"P.1"]
[null,null,"Sélectionner",{"$f":"\"\"","v":""},null,"Sélectionner",{"$f":"\"\"","v":""}]
[null,null,"Oui, totalement",2,null,"Oui, totalement",2]
[null,null,"Oui, en partie seulement",1,null,"Oui, en partie seulement",1]
[null,null,"Non",0,null,"Non",0]
[null,null,"Non applicable",null,null,"Non applicable"]
[null,"FP.2",null,null,"P.5"]
{"$rows_left_out":64}
{"sheet":"Orientations","index":9,"n_rows":76,"n_cols":6,"rows_kept":76,"merged":[[0,0,0,12]]}
["ORENTATIONS SUR LES ACTIONS PRIORITAIRES"]
{"$rows_empty":15}
[{"$nulls":5},"ACTIONS PRIORITAIRES"]
["EPIDEMIOLOGIE"]
[null,{"$f":"+'1_Epid-SuiviEval'!B20","v":"Existe-t-il un  récent taux national d’incidence du VIH, ventilé par sexe et par âge, chez la popula­tion générale ? Si oui, donnez les précisions"},{"$f":"+'1_Epid-SuiviEval'!D20","v":""}]
[null,{"$f":"+'1_Epid-SuiviEval'!B21","v":"Des estimations de la taille pour les populations clés existent-elles ? Veuillez fournir les détails"},{"$f":"+'1_Epid-SuiviEval'!D21","v":""}]
[null,{"$f":"+'1_Epid-SuiviEval'!B23","v":"Le taux de prévalence du VIH chez les populations clés sont-elles  ventilées par sexe et par âge? Veuillez donner les précisions; Préciser l’évolution dans le temps des taux de prévalence chez les populations clés (ventilés par sexe et par âge). "},{"$f":"+'1_Epid-SuiviEval'!D22","v":""}]
[null,{"$f":"+'1_Epid-SuiviEval'!B24","v":"Existe-t-il une étude des modes de transmission ? Si oui veuillez donner les modes de transmission du VIH pour les femmes, les filles, les hommes, les garçons et les transgenres ? "},{"$f":"+'1_Epid-SuiviEval'!D24","v":""}]
[null,{"$f":"+'1_Epid-SuiviEval'!B28","v":"Existe-t-il des données disponibles sur la violence conjugale (VC), y compris les violences basées sur le genre ? "},{"$f":"+'1_Epid-SuiviEval'!D28","v":""}]
[null,{"$f":"+'1_Epid-SuiviEval'!B29","v":"Existe-t-il  des données sur la stigmatisation et la discrimination envers les personnes vivant avec le VIH, à travers l’indicateur de la stigmatisation ? données ventilées par sexe et par âge"},{"$f":"+'1_Epid-SuiviEval'!D29","v":""}]
{"$rows_left_out":53}
{"sheet":"Priorites","index":10,"n_rows":56,"n_cols":12,"rows_kept":56,"merged":[[0,0,0,14],[16,2,16,7],[17,2,17,7],[17,8,17,9],[18,2,18,7],[18,8,18,9],[19,2,19,7],[19,8,19,9],[20,2,20,7],[20,8,20,9],[21,2,21,7],[21,8,21,9],[22,2,22,7],[22,8,22,9],[23,2,23,7],[23,8,23,9],[24,2,24,7],[24,8,24,9],[25,2,25,7],[25,8,25,9],[26,2,26,7],[26,8,26,9],[27,2,27,7],[27,8,27,9],[28,2,28,7],[28,8,28,9],[29,2,29,7],[29,8,29,9],[30,2,30,7],[30,8,30,9],[31,2,31,7],[31,8,31,9],[32,2,32,7],[32,8,32,9],[33,2,33,7],[33,8,33,9],[34,2,34,7],[34,8,34,9],[35,2,35,7],[35,8,35,9],[36,2,36,7],[36,8,36,9],[37,2,37,7],[37,8,37,9],[38,2,38,7],[38,8,38,9],[39,2,39,7],[39,8,39,9],[40,2,40,7],[40,8,40,9],[41,2,41,7],[41,8,41,9],[42,2,42,7],[42,8,42,9],[43,2,43,7],[43,8,43,9],[44,2,44,7],[44,8,44,9],[45,2,45,7],[45,8,45,9],[46,2,46,7],[46,8,46,9],[47,2,47,7],[47,8,47,9],[48,2,48,7],[48,8,48,9],[49,2,49,7],[49,8,49,9],[50,2,50,7],[50,8,50,9],[51,2,51,7],[51,8,51,9],[52,2,52,7],[52,8,52,9],[53,2,53,7],[53,8,53,9],[54,2,54,7],[54,8,54,9],[55,2,55,7],[55,8,55,9]]}
["PLAN D'AMELIORATION & PRIORITES"]
{"$rows_empty":15}
["DOMAINES","TYPE","DESCRIPTION",{"$nulls":5},"ACTEURS CONCERNES",null,"PRIORITE","ANNEE"]
["Sélectionner","Sélectionner",{"$nulls":8},"Sélectionner","Sélectionner"]
["Sélectionner","Sélectionner",{"$nulls":8},"Sélectionner","Sélectionner"]
["Sélectionner","Sélectionner",{"$nulls":8},"Sélectionner","Sélectionner"]
["Sélectionner","Sélectionner",{"$nulls":8},"Sélectionner","Sélectionner"]
["Sélectionner","Sélectionner",{"$nulls":8},"Sélectionner","Sélectionner"]
["Sélectionner","Sélectionner",{"$nulls":8},"Sélectionner","Sélectionner"]
["Sélectionner","Sélectionner",{"$nulls":8},"Sélectionner","Sélectionner"]
{"$rows_left_out":32}